You are viewing a plain text version of this content. The canonical link for it is here.
Posted to issues@geode.apache.org by "Jason Huynh (JIRA)" <ji...@apache.org> on 2018/11/06 18:00:00 UTC
[jira] [Commented] (GEODE-5595) CI:
DeltaPropagationDUnit.testBug40165ClientReconnects -
NoSubscriptionServersAvailableException
[ https://issues.apache.org/jira/browse/GEODE-5595?page=com.atlassian.jira.plugin.system.issuetabpanels:comment-tabpanel&focusedCommentId=16677089#comment-16677089 ]
Jason Huynh commented on GEODE-5595:
------------------------------------
We ran into a similar but not exact failure, below is the stack trace from run:
http://files.apachegeode-ci.info/builds/apache-develop-main/1.8.0-build.99/test-results/distributedTest/1541452365/classes/org.apache.geode.cache.client.internal.ClientServerHostNameVerificationDistributedTest.html#expectConnectionFailureWhenNoHostNameInServerKey
{noformat}
java.lang.AssertionError: Suspicious strings were written to the log during this run. Fix the strings or use IgnoredException.addIgnoredException to ignore. ----------------------------------------------------------------------- Found suspect string in log4j at line 1553 javax.net.ssl.SSLProtocolException: Connection reset at org.junit.Assert.fail(Assert.java:88) at org.apache.geode.test.dunit.standalone.DUnitLauncher.closeAndCheckForSuspects(DUnitLauncher.java:412) at org.apache.geode.test.dunit.rules.ClusterStartupRule.after(ClusterStartupRule.java:172) at org.junit.rules.ExternalResource$1.evaluate(ExternalResource.java:50) at org.junit.rules.RunRules.evaluate(RunRules.java:20) at org.junit.runners.ParentRunner.runLeaf(ParentRunner.java:325) at org.junit.runners.BlockJUnit4ClassRunner.runChild(BlockJUnit4ClassRunner.java:78) at org.junit.runners.BlockJUnit4ClassRunner.runChild(BlockJUnit4ClassRunner.java:57) at org.junit.runners.ParentRunner$3.run(ParentRunner.java:290) at org.junit.runners.ParentRunner$1.schedule(ParentRunner.java:71) at org.junit.runners.ParentRunner.runChildren(ParentRunner.java:288) at org.junit.runners.ParentRunner.access$000(ParentRunner.java:58) at org.junit.runners.ParentRunner$2.evaluate(ParentRunner.java:268) at org.junit.runners.ParentRunner.run(ParentRunner.java:363) at org.gradle.api.internal.tasks.testing.junit.JUnitTestClassExecutor.runTestClass(JUnitTestClassExecutor.java:106) at org.gradle.api.internal.tasks.testing.junit.JUnitTestClassExecutor.execute(JUnitTestClassExecutor.java:58) at org.gradle.api.internal.tasks.testing.junit.JUnitTestClassExecutor.execute(JUnitTestClassExecutor.java:38) at org.gradle.api.internal.tasks.testing.junit.AbstractJUnitTestClassProcessor.processTestClass(AbstractJUnitTestClassProcessor.java:66) at org.gradle.api.internal.tasks.testing.SuiteTestClassProcessor.processTestClass(SuiteTestClassProcessor.java:51) at jdk.internal.reflect.NativeMethodAccessorImpl.invoke0(Native Method) at jdk.internal.reflect.NativeMethodAccessorImpl.invoke(NativeMethodAccessorImpl.java:62) at jdk.internal.reflect.DelegatingMethodAccessorImpl.invoke(DelegatingMethodAccessorImpl.java:43) at java.lang.reflect.Method.invoke(Method.java:566) at org.gradle.internal.dispatch.ReflectionDispatch.dispatch(ReflectionDispatch.java:35) at org.gradle.internal.dispatch.ReflectionDispatch.dispatch(ReflectionDispatch.java:24) at org.gradle.internal.dispatch.ContextClassLoaderDispatch.dispatch(ContextClassLoaderDispatch.java:32) at org.gradle.internal.dispatch.ProxyDispatchAdapter$DispatchingInvocationHandler.invoke(ProxyDispatchAdapter.java:93) at com.sun.proxy.$Proxy2.processTestClass(Unknown Source) at org.gradle.api.internal.tasks.testing.worker.TestWorker.processTestClass(TestWorker.java:117) at jdk.internal.reflect.NativeMethodAccessorImpl.invoke0(Native Method) at jdk.internal.reflect.NativeMethodAccessorImpl.invoke(NativeMethodAccessorImpl.java:62) at jdk.internal.reflect.DelegatingMethodAccessorImpl.invoke(DelegatingMethodAccessorImpl.java:43) at java.lang.reflect.Method.invoke(Method.java:566) at org.gradle.internal.dispatch.ReflectionDispatch.dispatch(ReflectionDispatch.java:35) at org.gradle.internal.dispatch.ReflectionDispatch.dispatch(ReflectionDispatch.java:24) at org.gradle.internal.remote.internal.hub.MessageHubBackedObjectConnection$DispatchWrapper.dispatch(MessageHubBackedObjectConnection.java:155) at org.gradle.internal.remote.internal.hub.MessageHubBackedObjectConnection$DispatchWrapper.dispatch(MessageHubBackedObjectConnection.java:137) at org.gradle.internal.remote.internal.hub.MessageHub$Handler.run(MessageHub.java:404) at org.gradle.internal.concurrent.ExecutorPolicy$CatchAndRecordFailures.onExecute(ExecutorPolicy.java:63) at org.gradle.internal.concurrent.ManagedExecutorImpl$1.run(ManagedExecutorImpl.java:46) at java.util.concurrent.ThreadPoolExecutor.runWorker(ThreadPoolExecutor.java:1128) at java.util.concurrent.ThreadPoolExecutor$Worker.run(ThreadPoolExecutor.java:628) at org.gradle.internal.concurrent.ThreadFactoryImpl$ManagedThreadRunnable.run(ThreadFactoryImpl.java:55) at java.lang.Thread.run(Thread.java:834)
{noformat}
> CI: DeltaPropagationDUnit.testBug40165ClientReconnects - NoSubscriptionServersAvailableException
> ------------------------------------------------------------------------------------------------
>
> Key: GEODE-5595
> URL: https://issues.apache.org/jira/browse/GEODE-5595
> Project: Geode
> Issue Type: Bug
> Reporter: Kenneth Howe
> Assignee: Mark Hanson
> Priority: Major
> Labels: pull-request-available, swat
> Time Spent: 1h 10m
> Remaining Estimate: 0h
>
> This test failed. See _Issue Links_ section below for a bunch of other tests that seem to fail due to the same underlying product fault. See [~klund]'s analysis cited in the comment section for that underlying fault. Don't mark this ticket resolved until that product problem is really fixed please.
> {code:java}
> org.apache.geode.internal.cache.DeltaPropagationDUnitTest > testBug40165ClientReconnects FAILED
>
> org.apache.geode.cache.NoSubscriptionServersAvailableException: org.apache.geode.cache.NoSubscriptionServersAvailableException: Could not initialize a primary queue on startup. No queue servers available.
>
> at org.apache.geode.cache.client.internal.QueueManagerImpl.getAllConnections(QueueManagerImpl.java:187)
>
> at org.apache.geode.cache.client.internal.OpExecutorImpl.executeOnQueuesAndReturnPrimaryResult(OpExecutorImpl.java:548)
>
> at org.apache.geode.cache.client.internal.PoolImpl.executeOnQueuesAndReturnPrimaryResult(PoolImpl.java:855)
>
> at org.apache.geode.cache.client.internal.RegisterInterestOp.execute(RegisterInterestOp.java:58)
>
> at org.apache.geode.cache.client.internal.ServerRegionProxy.registerInterest(ServerRegionProxy.java:355)
>
> at org.apache.geode.internal.cache.LocalRegion.processSingleInterest(LocalRegion.java:3797)
>
> at org.apache.geode.internal.cache.LocalRegion.registerInterest(LocalRegion.java:3888)
>
> at org.apache.geode.internal.cache.LocalRegion.registerInterest(LocalRegion.java:3686)
>
> at org.apache.geode.internal.cache.LocalRegion.registerInterest(LocalRegion.java:3681)
>
> at org.apache.geode.internal.cache.LocalRegion.registerInterest(LocalRegion.java:3676)
>
> at org.apache.geode.internal.cache.DeltaPropagationDUnitTest.createDurableCacheClient(DeltaPropagationDUnitTest.java:1305)
>
> at org.apache.geode.internal.cache.DeltaPropagationDUnitTest.testBug40165ClientReconnects(DeltaPropagationDUnitTest.java:647)
>
>
> Caused by:
>
> org.apache.geode.cache.NoSubscriptionServersAvailableException: Could not initialize a primary queue on startup. No queue servers available.
>
> at org.apache.geode.cache.client.internal.QueueManagerImpl.initializeConnections(QueueManagerImpl.java:585)
>
> at org.apache.geode.cache.client.internal.QueueManagerImpl.start(QueueManagerImpl.java:296)
>
> at org.apache.geode.cache.client.internal.PoolImpl.start(PoolImpl.java:352)
>
> at org.apache.geode.cache.client.internal.PoolImpl.finishCreate(PoolImpl.java:176)
>
> at org.apache.geode.cache.client.internal.PoolImpl.create(PoolImpl.java:162)
>
> at org.apache.geode.internal.cache.PoolFactoryImpl.create(PoolFactoryImpl.java:349)
>
> at org.apache.geode.internal.cache.DeltaPropagationDUnitTest.createDurableCacheClient(DeltaPropagationDUnitTest.java:1295)
>
> ... 1 more
>
> {code}
--
This message was sent by Atlassian JIRA
(v7.6.3#76005)