You are viewing a plain text version of this content. The canonical link for it is here.
Posted to yarn-issues@hadoop.apache.org by "Rohith Sharma K S (JIRA)" <ji...@apache.org> on 2016/10/27 06:08:58 UTC
[jira] [Updated] (YARN-4555)
TestDefaultContainerExecutor#testContainerLaunchError fails on non-english
locale environment
[ https://issues.apache.org/jira/browse/YARN-4555?page=com.atlassian.jira.plugin.system.issuetabpanels:all-tabpanel ]
Rohith Sharma K S updated YARN-4555:
------------------------------------
Summary: TestDefaultContainerExecutor#testContainerLaunchError fails on non-english locale environment (was: TestDefaultContainerExecutor#testContainerLaunchError fails on non-englihsh locale environment)
> TestDefaultContainerExecutor#testContainerLaunchError fails on non-english locale environment
> ---------------------------------------------------------------------------------------------
>
> Key: YARN-4555
> URL: https://issues.apache.org/jira/browse/YARN-4555
> Project: Hadoop YARN
> Issue Type: Test
> Components: nodemanager, test
> Affects Versions: 2.7.1
> Reporter: Takashi Ohnishi
> Assignee: Takashi Ohnishi
> Priority: Minor
> Fix For: 2.9.0, 3.0.0-alpha2
>
> Attachments: YARN-4555.1.patch
>
>
> In my env where LANG=ja_JP.UTF-8, the test fails with
> {code}
> -------------------------------------------------------------------------------
> Test set: org.apache.hadoop.yarn.server.nodemanager.TestDefaultContainerExecutor
> -------------------------------------------------------------------------------
> Tests run: 1, Failures: 1, Errors: 0, Skipped: 0, Time elapsed: 1.286 sec <<< FAILURE! - in org.apache.hadoop.yarn.server.nodemanager.TestDefaultContainerExecutor
> testContainerLaunchError(org.apache.hadoop.yarn.server.nodemanager.TestDefaultContainerExecutor) Time elapsed: 1.149 sec <<< FAILURE!
> java.lang.AssertionError: Invalid Diagnostics message: Exception from container-launch.
> Container id: CONTAINER_ID
> Exit code: 127
> Exception message: bash: target/TestDefaultContainerExecutor/localDir/default_container_executor.sh: そのようなファイルやディレクトリはありません
> Stack trace: ExitCodeException exitCode=127: bash: target/TestDefaultContainerExecutor/localDir/default_container_executor.sh: そのようなファイルやディ>レクトリはありません
> {code}
> This is because the test code assertion assumes the English locale as below.
> {code}
> 250 public Object answer(InvocationOnMock invocationOnMock)
> 251 throws Throwable {
> 252 String diagnostics = (String) invocationOnMock.getArguments()[0];
> 253 assertTrue("Invalid Diagnostics message: " + diagnostics,
> 254 diagnostics.contains("No such file or directory"));
> 255 return null;
> 256 }
> {code}
> This exists on trunk, too.
--
This message was sent by Atlassian JIRA
(v6.3.4#6332)
---------------------------------------------------------------------
To unsubscribe, e-mail: yarn-issues-unsubscribe@hadoop.apache.org
For additional commands, e-mail: yarn-issues-help@hadoop.apache.org