You are viewing a plain text version of this content. The canonical link for it is here.
Posted to dev@pig.apache.org by Apache Jenkins Server <je...@builds.apache.org> on 2015/08/09 16:06:14 UTC
Build failed in Jenkins: Pig-trunk-commit #2220
See <https://builds.apache.org/job/Pig-trunk-commit/2220/>
------------------------------------------
[...truncated 4427 lines...]
[junit] Tests run: 3, Failures: 0, Errors: 0, Skipped: 0, Time elapsed: 34.794 sec
[junit] Running org.apache.pig.test.TestNewPlanListener
[junit] Tests run: 4, Failures: 0, Errors: 0, Skipped: 0, Time elapsed: 0.365 sec
[junit] Running org.apache.pig.test.TestNewPlanLogToPhyTranslationVisitor
[junit] Tests run: 27, Failures: 0, Errors: 0, Skipped: 0, Time elapsed: 4.983 sec
[junit] Running org.apache.pig.test.TestNewPlanLogicalOptimizer
[junit] Tests run: 1, Failures: 0, Errors: 0, Skipped: 0, Time elapsed: 1.375 sec
[junit] Running org.apache.pig.test.TestNewPlanOperatorPlan
[junit] Tests run: 47, Failures: 0, Errors: 0, Skipped: 0, Time elapsed: 4.121 sec
[junit] Running org.apache.pig.test.TestNewPlanPruneMapKeys
[junit] Tests run: 8, Failures: 0, Errors: 0, Skipped: 0, Time elapsed: 3.304 sec
[junit] Running org.apache.pig.test.TestNewPlanPushDownForeachFlatten
[junit] Tests run: 45, Failures: 0, Errors: 0, Skipped: 0, Time elapsed: 7.037 sec
[junit] Running org.apache.pig.test.TestNewPlanPushUpFilter
[junit] Tests run: 46, Failures: 0, Errors: 0, Skipped: 0, Time elapsed: 7.042 sec
[junit] Running org.apache.pig.test.TestNewPlanRule
[junit] Tests run: 4, Failures: 0, Errors: 0, Skipped: 0, Time elapsed: 0.332 sec
[junit] Running org.apache.pig.test.TestNotEqualTo
[junit] Tests run: 28, Failures: 0, Errors: 0, Skipped: 0, Time elapsed: 0.447 sec
[junit] Running org.apache.pig.test.TestNull
[junit] Tests run: 2, Failures: 0, Errors: 0, Skipped: 0, Time elapsed: 0.445 sec
[junit] Running org.apache.pig.test.TestNullConstant
[junit] Tests run: 8, Failures: 0, Errors: 0, Skipped: 0, Time elapsed: 22.364 sec
[junit] Running org.apache.pig.test.TestNumberOfReducers
[junit] Tests run: 10, Failures: 0, Errors: 0, Skipped: 0, Time elapsed: 512.514 sec
[junit] Running org.apache.pig.test.TestOptimizeLimit
[junit] Tests run: 12, Failures: 0, Errors: 0, Skipped: 0, Time elapsed: 3.628 sec
[junit] Running org.apache.pig.test.TestOrderBy3
[junit] Tests run: 4, Failures: 0, Errors: 0, Skipped: 0, Time elapsed: 13.155 sec
[junit] Running org.apache.pig.test.TestPOBinCond
[junit] Tests run: 10, Failures: 0, Errors: 0, Skipped: 0, Time elapsed: 0.451 sec
[junit] Running org.apache.pig.test.TestPOCast
[junit] Tests run: 14, Failures: 0, Errors: 0, Skipped: 0, Time elapsed: 0.896 sec
[junit] Running org.apache.pig.test.TestPODistinct
[junit] Tests run: 6, Failures: 0, Errors: 0, Skipped: 0, Time elapsed: 0.389 sec
[junit] Running org.apache.pig.test.TestPOGenerate
[junit] Tests run: 3, Failures: 0, Errors: 0, Skipped: 0, Time elapsed: 0.369 sec
[junit] Running org.apache.pig.test.TestPOMapLookUp
[junit] Tests run: 1, Failures: 0, Errors: 0, Skipped: 0, Time elapsed: 0.355 sec
[junit] Running org.apache.pig.test.TestPONegative
[junit] Tests run: 9, Failures: 0, Errors: 0, Skipped: 0, Time elapsed: 5.648 sec
[junit] Running org.apache.pig.test.TestPOPartialAgg
[junit] Tests run: 16, Failures: 0, Errors: 0, Skipped: 0, Time elapsed: 3.863 sec
[junit] Running org.apache.pig.test.TestPOPartialAggPlan
[junit] Tests run: 1, Failures: 0, Errors: 0, Skipped: 1, Time elapsed: 0.241 sec
[junit] Running org.apache.pig.test.TestPORegexp
[junit] Tests run: 2, Failures: 0, Errors: 0, Skipped: 0, Time elapsed: 0.374 sec
[junit] Running org.apache.pig.test.TestPOSort
[junit] Tests run: 14, Failures: 0, Errors: 0, Skipped: 0, Time elapsed: 0.457 sec
[junit] Running org.apache.pig.test.TestPOSplit
[junit] Tests run: 1, Failures: 0, Errors: 0, Skipped: 0, Time elapsed: 0.363 sec
[junit] Running org.apache.pig.test.TestPOUserFunc
[junit] Tests run: 6, Failures: 0, Errors: 0, Skipped: 0, Time elapsed: 0.449 sec
[junit] Running org.apache.pig.test.TestPackage
[junit] Tests run: 1, Failures: 0, Errors: 0, Skipped: 0, Time elapsed: 7.289 sec
[junit] Running org.apache.pig.test.TestParamSubPreproc
[junit] Tests run: 36, Failures: 0, Errors: 0, Skipped: 0, Time elapsed: 4.379 sec
[junit] Running org.apache.pig.test.TestParser
[junit] Tests run: 4, Failures: 0, Errors: 0, Skipped: 0, Time elapsed: 4.977 sec
[junit] Running org.apache.pig.test.TestPhyOp
[junit] Tests run: 1, Failures: 0, Errors: 0, Skipped: 0, Time elapsed: 0.433 sec
[junit] Running org.apache.pig.test.TestPhyPatternMatch
[junit] Tests run: 4, Failures: 0, Errors: 0, Skipped: 0, Time elapsed: 0.359 sec
[junit] Running org.apache.pig.test.TestPigContext
[junit] Tests run: 6, Failures: 0, Errors: 0, Skipped: 0, Time elapsed: 59.392 sec
[junit] Running org.apache.pig.test.TestPigContextClassCache
[junit] Tests run: 1, Failures: 0, Errors: 0, Skipped: 0, Time elapsed: 0.34 sec
[junit] Running org.apache.pig.test.TestPigException
[junit] Tests run: 2, Failures: 0, Errors: 0, Skipped: 0, Time elapsed: 0.247 sec
[junit] Running org.apache.pig.test.TestPigProgressReporting
[junit] Tests run: 1, Failures: 0, Errors: 0, Skipped: 0, Time elapsed: 43.344 sec
[junit] Running org.apache.pig.test.TestPigRunner
[junit] Tests run: 30, Failures: 0, Errors: 0, Skipped: 1, Time elapsed: 199.46 sec
[junit] Running org.apache.pig.test.TestPigScriptParser
[junit] Tests run: 4, Failures: 0, Errors: 0, Skipped: 0, Time elapsed: 4.147 sec
[junit] Running org.apache.pig.test.TestPigServer
[junit] Tests run: 31, Failures: 0, Errors: 0, Skipped: 0, Time elapsed: 57.626 sec
[junit] Running org.apache.pig.test.TestPigServerLocal
[junit] Tests run: 7, Failures: 1, Errors: 0, Skipped: 0, Time elapsed: 31.315 sec
[junit] Test org.apache.pig.test.TestPigServerLocal FAILED
[junit] Running org.apache.pig.test.TestPigServerWithMacros
[junit] Tests run: 2, Failures: 0, Errors: 0, Skipped: 0, Time elapsed: 13.371 sec
[junit] Running org.apache.pig.test.TestPigServerWithMacrosRemote
[junit] Tests run: 1, Failures: 0, Errors: 0, Skipped: 0, Time elapsed: 30.761 sec
[junit] Running org.apache.pig.test.TestPigSplit
[junit] Tests run: 3, Failures: 0, Errors: 1, Skipped: 0, Time elapsed: 52.177 sec
[junit] Test org.apache.pig.test.TestPigSplit FAILED
[junit] Running org.apache.pig.test.TestPigStats
[junit] Tests run: 1, Failures: 0, Errors: 0, Skipped: 1, Time elapsed: 0.222 sec
[junit] Running org.apache.pig.test.TestPigStorage
[junit] Tests run: 20, Failures: 0, Errors: 0, Skipped: 0, Time elapsed: 85.127 sec
[junit] Running org.apache.pig.test.TestPigStreaming
[junit] Tests run: 13, Failures: 0, Errors: 0, Skipped: 0, Time elapsed: 0.358 sec
[junit] Running org.apache.pig.test.TestPigTupleRawComparator
[junit] Tests run: 16, Failures: 0, Errors: 0, Skipped: 0, Time elapsed: 1.631 sec
[junit] Running org.apache.pig.test.TestPinOptions
[junit] Tests run: 3, Failures: 0, Errors: 0, Skipped: 0, Time elapsed: 2.835 sec
[junit] Running org.apache.pig.test.TestPlanGeneration
[junit] Tests run: 10, Failures: 0, Errors: 0, Skipped: 0, Time elapsed: 2.661 sec
[junit] Running org.apache.pig.test.TestPoissonSampleLoader
[junit] Tests run: 1, Failures: 0, Errors: 0, Skipped: 0, Time elapsed: 5.575 sec
[junit] Running org.apache.pig.test.TestPredeployedJar
[junit] Tests run: 2, Failures: 0, Errors: 0, Skipped: 0, Time elapsed: 38.986 sec
[junit] Running org.apache.pig.test.TestProject
[junit] Tests run: 12, Failures: 0, Errors: 0, Skipped: 0, Time elapsed: 12.871 sec
[junit] Running org.apache.pig.test.TestProjectRange
[junit] Tests run: 23, Failures: 0, Errors: 0, Skipped: 0, Time elapsed: 122.082 sec
[junit] Running org.apache.pig.test.TestProjectStarExpander
[junit] Tests run: 2, Failures: 0, Errors: 0, Skipped: 0, Time elapsed: 8.253 sec
[junit] Running org.apache.pig.test.TestProjectStarRangeInUdf
[junit] Tests run: 15, Failures: 0, Errors: 0, Skipped: 0, Time elapsed: 9.626 sec
[junit] Running org.apache.pig.test.TestPruneColumn
[junit] Tests run: 71, Failures: 0, Errors: 0, Skipped: 0, Time elapsed: 163.175 sec
[junit] Running org.apache.pig.test.TestRank1
[junit] Tests run: 9, Failures: 0, Errors: 0, Skipped: 0, Time elapsed: 26.042 sec
[junit] Running org.apache.pig.test.TestRank2
[junit] Tests run: 4, Failures: 0, Errors: 0, Skipped: 0, Time elapsed: 13.776 sec
[junit] Running org.apache.pig.test.TestRank3
[junit] Tests run: 4, Failures: 0, Errors: 0, Skipped: 0, Time elapsed: 17.655 sec
[junit] Running org.apache.pig.test.TestReadToEndLoader
[junit] Tests run: 1, Failures: 0, Errors: 0, Skipped: 0, Time elapsed: 1.139 sec
[junit] Running org.apache.pig.test.TestRegexp
[junit] Tests run: 2, Failures: 0, Errors: 0, Skipped: 0, Time elapsed: 0.347 sec
[junit] Running org.apache.pig.test.TestRegisteredJarVisibility
[junit] Tests run: 4, Failures: 0, Errors: 0, Skipped: 0, Time elapsed: 29.294 sec
[junit] Running org.apache.pig.test.TestRelationToExprProject
[junit] Tests run: 5, Failures: 0, Errors: 0, Skipped: 0, Time elapsed: 15.516 sec
[junit] Running org.apache.pig.test.TestResourceSchema
[junit] Tests run: 9, Failures: 0, Errors: 0, Skipped: 0, Time elapsed: 0.712 sec
[junit] Running org.apache.pig.test.TestRollupDimensions
[junit] Tests run: 1, Failures: 0, Errors: 0, Skipped: 0, Time elapsed: 0.362 sec
[junit] Running org.apache.pig.test.TestSample
[junit] Tests run: 7, Failures: 0, Errors: 0, Skipped: 0, Time elapsed: 45.817 sec
[junit] Running org.apache.pig.test.TestSampleOptimizer
[junit] Tests run: 5, Failures: 0, Errors: 0, Skipped: 0, Time elapsed: 117.786 sec
[junit] Running org.apache.pig.test.TestScalarAliases
[junit] Tests run: 2, Failures: 0, Errors: 0, Skipped: 0, Time elapsed: 40.696 sec
[junit] Running org.apache.pig.test.TestScalarAliasesLocal
[junit] Tests run: 12, Failures: 0, Errors: 0, Skipped: 0, Time elapsed: 69.204 sec
[junit] Running org.apache.pig.test.TestSchema
[junit] Tests run: 31, Failures: 0, Errors: 0, Skipped: 0, Time elapsed: 65.97 sec
[junit] Running org.apache.pig.test.TestSchemaUtil
[junit] Tests run: 2, Failures: 0, Errors: 0, Skipped: 0, Time elapsed: 0.348 sec
[junit] Running org.apache.pig.test.TestScriptLanguage
[junit] Tests run: 19, Failures: 0, Errors: 0, Skipped: 1, Time elapsed: 297.903 sec
[junit] Running org.apache.pig.test.TestScriptLanguageJavaScript
[junit] Tests run: 2, Failures: 0, Errors: 0, Skipped: 0, Time elapsed: 120.99 sec
[junit] Running org.apache.pig.test.TestScriptUDF
[junit] Tests run: 6, Failures: 0, Errors: 0, Skipped: 0, Time elapsed: 245.697 sec
[junit] Running org.apache.pig.test.TestScriptingLanguagePython
[junit] Tests run: 1, Failures: 0, Errors: 0, Skipped: 0, Time elapsed: 34.46 sec
[junit] Running org.apache.pig.test.TestSecondarySort
[junit] Tests run: 1, Failures: 0, Errors: 0, Skipped: 1, Time elapsed: 0.241 sec
[junit] Running org.apache.pig.test.TestShortcuts
[junit] Tests run: 19, Failures: 0, Errors: 0, Skipped: 0, Time elapsed: 9.24 sec
[junit] Running org.apache.pig.test.TestSkewedJoin
[junit] Tests run: 14, Failures: 0, Errors: 0, Skipped: 0, Time elapsed: 153.018 sec
[junit] Running org.apache.pig.test.TestSplit
[junit] Tests run: 4, Failures: 0, Errors: 0, Skipped: 0, Time elapsed: 12.722 sec
[junit] Running org.apache.pig.test.TestSplitCombine
[junit] Tests run: 11, Failures: 0, Errors: 0, Skipped: 0, Time elapsed: 1.292 sec
[junit] Running org.apache.pig.test.TestSplitIndex
[junit] Tests run: 2, Failures: 0, Errors: 0, Skipped: 0, Time elapsed: 7.919 sec
[junit] Running org.apache.pig.test.TestSplitStore
[junit] Tests run: 9, Failures: 0, Errors: 0, Skipped: 0, Time elapsed: 93.421 sec
[junit] Running org.apache.pig.test.TestStore
[junit] Tests run: 18, Failures: 0, Errors: 0, Skipped: 0, Time elapsed: 144.597 sec
[junit] Running org.apache.pig.test.TestStoreBase
[junit] Tests run: 1, Failures: 0, Errors: 0, Skipped: 1, Time elapsed: 0.242 sec
[junit] Running org.apache.pig.test.TestStoreInstances
[junit] Tests run: 1, Failures: 0, Errors: 0, Skipped: 0, Time elapsed: 52.04 sec
[junit] Running org.apache.pig.test.TestStoreLocal
[junit] Tests run: 6, Failures: 0, Errors: 0, Skipped: 0, Time elapsed: 30.652 sec
[junit] Running org.apache.pig.test.TestStoreOld
[junit] Tests run: 3, Failures: 0, Errors: 0, Skipped: 0, Time elapsed: 47.738 sec
[junit] Running org.apache.pig.test.TestStreaming
[junit] Tests run: 15, Failures: 0, Errors: 0, Skipped: 0, Time elapsed: 327.196 sec
[junit] Running org.apache.pig.test.TestStreamingLocal
[junit] Tests run: 7, Failures: 0, Errors: 0, Skipped: 0, Time elapsed: 30.99 sec
[junit] Running org.apache.pig.test.TestStringUDFs
[junit] Tests run: 17, Failures: 0, Errors: 0, Skipped: 0, Time elapsed: 0.297 sec
[junit] Running org.apache.pig.test.TestSubtract
[junit] Tests run: 1, Failures: 0, Errors: 0, Skipped: 0, Time elapsed: 0.42 sec
[junit] Running org.apache.pig.test.TestTextDataParser
[junit] Tests run: 15, Failures: 0, Errors: 0, Skipped: 0, Time elapsed: 0.848 sec
[junit] Running org.apache.pig.test.TestTmpFileCompression
[junit] Tests run: 8, Failures: 0, Errors: 0, Skipped: 0, Time elapsed: 312.831 sec
[junit] Running org.apache.pig.test.TestToolsPigServer
[junit] Tests run: 2, Failures: 0, Errors: 0, Skipped: 0, Time elapsed: 85.948 sec
[junit] Running org.apache.pig.test.TestTuple
[junit] Tests run: 12, Failures: 0, Errors: 0, Skipped: 0, Time elapsed: 0.61 sec
[junit] Running org.apache.pig.test.TestTypeCheckingValidatorNewLP
[junit] Tests run: 141, Failures: 1, Errors: 0, Skipped: 0, Time elapsed: 21.625 sec
[junit] Test org.apache.pig.test.TestTypeCheckingValidatorNewLP FAILED
[junit] Running org.apache.pig.test.TestTypedMap
[junit] Tests run: 8, Failures: 0, Errors: 0, Skipped: 0, Time elapsed: 24.192 sec
[junit] Running org.apache.pig.test.TestUDF
[junit] Tests run: 10, Failures: 0, Errors: 0, Skipped: 0, Time elapsed: 82.118 sec
[junit] Running org.apache.pig.test.TestUDFContext
[junit] Tests run: 2, Failures: 0, Errors: 0, Skipped: 0, Time elapsed: 6.106 sec
[junit] Running org.apache.pig.test.TestUDFGroovy
[junit] Tests run: 7, Failures: 0, Errors: 0, Skipped: 0, Time elapsed: 15.813 sec
[junit] Running org.apache.pig.test.TestUDFWithoutParameter
[junit] Tests run: 1, Failures: 0, Errors: 0, Skipped: 0, Time elapsed: 5.691 sec
[junit] Running org.apache.pig.test.TestUTF8
[junit] Tests run: 4, Failures: 0, Errors: 0, Skipped: 0, Time elapsed: 8.133 sec
[junit] Running org.apache.pig.test.TestUnion
[junit] Tests run: 7, Failures: 0, Errors: 0, Skipped: 0, Time elapsed: 18.626 sec
[junit] Running org.apache.pig.test.TestUnionOnSchema
[junit] Tests run: 22, Failures: 0, Errors: 0, Skipped: 0, Time elapsed: 52.301 sec
[junit] Running org.apache.pig.test.pigunit.TestPigTest
[junit] Tests run: 22, Failures: 0, Errors: 0, Skipped: 1, Time elapsed: 51.326 sec
[junit] Running org.apache.pig.test.pigunit.pig.TestGruntParser
[junit] Tests run: 5, Failures: 0, Errors: 0, Skipped: 0, Time elapsed: 1.733 sec
[junit] Running org.apache.pig.tez.TestGroupConstParallelTez
[junit] Tests run: 3, Failures: 0, Errors: 0, Skipped: 0, Time elapsed: 52.648 sec
[junit] Running org.apache.pig.tez.TestJobSubmissionTez
[junit] Tests run: 7, Failures: 0, Errors: 0, Skipped: 2, Time elapsed: 24.323 sec
[junit] Running org.apache.pig.tez.TestLoaderStorerShipCacheFilesTez
[junit] Tests run: 4, Failures: 0, Errors: 0, Skipped: 0, Time elapsed: 2.751 sec
[junit] Running org.apache.pig.tez.TestPOPartialAggPlanTez
[junit] Tests run: 5, Failures: 0, Errors: 0, Skipped: 0, Time elapsed: 2.861 sec
[junit] Running org.apache.pig.tez.TestPigStatsTez
[junit] Tests run: 5, Failures: 0, Errors: 0, Skipped: 0, Time elapsed: 8.37 sec
[junit] Running org.apache.pig.tez.TestSecondarySortTez
[junit] Tests run: 18, Failures: 0, Errors: 0, Skipped: 0, Time elapsed: 118.468 sec
[junit] Running org.apache.pig.tez.TestTezAutoParallelism
[junit] Tests run: 10, Failures: 0, Errors: 0, Skipped: 0, Time elapsed: 267.664 sec
[junit] Running org.apache.pig.tez.TestTezCompiler
[junit] Tests run: 46, Failures: 0, Errors: 0, Skipped: 0, Time elapsed: 12.23 sec
[junit] Running org.apache.pig.tez.TestTezGraceParallelism
[junit] Tests run: 4, Failures: 1, Errors: 0, Skipped: 0, Time elapsed: 32.12 sec
[junit] Test org.apache.pig.tez.TestTezGraceParallelism FAILED
[junit] Running org.apache.pig.tez.TestTezJobControlCompiler
[junit] Tests run: 8, Failures: 0, Errors: 0, Skipped: 0, Time elapsed: 4.874 sec
[junit] Running org.apache.pig.tez.TestTezLauncher
[junit] Tests run: 2, Failures: 0, Errors: 0, Skipped: 0, Time elapsed: 53.211 sec
[junit] Running org.apache.pig.tools.grunt.TestGruntParser
[junit] Tests run: 1, Failures: 0, Errors: 0, Skipped: 0, Time elapsed: 1.289 sec
[delete] Deleting directory /tmp/pig_junit_tmp1677053787
BUILD FAILED
<https://builds.apache.org/job/Pig-trunk-commit/ws/trunk/build.xml>:987: Tests failed!
Total time: 632 minutes 1 second
Build step 'Execute shell' marked build as failure
Recording test results
Publishing Javadoc
Recording fingerprints