You are viewing a plain text version of this content. The canonical link for it is here.
Posted to notifications@qpid.apache.org by Apache Jenkins Server <je...@builds.apache.org> on 2011/07/15 07:01:50 UTC

Build failed in Jenkins: qpid-java-build #189

See <https://builds.apache.org/job/qpid-java-build/189/changes>

Changes:

[rajith] QPID-3358 Simplified the scripts to make it easy to run them.
1. Removed the various set-env scripts. Instead in their place I want to introduce profiles that sets the env to
run under different environments. Ex from a source checkout or installed rpms.

2. Introduced Profile-run-from-source to set the env to run the tools
from an SVN checkout in a linux env.

3. Modified the scripts to use common variable names things like
classpaths, java executable, logging config etc..

------------------------------------------
[...truncated 4784 lines...]
copy-bin:

copy-etc:

postbuild:

build:

test:
     [echo] Running ant for module : broker-plugins/access-control
   [delete] Deleting: /x1/jenkins/jenkins-slave/workspace/qpid-java-build/trunk/qpid/java/build/scratch/test-java-mms.0-10.properties

prepare:

compile_velocity:

check_velocity_deps:

gen_logging:

precompile:

compile:
     [echo] Targeting : 1.5

jar.manifest:

jar.nomanifest:

jar:

precompile-tests:

compile-tests:
    [javac] /x1/jenkins/jenkins-slave/workspace/qpid-java-build/trunk/qpid/java/module.xml:284: warning: 'includeantruntime' was not set, defaulting to build.sysclasspath=last; set to false for repeatable builds

jar-tests:

jar-sources:

libs:

copy-bin:

copy-etc:

postbuild:

build:

test:
     [echo] Using profile:java-mms.0-10
    [junit] Running org.apache.qpid.server.security.access.plugins.AccessControlTest
    [junit] Tests run: 5, Failures: 0, Errors: 0, Time elapsed: 0.141 sec
    [junit] Running org.apache.qpid.server.security.access.plugins.PlainConfigurationTest
    [junit] Tests run: 10, Failures: 0, Errors: 0, Time elapsed: 0.025 sec
    [junit] Running org.apache.qpid.server.security.access.plugins.RuleSetTest
    [junit] Tests run: 21, Failures: 0, Errors: 0, Time elapsed: 0.017 sec
     [echo] Running ant for module : broker-plugins/access-control
   [delete] Deleting: /x1/jenkins/jenkins-slave/workspace/qpid-java-build/trunk/qpid/java/build/scratch/test-java-mms.0-10.properties

touch-failed:
     [echo] Running ant for module : broker-plugins/experimental/info
   [delete] Deleting: /x1/jenkins/jenkins-slave/workspace/qpid-java-build/trunk/qpid/java/build/scratch/test-java-mms.0-10.properties

prepare:

precompile:

compile:
     [echo] Targeting : 1.5

jar.manifest:

jar.nomanifest:

jar:

precompile-tests:

compile-tests:
    [javac] /x1/jenkins/jenkins-slave/workspace/qpid-java-build/trunk/qpid/java/module.xml:284: warning: 'includeantruntime' was not set, defaulting to build.sysclasspath=last; set to false for repeatable builds

jar-tests:

jar-sources:

libs:

copy-bin:

copy-etc:

postbuild:

build:

test:
     [echo] Using profile:java-mms.0-10
    [junit] Running org.apache.qpid.info.systest.InfoPluginTest
    [junit] Tests run: 1, Failures: 0, Errors: 0, Time elapsed: 2.969 sec
    [junit] Running org.apache.qpid.info.test.HttpPosterTest
    [junit] Tests run: 1, Failures: 0, Errors: 0, Time elapsed: 9.987 sec
    [junit] Running org.apache.qpid.info.test.InfoServiceImplTest
    [junit] Tests run: 1, Failures: 0, Errors: 0, Time elapsed: 0.009 sec
    [junit] Running org.apache.qpid.info.test.InfoTest
    [junit] Tests run: 5, Failures: 0, Errors: 0, Time elapsed: 0.008 sec
    [junit] Running org.apache.qpid.info.test.IniFileReaderTest
    [junit] Tests run: 2, Failures: 0, Errors: 0, Time elapsed: 0.008 sec
    [junit] Running org.apache.qpid.info.test.SoapClientTest
    [junit] Tests run: 3, Failures: 0, Errors: 0, Time elapsed: 1.01 sec
    [junit] Running org.apache.qpid.info.test.SystemInfoTest
    [junit] Tests run: 1, Failures: 0, Errors: 0, Time elapsed: 0.011 sec
    [junit] Running org.apache.qpid.info.test.XMLWriterTest
    [junit] Tests run: 9, Failures: 0, Errors: 0, Time elapsed: 0.014 sec
     [echo] Running ant for module : broker-plugins/experimental/info
   [delete] Deleting: /x1/jenkins/jenkins-slave/workspace/qpid-java-build/trunk/qpid/java/build/scratch/test-java-mms.0-10.properties

touch-failed:
     [echo] Running ant for module : broker-plugins/experimental/shutdown
   [delete] Deleting: /x1/jenkins/jenkins-slave/workspace/qpid-java-build/trunk/qpid/java/build/scratch/test-java-mms.0-10.properties

prepare:

precompile:

compile:
     [echo] Targeting : 1.5

jar.manifest:

jar.nomanifest:

jar:

precompile-tests:

compile-tests:

jar-tests:

jar-sources:

libs:

copy-bin:

copy-etc:

postbuild:

build:

test:
     [echo] Running ant for module : broker-plugins/extras
   [delete] Deleting: /x1/jenkins/jenkins-slave/workspace/qpid-java-build/trunk/qpid/java/build/scratch/test-java-mms.0-10.properties

prepare:

precompile:

compile:
     [echo] Targeting : 1.5

jar.manifest:

jar.nomanifest:

jar:

precompile-tests:

compile-tests:
    [javac] /x1/jenkins/jenkins-slave/workspace/qpid-java-build/trunk/qpid/java/module.xml:284: warning: 'includeantruntime' was not set, defaulting to build.sysclasspath=last; set to false for repeatable builds

jar-tests:

jar-sources:

libs:

copy-bin:

copy-etc:

postbuild:

build:

test:
     [echo] Using profile:java-mms.0-10
    [junit] Running org.apache.qpid.server.plugins.ExtrasTest
    [junit] Tests run: 2, Failures: 0, Errors: 0, Time elapsed: 0.688 sec
     [echo] Running ant for module : broker-plugins/extras
   [delete] Deleting: /x1/jenkins/jenkins-slave/workspace/qpid-java-build/trunk/qpid/java/build/scratch/test-java-mms.0-10.properties

touch-failed:
     [echo] Running ant for module : broker-plugins/firewall
   [delete] Deleting: /x1/jenkins/jenkins-slave/workspace/qpid-java-build/trunk/qpid/java/build/scratch/test-java-mms.0-10.properties

prepare:

precompile:

compile:
     [echo] Targeting : 1.5

jar.manifest:

jar.nomanifest:

jar:

precompile-tests:

compile-tests:
    [javac] /x1/jenkins/jenkins-slave/workspace/qpid-java-build/trunk/qpid/java/module.xml:284: warning: 'includeantruntime' was not set, defaulting to build.sysclasspath=last; set to false for repeatable builds

jar-tests:

jar-sources:

libs:

copy-bin:

copy-etc:

postbuild:

build:

test:
     [echo] Using profile:java-mms.0-10
    [junit] Running org.apache.qpid.server.security.access.FirewallConfigurationTest
    [junit] Tests run: 5, Failures: 0, Errors: 0, Time elapsed: 0.97 sec
    [junit] Running org.apache.qpid.server.security.access.FirewallPluginTest
    [junit] Tests run: 10, Failures: 0, Errors: 0, Time elapsed: 1.138 sec
    [junit] Tests run: 10, Failures: 0, Errors: 0, Time elapsed: 1.138 sec
     [echo] Running ant for module : broker-plugins/firewall
   [delete] Deleting: /x1/jenkins/jenkins-slave/workspace/qpid-java-build/trunk/qpid/java/build/scratch/test-java-mms.0-10.properties

touch-failed:

BUILD FAILED
/x1/jenkins/jenkins-slave/workspace/qpid-java-build/trunk/qpid/java/build.xml:92: TEST SUITE FAILED

Total time: 15 minutes 58 seconds
Recording test results


Jenkins build is back to normal : qpid-java-build #191

Posted by Apache Jenkins Server <je...@builds.apache.org>.
See <https://builds.apache.org/job/qpid-java-build/191/changes>



Build failed in Jenkins: qpid-java-build #190

Posted by Apache Jenkins Server <je...@builds.apache.org>.
See <https://builds.apache.org/job/qpid-java-build/190/changes>

Changes:

[robbie] QPID-3283: make Authentication Manager pluggable.

Refactors AuthenticationManager and collaborators to allow of AuthenticationManager to be plugged in from the configuration XML. Change PrincipalDatabaseAuthenticationManager to become a pluggable implementation.  This change removes support for the <principal-databases> element within the config.xml.   Existing use-cases are supported by the new element <pd-auth-manager/> which enables use of the PDAM implementation. Also resolves QPID-1347.

Applied patch by Keith Wall <ke...@gmail.com>

------------------------------------------
[...truncated 4797 lines...]

copy-bin:

copy-etc:

postbuild:

build:

test:
     [echo] Running ant for module : broker-plugins/access-control
   [delete] Deleting: /x1/jenkins/jenkins-slave/workspace/qpid-java-build/trunk/qpid/java/build/scratch/test-java-mms.0-10.properties

prepare:

compile_velocity:

check_velocity_deps:

gen_logging:

precompile:

compile:
     [echo] Targeting : 1.5

jar.manifest:

jar.nomanifest:

jar:

precompile-tests:

compile-tests:
    [javac] /x1/jenkins/jenkins-slave/workspace/qpid-java-build/trunk/qpid/java/module.xml:284: warning: 'includeantruntime' was not set, defaulting to build.sysclasspath=last; set to false for repeatable builds

jar-tests:

jar-sources:

libs:

copy-bin:

copy-etc:

postbuild:

build:

test:
     [echo] Using profile:java-mms.0-10
    [junit] Running org.apache.qpid.server.security.access.plugins.AccessControlTest
    [junit] Tests run: 5, Failures: 0, Errors: 0, Time elapsed: 0.136 sec
    [junit] Running org.apache.qpid.server.security.access.plugins.PlainConfigurationTest
    [junit] Tests run: 10, Failures: 0, Errors: 0, Time elapsed: 0.027 sec
    [junit] Running org.apache.qpid.server.security.access.plugins.RuleSetTest
    [junit] Tests run: 21, Failures: 0, Errors: 0, Time elapsed: 0.016 sec
     [echo] Running ant for module : broker-plugins/access-control
   [delete] Deleting: /x1/jenkins/jenkins-slave/workspace/qpid-java-build/trunk/qpid/java/build/scratch/test-java-mms.0-10.properties

touch-failed:
     [echo] Running ant for module : broker-plugins/experimental/info
   [delete] Deleting: /x1/jenkins/jenkins-slave/workspace/qpid-java-build/trunk/qpid/java/build/scratch/test-java-mms.0-10.properties

prepare:

precompile:

compile:
     [echo] Targeting : 1.5

jar.manifest:

jar.nomanifest:

jar:

precompile-tests:

compile-tests:
    [javac] /x1/jenkins/jenkins-slave/workspace/qpid-java-build/trunk/qpid/java/module.xml:284: warning: 'includeantruntime' was not set, defaulting to build.sysclasspath=last; set to false for repeatable builds

jar-tests:

jar-sources:

libs:

copy-bin:

copy-etc:

postbuild:

build:

test:
     [echo] Using profile:java-mms.0-10
    [junit] Running org.apache.qpid.info.systest.InfoPluginTest
    [junit] Tests run: 1, Failures: 0, Errors: 0, Time elapsed: 2.928 sec
    [junit] Running org.apache.qpid.info.test.HttpPosterTest
    [junit] Tests run: 1, Failures: 0, Errors: 0, Time elapsed: 0.429 sec
    [junit] Running org.apache.qpid.info.test.InfoServiceImplTest
    [junit] Tests run: 1, Failures: 0, Errors: 0, Time elapsed: 0.017 sec
    [junit] Running org.apache.qpid.info.test.InfoTest
    [junit] Tests run: 5, Failures: 0, Errors: 0, Time elapsed: 0.016 sec
    [junit] Running org.apache.qpid.info.test.IniFileReaderTest
    [junit] Tests run: 2, Failures: 0, Errors: 0, Time elapsed: 0.015 sec
    [junit] Running org.apache.qpid.info.test.SoapClientTest
    [junit] Tests run: 3, Failures: 0, Errors: 0, Time elapsed: 1.014 sec
    [junit] Running org.apache.qpid.info.test.SystemInfoTest
    [junit] Tests run: 1, Failures: 0, Errors: 0, Time elapsed: 0.011 sec
    [junit] Running org.apache.qpid.info.test.XMLWriterTest
    [junit] Tests run: 9, Failures: 0, Errors: 0, Time elapsed: 0.014 sec
     [echo] Running ant for module : broker-plugins/experimental/info
   [delete] Deleting: /x1/jenkins/jenkins-slave/workspace/qpid-java-build/trunk/qpid/java/build/scratch/test-java-mms.0-10.properties

touch-failed:
     [echo] Running ant for module : broker-plugins/experimental/shutdown
   [delete] Deleting: /x1/jenkins/jenkins-slave/workspace/qpid-java-build/trunk/qpid/java/build/scratch/test-java-mms.0-10.properties

prepare:

precompile:

compile:
     [echo] Targeting : 1.5

jar.manifest:

jar.nomanifest:

jar:

precompile-tests:

compile-tests:

jar-tests:

jar-sources:

libs:

copy-bin:

copy-etc:

postbuild:

build:

test:
     [echo] Running ant for module : broker-plugins/extras
   [delete] Deleting: /x1/jenkins/jenkins-slave/workspace/qpid-java-build/trunk/qpid/java/build/scratch/test-java-mms.0-10.properties

prepare:

precompile:

compile:
     [echo] Targeting : 1.5

jar.manifest:

jar.nomanifest:

jar:

precompile-tests:

compile-tests:
    [javac] /x1/jenkins/jenkins-slave/workspace/qpid-java-build/trunk/qpid/java/module.xml:284: warning: 'includeantruntime' was not set, defaulting to build.sysclasspath=last; set to false for repeatable builds

jar-tests:

jar-sources:

libs:

copy-bin:

copy-etc:

postbuild:

build:

test:
     [echo] Using profile:java-mms.0-10
    [junit] Running org.apache.qpid.server.plugins.ExtrasTest
    [junit] Tests run: 2, Failures: 0, Errors: 0, Time elapsed: 0.653 sec
     [echo] Running ant for module : broker-plugins/extras
   [delete] Deleting: /x1/jenkins/jenkins-slave/workspace/qpid-java-build/trunk/qpid/java/build/scratch/test-java-mms.0-10.properties

touch-failed:
     [echo] Running ant for module : broker-plugins/firewall
   [delete] Deleting: /x1/jenkins/jenkins-slave/workspace/qpid-java-build/trunk/qpid/java/build/scratch/test-java-mms.0-10.properties

prepare:

precompile:

compile:
     [echo] Targeting : 1.5

jar.manifest:

jar.nomanifest:

jar:

precompile-tests:

compile-tests:
    [javac] /x1/jenkins/jenkins-slave/workspace/qpid-java-build/trunk/qpid/java/module.xml:284: warning: 'includeantruntime' was not set, defaulting to build.sysclasspath=last; set to false for repeatable builds

jar-tests:

jar-sources:

libs:

copy-bin:

copy-etc:

postbuild:

build:

test:
     [echo] Using profile:java-mms.0-10
    [junit] Running org.apache.qpid.server.security.access.FirewallConfigurationTest
    [junit] Tests run: 5, Failures: 0, Errors: 0, Time elapsed: 1.057 sec
    [junit] Running org.apache.qpid.server.security.access.FirewallPluginTest
    [junit] Tests run: 10, Failures: 0, Errors: 0, Time elapsed: 0.545 sec
     [echo] Running ant for module : broker-plugins/firewall
   [delete] Deleting: /x1/jenkins/jenkins-slave/workspace/qpid-java-build/trunk/qpid/java/build/scratch/test-java-mms.0-10.properties

touch-failed:

BUILD FAILED
/x1/jenkins/jenkins-slave/workspace/qpid-java-build/trunk/qpid/java/build.xml:92: TEST SUITE FAILED

Total time: 16 minutes 15 seconds
Recording test results