You are viewing a plain text version of this content. The canonical link for it is here.
Posted to builds@beam.apache.org by Apache Jenkins Server <je...@builds.apache.org> on 2022/12/05 10:43:30 UTC

Build failed in Jenkins: beam_PostCommit_XVR_JavaUsingPython_Dataflow #1245

See <https://ci-beam.apache.org/job/beam_PostCommit_XVR_JavaUsingPython_Dataflow/1245/display/redirect>

Changes:


------------------------------------------
[...truncated 1.09 MB...]
scikit-learn==1.1.2
scipy==1.9.3
setuptools==65.6.3
six==1.16.0
sortedcontainers==2.4.0
soupsieve==2.3.2.post1
SQLAlchemy==1.4.42
sqlparse==0.4.3
tenacity==5.1.5
tensorboard==2.10.1
tensorboard-data-server==0.6.1
tensorboard-plugin-wit==1.8.1
tensorflow==2.10.0
tensorflow-estimator==2.10.0
tensorflow-io-gcs-filesystem==0.27.0
termcolor==2.0.1
testcontainers==3.7.0
threadpoolctl==3.1.0
tomli==2.0.1
tqdm==4.64.1
typing_extensions==4.4.0
uritemplate==4.1.1
urllib3==1.26.12
websocket-client==1.4.1
Werkzeug==2.2.2
wheel==0.38.4
wrapt==1.14.1
zstandard==0.18.0
Removing intermediate container 9a874d7a9e4e
 ---> 86fe62991141
Step 17/32 : COPY target/LICENSE /opt/apache/beam/
 ---> 953c2c216376
Step 18/32 : COPY target/LICENSE.python /opt/apache/beam/
 ---> 689bf8042b7e
Step 19/32 : COPY target/NOTICE /opt/apache/beam/
 ---> b63a5fa3ca16
Step 20/32 : COPY target/launcher/linux_amd64/boot /opt/apache/beam/
 ---> 6e558964f3e7
Step 21/32 : ENTRYPOINT ["/opt/apache/beam/boot"]
 ---> Running in 56a0ea47d6a7
Removing intermediate container 56a0ea47d6a7
 ---> b88999b4239e
Step 22/32 : FROM beam as third_party_licenses
 ---> b88999b4239e
Step 23/32 : ARG pull_licenses
 ---> Running in 4303ac9c60ac
Removing intermediate container 4303ac9c60ac
 ---> 49926d45bfbb
Step 24/32 : COPY target/license_scripts /tmp/license_scripts/
 ---> bab14b5861bb
Step 25/32 : COPY target/LICENSE target/go-licenses/* /opt/apache/beam/third_party_licenses/golang/
 ---> 9fe09dc4e7ab
Step 26/32 : RUN rm /opt/apache/beam/third_party_licenses/golang/LICENSE
 ---> Running in 2a9c71f6f582
Removing intermediate container 2a9c71f6f582
 ---> 0b70d4535310
Step 27/32 : COPY target/license_scripts /tmp/license_scripts/
 ---> 629eb87f60fa
Step 28/32 : RUN if [ "$pull_licenses" = "true" ] ; then       pip install 'pip-licenses<4.0.0' pyyaml tenacity &&       python /tmp/license_scripts/pull_licenses_py.py ;     fi
 ---> Running in 81f1ce19e782
Collecting pip-licenses<4.0.0
  Downloading pip_licenses-3.5.5-py3-none-any.whl (17 kB)
Requirement already satisfied: pyyaml in /usr/local/lib/python3.10/site-packages (6.0)
Requirement already satisfied: tenacity in /usr/local/lib/python3.10/site-packages (5.1.5)
Collecting PTable
  Downloading PTable-0.9.2.tar.gz (31 kB)
  Preparing metadata (setup.py): started
  Preparing metadata (setup.py): finished with status 'done'
Requirement already satisfied: six>=1.9.0 in /usr/local/lib/python3.10/site-packages (from tenacity) (1.16.0)
Building wheels for collected packages: PTable
  Building wheel for PTable (setup.py): started
  Building wheel for PTable (setup.py): finished with status 'done'
  Created wheel for PTable: filename=PTable-0.9.2-py3-none-any.whl size=22908 sha256=66d2d18b43f3081ac7c3db8c915b702c61305420d907bf64580e8e2c2e8b4746
  Stored in directory: /root/.cache/pip/wheels/62/2a/42/c655cf57d84ab59535337af009892aaf16256a813826b465f7
Successfully built PTable
Installing collected packages: PTable, pip-licenses
Successfully installed PTable-0.9.2 pip-licenses-3.5.5
WARNING: Running pip as the 'root' user can result in broken permissions and conflicting behaviour with the system package manager. It is recommended to use a virtual environment instead: https://pip.pypa.io/warnings/venv
INFO:root:Successfully pulled licenses for 135 dependencies
Skip pulling license for  bs4
Removing intermediate container 81f1ce19e782
 ---> 133473a95d2c
Step 29/32 : FROM beam
 ---> b88999b4239e
Step 30/32 : ARG pull_licenses
 ---> Running in 413654aba75b
Removing intermediate container 413654aba75b
 ---> b75c8b976009
Step 31/32 : COPY --from=third_party_licenses /opt/apache/beam/third_party_licenses /opt/apache/beam/third_party_licenses
 ---> 1bcf317485dc
Step 32/32 : RUN if [ "$pull_licenses" != "true" ] ; then       rm -rf /opt/apache/beam/third_party_licenses ;     fi
 ---> Running in 96a08c2f5bab
Removing intermediate container 96a08c2f5bab
 ---> e05db616f366
Successfully built e05db616f366
Successfully tagged apache/beam_python3.10_sdk:2.45.0.dev

> Task :runners:google-cloud-dataflow-java:buildAndPushDockerPythonContainer
WARNING: `gcloud docker` will not be supported for Docker client versions above 18.03.

As an alternative, use `gcloud auth configure-docker` to configure `docker` to
use `gcloud` as a credential helper, then use `docker` as you would for non-GCR
registries, e.g. `docker pull gcr.io/project-id/my-image`. Add
`--verbosity=error` to silence this warning: `gcloud docker
--verbosity=error -- pull gcr.io/project-id/my-image`.

See: https://cloud.google.com/container-registry/docs/support/deprecation-notices#gcloud-docker

The push refers to repository [us.gcr.io/apache-beam-testing/java-postcommit-it/python]
faf8886552d5: Preparing
8469c99219ed: Preparing
4f000e1066e9: Preparing
bba00dd7b135: Preparing
0b4db9b3748b: Preparing
df5d12c5eeaf: Preparing
94ffd8d55dd9: Preparing
8c9b55a049a6: Preparing
89df2935418d: Preparing
1c1b9f1eb8f3: Preparing
d3844688b8cb: Preparing
8366e2f35072: Preparing
f407ba790d39: Preparing
a3bdca96ab68: Preparing
5183217745a1: Preparing
905ede8abeca: Preparing
63ab2579942e: Preparing
94ffd8d55dd9: Waiting
e6e9854ca999: Preparing
397a239a053b: Preparing
89c3244a87b2: Preparing
80231db1194c: Preparing
8c9b55a049a6: Waiting
f1c1f2298584: Preparing
ccba29d69370: Preparing
89df2935418d: Waiting
1c1b9f1eb8f3: Waiting
a3bdca96ab68: Waiting
5183217745a1: Waiting
d3844688b8cb: Waiting
8366e2f35072: Waiting
f1c1f2298584: Waiting
905ede8abeca: Waiting
ccba29d69370: Waiting
63ab2579942e: Waiting
397a239a053b: Waiting
e6e9854ca999: Waiting
df5d12c5eeaf: Waiting
89c3244a87b2: Waiting
80231db1194c: Waiting
bba00dd7b135: Pushed
4f000e1066e9: Pushed
0b4db9b3748b: Pushed
faf8886552d5: Pushed
8469c99219ed: Pushed
94ffd8d55dd9: Pushed
8c9b55a049a6: Pushed
89df2935418d: Pushed
f407ba790d39: Pushed
a3bdca96ab68: Pushed
5183217745a1: Layer already exists
905ede8abeca: Layer already exists
63ab2579942e: Layer already exists
e6e9854ca999: Layer already exists
397a239a053b: Layer already exists
89c3244a87b2: Layer already exists
d3844688b8cb: Pushed
80231db1194c: Layer already exists
f1c1f2298584: Layer already exists
ccba29d69370: Layer already exists
df5d12c5eeaf: Pushed
1c1b9f1eb8f3: Pushed
8366e2f35072: Pushed
20221205095230: digest: sha256:d2cbe2a3e7ea44f30f5ab69c991bc1674e0bd91ce967eca8b764b8a7b1ace9b5 size: 5156

> Task :runners:google-cloud-dataflow-java:setupXVR

> Task :runners:google-cloud-dataflow-java:validatesCrossLanguageRunnerSetup
Launching Java expansion service @ 38307
Launching Python expansion service @ 46445

> Task :runners:google-cloud-dataflow-java:validatesCrossLanguageRunnerJavaUsingPython

org.apache.beam.sdk.extensions.python.transforms.DataframeTransformTest > testDataframeSum FAILED
    java.lang.RuntimeException at TestDataflowRunner.java:141

16 tests completed, 1 failed, 2 skipped

> Task :runners:google-cloud-dataflow-java:validatesCrossLanguageRunnerJavaUsingPython FAILED
> Task :runners:google-cloud-dataflow-java:cleanupXVR UP-TO-DATE

> Task :runners:google-cloud-dataflow-java:cleanUpDockerPythonImages
Untagged: us.gcr.io/apache-beam-testing/java-postcommit-it/python:20221205095230
Untagged: us.gcr.io/apache-beam-testing/java-postcommit-it/python@sha256:d2cbe2a3e7ea44f30f5ab69c991bc1674e0bd91ce967eca8b764b8a7b1ace9b5
WARNING: Successfully resolved tag to sha256, but it is recommended to use sha256 directly.
Tag: [us.gcr.io/apache-beam-testing/java-postcommit-it/python:20221205095230]
- referencing digest: [us.gcr.io/apache-beam-testing/java-postcommit-it/python@sha256:d2cbe2a3e7ea44f30f5ab69c991bc1674e0bd91ce967eca8b764b8a7b1ace9b5]

Deleted [[us.gcr.io/apache-beam-testing/java-postcommit-it/python:20221205095230] (referencing [us.gcr.io/apache-beam-testing/java-postcommit-it/python@sha256:d2cbe2a3e7ea44f30f5ab69c991bc1674e0bd91ce967eca8b764b8a7b1ace9b5])].
Removing untagged image us.gcr.io/apache-beam-testing/java-postcommit-it/python@sha256:d2cbe2a3e7ea44f30f5ab69c991bc1674e0bd91ce967eca8b764b8a7b1ace9b5
Digests:
- us.gcr.io/apache-beam-testing/java-postcommit-it/python@sha256:d2cbe2a3e7ea44f30f5ab69c991bc1674e0bd91ce967eca8b764b8a7b1ace9b5
Deleted [us.gcr.io/apache-beam-testing/java-postcommit-it/python@sha256:d2cbe2a3e7ea44f30f5ab69c991bc1674e0bd91ce967eca8b764b8a7b1ace9b5].

> Task :runners:google-cloud-dataflow-java:cleanUpDockerJavaImages
Untagged: us.gcr.io/apache-beam-testing/java-postcommit-it/java:20221205095230
Untagged: us.gcr.io/apache-beam-testing/java-postcommit-it/java@sha256:26c27e4da1a316d3db70219d9b4346dd80912b610c34efeaac29c7f7161d9ab2
WARNING: Successfully resolved tag to sha256, but it is recommended to use sha256 directly.
Tag: [us.gcr.io/apache-beam-testing/java-postcommit-it/java:20221205095230]
- referencing digest: [us.gcr.io/apache-beam-testing/java-postcommit-it/java@sha256:26c27e4da1a316d3db70219d9b4346dd80912b610c34efeaac29c7f7161d9ab2]

Deleted [[us.gcr.io/apache-beam-testing/java-postcommit-it/java:20221205095230] (referencing [us.gcr.io/apache-beam-testing/java-postcommit-it/java@sha256:26c27e4da1a316d3db70219d9b4346dd80912b610c34efeaac29c7f7161d9ab2])].
Removing untagged image us.gcr.io/apache-beam-testing/java-postcommit-it/java@sha256:26c27e4da1a316d3db70219d9b4346dd80912b610c34efeaac29c7f7161d9ab2
Digests:
- us.gcr.io/apache-beam-testing/java-postcommit-it/java@sha256:26c27e4da1a316d3db70219d9b4346dd80912b610c34efeaac29c7f7161d9ab2
Deleted [us.gcr.io/apache-beam-testing/java-postcommit-it/java@sha256:26c27e4da1a316d3db70219d9b4346dd80912b610c34efeaac29c7f7161d9ab2].

> Task :runners:google-cloud-dataflow-java:validatesCrossLanguageRunnerCleanup
Stopping expansion service pid: 1461225.
Stopping expansion service pid: 1461226.

FAILURE: Build failed with an exception.

* What went wrong:
Execution failed for task ':runners:google-cloud-dataflow-java:validatesCrossLanguageRunnerJavaUsingPython'.
> There were failing tests. See the report at: file://<https://ci-beam.apache.org/job/beam_PostCommit_XVR_JavaUsingPython_Dataflow/ws/src/runners/google-cloud-dataflow-java/build/reports/tests/validatesCrossLanguageRunnerJavaUsingPython/index.html>

* Try:
> Run with --stacktrace option to get the stack trace.
> Run with --info or --debug option to get more log output.

* Get more help at https://help.gradle.org

Deprecated Gradle features were used in this build, making it incompatible with Gradle 8.0.

You can use '--warning-mode all' to show the individual deprecation warnings and determine if they come from your own scripts or plugins.

See https://docs.gradle.org/7.5.1/userguide/command_line_interface.html#sec:command_line_warnings

Execution optimizations have been disabled for 1 invalid unit(s) of work during this build to ensure correctness.
Please consult deprecation warnings for more details.

BUILD FAILED in 51m 1s
174 actionable tasks: 25 executed, 149 up-to-date

Publishing build scan...
https://gradle.com/s/vrutoa65nmjha

Build step 'Invoke Gradle script' changed build result to FAILURE
Build step 'Invoke Gradle script' marked build as failure

---------------------------------------------------------------------
To unsubscribe, e-mail: builds-unsubscribe@beam.apache.org
For additional commands, e-mail: builds-help@beam.apache.org


Jenkins build is back to normal : beam_PostCommit_XVR_JavaUsingPython_Dataflow #1256

Posted by Apache Jenkins Server <je...@builds.apache.org>.
See <https://ci-beam.apache.org/job/beam_PostCommit_XVR_JavaUsingPython_Dataflow/1256/display/redirect?page=changes>


---------------------------------------------------------------------
To unsubscribe, e-mail: builds-unsubscribe@beam.apache.org
For additional commands, e-mail: builds-help@beam.apache.org


Build failed in Jenkins: beam_PostCommit_XVR_JavaUsingPython_Dataflow #1255

Posted by Apache Jenkins Server <je...@builds.apache.org>.
See <https://ci-beam.apache.org/job/beam_PostCommit_XVR_JavaUsingPython_Dataflow/1255/display/redirect?page=changes>

Changes:

[Kenneth Knowles] Suppress keyfor warnings

[Kenneth Knowles] Suppress checker warnings that are confusing and difficult

[Kenneth Knowles] Add @Pure annotations to MongoDbIO autovalue fields

[Kenneth Knowles] Suppress checker in FnApiDoFnRunner due to crash

[Kenneth Knowles] Suppress checker framework in Dataflow

[Kenneth Knowles] Fix some nullness errors in Spark runner

[Kenneth Knowles] Upgrade checker framework to 3.27.0

[noreply] Migrate testing subpackages from interface{} to any (#24570)

[noreply] fix go lints (#24566)

[noreply] Samza runner support for non unique stateId across multiple ParDos

[noreply] Bump to Hadoop 3.3.4 for performance tests (#24550)


------------------------------------------
[...truncated 656.05 KB...]
scikit-learn==1.1.2
scipy==1.9.3
setuptools==65.6.3
six==1.16.0
sortedcontainers==2.4.0
soupsieve==2.3.2.post1
SQLAlchemy==1.4.42
sqlparse==0.4.3
tenacity==5.1.5
tensorboard==2.10.1
tensorboard-data-server==0.6.1
tensorboard-plugin-wit==1.8.1
tensorflow==2.10.0
tensorflow-estimator==2.10.0
tensorflow-io-gcs-filesystem==0.27.0
termcolor==2.0.1
testcontainers==3.7.0
threadpoolctl==3.1.0
tomli==2.0.1
tqdm==4.64.1
typing_extensions==4.4.0
uritemplate==4.1.1
urllib3==1.26.12
websocket-client==1.4.1
Werkzeug==2.2.2
wheel==0.38.4
wrapt==1.14.1
zstandard==0.18.0
Removing intermediate container 27d9134c32ae
 ---> fe6b29738f57
Step 17/32 : COPY target/LICENSE /opt/apache/beam/
 ---> 5b36bbd3adaa
Step 18/32 : COPY target/LICENSE.python /opt/apache/beam/
 ---> 623bf2c91df9
Step 19/32 : COPY target/NOTICE /opt/apache/beam/
 ---> e4bd24fd3974
Step 20/32 : COPY target/launcher/linux_amd64/boot /opt/apache/beam/
 ---> 74d3267d1051
Step 21/32 : ENTRYPOINT ["/opt/apache/beam/boot"]
 ---> Running in e9b4e2d090ea
Removing intermediate container e9b4e2d090ea
 ---> 32efd0907d4d
Step 22/32 : FROM beam as third_party_licenses
 ---> 32efd0907d4d
Step 23/32 : ARG pull_licenses
 ---> Running in 1b69a9a4f75d
Removing intermediate container 1b69a9a4f75d
 ---> f189a723f88c
Step 24/32 : COPY target/license_scripts /tmp/license_scripts/
 ---> 98d794dbab96
Step 25/32 : COPY target/LICENSE target/go-licenses/* /opt/apache/beam/third_party_licenses/golang/
 ---> 09fa180dd1d9
Step 26/32 : RUN rm /opt/apache/beam/third_party_licenses/golang/LICENSE
 ---> Running in 0d511c63ad44
Removing intermediate container 0d511c63ad44
 ---> 67169a9bd5ca
Step 27/32 : COPY target/license_scripts /tmp/license_scripts/
 ---> 2262821967ad
Step 28/32 : RUN if [ "$pull_licenses" = "true" ] ; then       pip install 'pip-licenses<4.0.0' pyyaml tenacity &&       python /tmp/license_scripts/pull_licenses_py.py ;     fi
 ---> Running in 6634637f2c31
Collecting pip-licenses<4.0.0
  Downloading pip_licenses-3.5.5-py3-none-any.whl (17 kB)
Requirement already satisfied: pyyaml in /usr/local/lib/python3.10/site-packages (6.0)
Requirement already satisfied: tenacity in /usr/local/lib/python3.10/site-packages (5.1.5)
Collecting PTable
  Downloading PTable-0.9.2.tar.gz (31 kB)
  Preparing metadata (setup.py): started
  Preparing metadata (setup.py): finished with status 'done'
Requirement already satisfied: six>=1.9.0 in /usr/local/lib/python3.10/site-packages (from tenacity) (1.16.0)
Building wheels for collected packages: PTable
  Building wheel for PTable (setup.py): started
  Building wheel for PTable (setup.py): finished with status 'done'
  Created wheel for PTable: filename=PTable-0.9.2-py3-none-any.whl size=22908 sha256=2df0dc0df3c3e81a0222becca6fe331d497d707d189622393ee14419d5fc5583
  Stored in directory: /root/.cache/pip/wheels/62/2a/42/c655cf57d84ab59535337af009892aaf16256a813826b465f7
Successfully built PTable
Installing collected packages: PTable, pip-licenses
Successfully installed PTable-0.9.2 pip-licenses-3.5.5
WARNING: Running pip as the 'root' user can result in broken permissions and conflicting behaviour with the system package manager. It is recommended to use a virtual environment instead: https://pip.pypa.io/warnings/venv
INFO:root:Successfully pulled licenses for 135 dependencies
Skip pulling license for  bs4
Removing intermediate container 6634637f2c31
 ---> ea44e40a98f7
Step 29/32 : FROM beam
 ---> 32efd0907d4d
Step 30/32 : ARG pull_licenses
 ---> Running in 6ffdb8ad6b72
Removing intermediate container 6ffdb8ad6b72
 ---> 91929f934f70
Step 31/32 : COPY --from=third_party_licenses /opt/apache/beam/third_party_licenses /opt/apache/beam/third_party_licenses
 ---> b860dabeb571
Step 32/32 : RUN if [ "$pull_licenses" != "true" ] ; then       rm -rf /opt/apache/beam/third_party_licenses ;     fi
 ---> Running in 43a988256d9c
Removing intermediate container 43a988256d9c
 ---> f293857b0af7
Successfully built f293857b0af7
Successfully tagged apache/beam_python3.10_sdk:2.45.0.dev

> Task :runners:google-cloud-dataflow-java:buildAndPushDockerPythonContainer
WARNING: `gcloud docker` will not be supported for Docker client versions above 18.03.

As an alternative, use `gcloud auth configure-docker` to configure `docker` to
use `gcloud` as a credential helper, then use `docker` as you would for non-GCR
registries, e.g. `docker pull gcr.io/project-id/my-image`. Add
`--verbosity=error` to silence this warning: `gcloud docker
--verbosity=error -- pull gcr.io/project-id/my-image`.

See: https://cloud.google.com/container-registry/docs/support/deprecation-notices#gcloud-docker

The push refers to repository [us.gcr.io/apache-beam-testing/java-postcommit-it/python]
a10a5ca025ab: Preparing
ef42f7edc6d2: Preparing
fd3f1cd7cdf2: Preparing
1569d19b9400: Preparing
5ad0635534b2: Preparing
edf3f3272f6e: Preparing
3956d2bc278c: Preparing
6c18b8a563b7: Preparing
957835cae4b0: Preparing
9199448ea870: Preparing
999e063f6898: Preparing
ba129a49bb2f: Preparing
9fcc2003c8cd: Preparing
c547162c87c8: Preparing
89d6344d2aa8: Preparing
404130ce4519: Preparing
17cdb8503b04: Preparing
1cad4dc57058: Preparing
edf3f3272f6e: Waiting
4ff8844d474a: Preparing
b77487480ddb: Preparing
6c18b8a563b7: Waiting
cd247c0fb37b: Preparing
3956d2bc278c: Waiting
957835cae4b0: Waiting
cfdd5c3bd77e: Preparing
870a241bfebd: Preparing
9fcc2003c8cd: Waiting
ba129a49bb2f: Waiting
17cdb8503b04: Waiting
9199448ea870: Waiting
999e063f6898: Waiting
1cad4dc57058: Waiting
404130ce4519: Waiting
b77487480ddb: Waiting
cfdd5c3bd77e: Waiting
cd247c0fb37b: Waiting
c547162c87c8: Waiting
4ff8844d474a: Waiting
89d6344d2aa8: Waiting
fd3f1cd7cdf2: Pushed
5ad0635534b2: Pushed
a10a5ca025ab: Pushed
1569d19b9400: Pushed
ef42f7edc6d2: Pushed
6c18b8a563b7: Pushed
3956d2bc278c: Pushed
957835cae4b0: Pushed
9fcc2003c8cd: Pushed
c547162c87c8: Pushed
89d6344d2aa8: Layer already exists
404130ce4519: Layer already exists
17cdb8503b04: Layer already exists
999e063f6898: Pushed
1cad4dc57058: Layer already exists
4ff8844d474a: Layer already exists
b77487480ddb: Layer already exists
cfdd5c3bd77e: Layer already exists
cd247c0fb37b: Layer already exists
870a241bfebd: Layer already exists
edf3f3272f6e: Pushed
9199448ea870: Pushed
ba129a49bb2f: Pushed
20221207215340: digest: sha256:c6363583e93f715c247d7055664e7616282f84b895bfee2fb5beb552c3fcba44 size: 5156

> Task :runners:google-cloud-dataflow-java:setupXVR

> Task :runners:google-cloud-dataflow-java:validatesCrossLanguageRunnerSetup
Launching Java expansion service @ 34637
Launching Python expansion service @ 40541

> Task :runners:google-cloud-dataflow-java:validatesCrossLanguageRunnerJavaUsingPython

org.apache.beam.sdk.extensions.python.transforms.DataframeTransformTest > testDataframeSum FAILED
    java.lang.RuntimeException at TestDataflowRunner.java:141

16 tests completed, 1 failed, 2 skipped

> Task :runners:google-cloud-dataflow-java:validatesCrossLanguageRunnerJavaUsingPython FAILED
> Task :runners:google-cloud-dataflow-java:cleanupXVR UP-TO-DATE

> Task :runners:google-cloud-dataflow-java:cleanUpDockerPythonImages
Untagged: us.gcr.io/apache-beam-testing/java-postcommit-it/python:20221207215340
Untagged: us.gcr.io/apache-beam-testing/java-postcommit-it/python@sha256:c6363583e93f715c247d7055664e7616282f84b895bfee2fb5beb552c3fcba44
WARNING: Successfully resolved tag to sha256, but it is recommended to use sha256 directly.
Tag: [us.gcr.io/apache-beam-testing/java-postcommit-it/python:20221207215340]
- referencing digest: [us.gcr.io/apache-beam-testing/java-postcommit-it/python@sha256:c6363583e93f715c247d7055664e7616282f84b895bfee2fb5beb552c3fcba44]

Deleted [[us.gcr.io/apache-beam-testing/java-postcommit-it/python:20221207215340] (referencing [us.gcr.io/apache-beam-testing/java-postcommit-it/python@sha256:c6363583e93f715c247d7055664e7616282f84b895bfee2fb5beb552c3fcba44])].
Removing untagged image us.gcr.io/apache-beam-testing/java-postcommit-it/python@sha256:c6363583e93f715c247d7055664e7616282f84b895bfee2fb5beb552c3fcba44
Digests:
- us.gcr.io/apache-beam-testing/java-postcommit-it/python@sha256:c6363583e93f715c247d7055664e7616282f84b895bfee2fb5beb552c3fcba44
Deleted [us.gcr.io/apache-beam-testing/java-postcommit-it/python@sha256:c6363583e93f715c247d7055664e7616282f84b895bfee2fb5beb552c3fcba44].

> Task :runners:google-cloud-dataflow-java:cleanUpDockerJavaImages
Untagged: us.gcr.io/apache-beam-testing/java-postcommit-it/java:20221207215340
Untagged: us.gcr.io/apache-beam-testing/java-postcommit-it/java@sha256:d7ce567d4aa3af9eaf2c561ff7267a29389f228dd0c6368fd46517f49ca4b548
WARNING: Successfully resolved tag to sha256, but it is recommended to use sha256 directly.
Tag: [us.gcr.io/apache-beam-testing/java-postcommit-it/java:20221207215340]
- referencing digest: [us.gcr.io/apache-beam-testing/java-postcommit-it/java@sha256:d7ce567d4aa3af9eaf2c561ff7267a29389f228dd0c6368fd46517f49ca4b548]

Deleted [[us.gcr.io/apache-beam-testing/java-postcommit-it/java:20221207215340] (referencing [us.gcr.io/apache-beam-testing/java-postcommit-it/java@sha256:d7ce567d4aa3af9eaf2c561ff7267a29389f228dd0c6368fd46517f49ca4b548])].
Removing untagged image us.gcr.io/apache-beam-testing/java-postcommit-it/java@sha256:d7ce567d4aa3af9eaf2c561ff7267a29389f228dd0c6368fd46517f49ca4b548
Digests:
- us.gcr.io/apache-beam-testing/java-postcommit-it/java@sha256:d7ce567d4aa3af9eaf2c561ff7267a29389f228dd0c6368fd46517f49ca4b548
Deleted [us.gcr.io/apache-beam-testing/java-postcommit-it/java@sha256:d7ce567d4aa3af9eaf2c561ff7267a29389f228dd0c6368fd46517f49ca4b548].

> Task :runners:google-cloud-dataflow-java:validatesCrossLanguageRunnerCleanup
Stopping expansion service pid: 2972241.
Stopping expansion service pid: 2972242.

FAILURE: Build failed with an exception.

* What went wrong:
Execution failed for task ':runners:google-cloud-dataflow-java:validatesCrossLanguageRunnerJavaUsingPython'.
> There were failing tests. See the report at: file://<https://ci-beam.apache.org/job/beam_PostCommit_XVR_JavaUsingPython_Dataflow/ws/src/runners/google-cloud-dataflow-java/build/reports/tests/validatesCrossLanguageRunnerJavaUsingPython/index.html>

* Try:
> Run with --stacktrace option to get the stack trace.
> Run with --info or --debug option to get more log output.

* Get more help at https://help.gradle.org

Deprecated Gradle features were used in this build, making it incompatible with Gradle 8.0.

You can use '--warning-mode all' to show the individual deprecation warnings and determine if they come from your own scripts or plugins.

See https://docs.gradle.org/7.5.1/userguide/command_line_interface.html#sec:command_line_warnings

Execution optimizations have been disabled for 1 invalid unit(s) of work during this build to ensure correctness.
Please consult deprecation warnings for more details.

BUILD FAILED in 41m 15s
174 actionable tasks: 25 executed, 149 up-to-date

Publishing build scan...
https://gradle.com/s/gfevi3up2kum4

Build step 'Invoke Gradle script' changed build result to FAILURE
Build step 'Invoke Gradle script' marked build as failure

---------------------------------------------------------------------
To unsubscribe, e-mail: builds-unsubscribe@beam.apache.org
For additional commands, e-mail: builds-help@beam.apache.org


Build failed in Jenkins: beam_PostCommit_XVR_JavaUsingPython_Dataflow #1254

Posted by Apache Jenkins Server <je...@builds.apache.org>.
See <https://ci-beam.apache.org/job/beam_PostCommit_XVR_JavaUsingPython_Dataflow/1254/display/redirect>

Changes:


------------------------------------------
[...truncated 95.76 KB...]
github.com/apache/beam/sdks/v2/go/pkg/beam,https://github.com/apache/beam/blob/sdks/v2.43.0/sdks/go/README.md,Apache-2.0
github.com/apache/beam/sdks/v2/java/container,https://github.com/apache/beam/blob/sdks/v2.43.0/sdks/LICENSE,Apache-2.0
github.com/golang/protobuf,https://github.com/golang/protobuf/blob/v1.5.2/LICENSE,BSD-3-Clause
golang.org/x/net,https://cs.opensource.google/go/x/net/+/0b7e1fb9:LICENSE,BSD-3-Clause
golang.org/x/sys,https://cs.opensource.google/go/x/sys/+/3c1f3524:LICENSE,BSD-3-Clause
golang.org/x/text,https://cs.opensource.google/go/x/text/+/v0.4.0:LICENSE,BSD-3-Clause
google.golang.org/genproto/googleapis/rpc/status,https://github.com/googleapis/go-genproto/blob/15ba04fc1c0e/LICENSE,Apache-2.0
google.golang.org/grpc,https://github.com/grpc/grpc-go/blob/v1.50.1/LICENSE,Apache-2.0
google.golang.org/protobuf,https://github.com/protocolbuffers/protobuf-go/blob/v1.28.1/LICENSE,BSD-3-Clause
+ chmod -R a+w /output/licenses

> Task :release:go-licenses:py:dockerRun
+ rm -rf '/output/*'
+ go get github.com/apache/beam/sdks/v2/python/container
go: downloading github.com/apache/beam/sdks/v2 v2.43.0
go: downloading github.com/apache/beam v2.43.0+incompatible
go: downloading github.com/golang/protobuf v1.5.2
go: downloading github.com/nightlyone/lockfile v1.0.0
go: downloading google.golang.org/grpc v1.50.1
go: downloading google.golang.org/protobuf v1.28.1
go: downloading golang.org/x/net v0.0.0-20221012135044-0b7e1fb9d458
go: downloading google.golang.org/genproto v0.0.0-20221010155953-15ba04fc1c0e
go: downloading golang.org/x/sys v0.0.0-20220728004956-3c1f35247d10
go: added github.com/apache/beam/sdks/v2 v2.43.0
go: added github.com/golang/protobuf v1.5.2
go: added github.com/nightlyone/lockfile v1.0.0
go: added golang.org/x/net v0.0.0-20221012135044-0b7e1fb9d458
go: added golang.org/x/sys v0.0.0-20220728004956-3c1f35247d10
go: added golang.org/x/text v0.4.0
go: added google.golang.org/genproto v0.0.0-20221010155953-15ba04fc1c0e
go: added google.golang.org/grpc v1.50.1
go: added google.golang.org/protobuf v1.28.1
+ go-licenses save github.com/apache/beam/sdks/v2/python/container --save_path=/output/licenses
W1207 15:10:54.989820      35 library.go:101] "golang.org/x/sys/unix" contains non-Go code that can't be inspected for further dependencies:
/go/pkg/mod/golang.org/x/sys@v0.0.0-20220728004956-3c1f35247d10/unix/asm_linux_amd64.s
+ go-licenses csv github.com/apache/beam/sdks/v2/python/container
+ tee /output/licenses/list.csv
W1207 15:10:59.168666      80 library.go:101] "golang.org/x/sys/unix" contains non-Go code that can't be inspected for further dependencies:
/go/pkg/mod/golang.org/x/sys@v0.0.0-20220728004956-3c1f35247d10/unix/asm_linux_amd64.s
github.com/apache/beam/sdks/v2/go/pkg/beam,https://github.com/apache/beam/blob/sdks/v2.43.0/sdks/go/README.md,Apache-2.0
github.com/apache/beam/sdks/v2/python/container,https://github.com/apache/beam/blob/sdks/v2.43.0/sdks/LICENSE,Apache-2.0
github.com/golang/protobuf,https://github.com/golang/protobuf/blob/v1.5.2/LICENSE,BSD-3-Clause
github.com/nightlyone/lockfile,https://github.com/nightlyone/lockfile/blob/v1.0.0/LICENSE,MIT
golang.org/x/net,https://cs.opensource.google/go/x/net/+/0b7e1fb9:LICENSE,BSD-3-Clause
golang.org/x/sys,https://cs.opensource.google/go/x/sys/+/3c1f3524:LICENSE,BSD-3-Clause
golang.org/x/text,https://cs.opensource.google/go/x/text/+/v0.4.0:LICENSE,BSD-3-Clause
google.golang.org/genproto/googleapis/rpc/status,https://github.com/googleapis/go-genproto/blob/15ba04fc1c0e/LICENSE,Apache-2.0
google.golang.org/grpc,https://github.com/grpc/grpc-go/blob/v1.50.1/LICENSE,Apache-2.0
google.golang.org/protobuf,https://github.com/protocolbuffers/protobuf-go/blob/v1.28.1/LICENSE,BSD-3-Clause
+ chmod -R a+w /output/licenses

> Task :release:go-licenses:java:createLicenses
> Task :sdks:java:container:java8:copyGolangLicenses
> Task :release:go-licenses:py:createLicenses
> Task :sdks:python:container:py37:copyGolangLicenses
> Task :sdks:python:container:py37:dockerPrepare
> Task :sdks:java:container:java8:dockerPrepare
> Task :sdks:java:container:java8:docker

> Task :runners:google-cloud-dataflow-java:buildAndPushDockerJavaContainer
WARNING: `gcloud docker` will not be supported for Docker client versions above 18.03.

As an alternative, use `gcloud auth configure-docker` to configure `docker` to
use `gcloud` as a credential helper, then use `docker` as you would for non-GCR
registries, e.g. `docker pull gcr.io/project-id/my-image`. Add
`--verbosity=error` to silence this warning: `gcloud docker
--verbosity=error -- pull gcr.io/project-id/my-image`.

See: https://cloud.google.com/container-registry/docs/support/deprecation-notices#gcloud-docker

4059b52aaedd: Pushed
9e7906276246: Pushed
bafa807eb2bf: Pushed
4aef23daf330: Pushed
d5a84e832611: Pushed
6b5aaff44254: Layer already exists
b626401ef603: Layer already exists
53a0b163e995: Layer already exists
9b55156abf26: Layer already exists
293d5db30c9f: Layer already exists
03127cdb479b: Layer already exists
9c742cd6c7a5: Layer already exists
48b06b364e71: Pushed
fbb8ae3649a9: Pushed
8f6d09cbc7b0: Pushed
20221207150953: digest: sha256:77f735edc6aaf86835d3591e969e075957c66d1ff8ac349dc71a3f3c57bd075c size: 4934

> Task :sdks:python:container:py37:docker
Collecting absl-py==1.3.0
  Downloading absl_py-1.3.0-py3-none-any.whl (124 kB)
     ━━━━━━━━━━━━━━━━━━━━━━━━━━━━━━━━━━━━━━━ 124.6/124.6 KB 4.9 MB/s eta 0:00:00
Collecting astunparse==1.6.3
  Downloading astunparse-1.6.3-py2.py3-none-any.whl (12 kB)
Collecting attrs==22.1.0
  Downloading attrs-22.1.0-py2.py3-none-any.whl (58 kB)
     ━━━━━━━━━━━━━━━━━━━━━━━━━━━━━━━━━━━━━━━━ 58.8/58.8 KB 10.0 MB/s eta 0:00:00
Collecting beautifulsoup4==4.11.1
  Downloading beautifulsoup4-4.11.1-py3-none-any.whl (128 kB)
     ━━━━━━━━━━━━━━━━━━━━━━━━━━━━━━━━━━━━━━ 128.2/128.2 KB 19.9 MB/s eta 0:00:00
Collecting bs4==0.0.1
  Downloading bs4-0.0.1.tar.gz (1.1 kB)
  Preparing metadata (setup.py): started
  Preparing metadata (setup.py): finished with status 'done'
Collecting CacheControl==0.12.11
  Downloading CacheControl-0.12.11-py2.py3-none-any.whl (21 kB)
Collecting cachetools==4.2.4
  Downloading cachetools-4.2.4-py3-none-any.whl (10 kB)
Collecting certifi==2022.9.24
  Downloading certifi-2022.9.24-py3-none-any.whl (161 kB)
     ━━━━━━━━━━━━━━━━━━━━━━━━━━━━━━━━━━━━━━ 161.1/161.1 KB 20.1 MB/s eta 0:00:00
Collecting cffi==1.15.1
  Downloading cffi-1.15.1-cp37-cp37m-manylinux_2_17_x86_64.manylinux2014_x86_64.whl (427 kB)
     ━━━━━━━━━━━━━━━━━━━━━━━━━━━━━━━━━━━━━━ 427.9/427.9 KB 26.8 MB/s eta 0:00:00
Collecting charset-normalizer==2.1.1
  Downloading charset_normalizer-2.1.1-py3-none-any.whl (39 kB)
Collecting click==8.1.3
  Downloading click-8.1.3-py3-none-any.whl (96 kB)
     ━━━━━━━━━━━━━━━━━━━━━━━━━━━━━━━━━━━━━━━━ 96.6/96.6 KB 16.9 MB/s eta 0:00:00
Collecting cloudpickle==2.2.0
  Downloading cloudpickle-2.2.0-py3-none-any.whl (25 kB)
Collecting crcmod==1.7
  Downloading crcmod-1.7.tar.gz (89 kB)
     ━━━━━━━━━━━━━━━━━━━━━━━━━━━━━━━━━━━━━━━━ 89.7/89.7 KB 16.5 MB/s eta 0:00:00
  Preparing metadata (setup.py): started

> Task :runners:google-cloud-dataflow-java:buildAndPushDockerPythonContainer
WARNING: `gcloud docker` will not be supported for Docker client versions above 18.03.

As an alternative, use `gcloud auth configure-docker` to configure `docker` to
use `gcloud` as a credential helper, then use `docker` as you would for non-GCR
registries, e.g. `docker pull gcr.io/project-id/my-image`. Add
`--verbosity=error` to silence this warning: `gcloud docker
--verbosity=error -- pull gcr.io/project-id/my-image`.

See: https://cloud.google.com/container-registry/docs/support/deprecation-notices#gcloud-docker


> Task :runners:google-cloud-dataflow-java:setupXVR
> Task :runners:google-cloud-dataflow-java:validatesCrossLanguageRunnerSetup
> Task :runners:google-cloud-dataflow-java:validatesCrossLanguageRunnerJavaUsingPython

org.apache.beam.runners.core.construction.ValidateRunnerXlangTest$CombinePerKeyTest > test FAILED
    java.lang.RuntimeException at TestDataflowRunner.java:141

org.apache.beam.runners.core.construction.ValidateRunnerXlangTest$FlattenTest > test FAILED
    java.lang.RuntimeException at TestDataflowRunner.java:141

org.apache.beam.runners.core.construction.ValidateRunnerXlangTest$GroupByKeyTest > test FAILED
    java.lang.RuntimeException at TestDataflowRunner.java:141

org.apache.beam.runners.core.construction.ValidateRunnerXlangTest$PythonDependenciesTest > test FAILED
    java.lang.RuntimeException at TestDataflowRunner.java:141

org.apache.beam.runners.core.construction.ValidateRunnerXlangTest$CombineGloballyTest > test FAILED
    java.lang.RuntimeException at TestDataflowRunner.java:141

org.apache.beam.runners.core.construction.ValidateRunnerXlangTest$MultiInputOutputWithSideInputTest > test FAILED
    java.lang.RuntimeException at TestDataflowRunner.java:141

org.apache.beam.runners.core.construction.ValidateRunnerXlangTest$PartitionTest > test FAILED
    java.lang.RuntimeException at TestDataflowRunner.java:141

org.apache.beam.runners.core.construction.ValidateRunnerXlangTest$CoGroupByKeyTest > test FAILED
    java.lang.RuntimeException at TestDataflowRunner.java:141

org.apache.beam.sdk.extensions.python.transforms.PythonMapTest > testPythonMap FAILED
    java.lang.RuntimeException at TestDataflowRunner.java:141

org.apache.beam.sdk.extensions.python.transforms.RunInferenceTransformTest > testRunInferenceWithKVs FAILED
    java.lang.RuntimeException at TestDataflowRunner.java:141

org.apache.beam.runners.core.construction.ValidateRunnerXlangTest$SingleInputOutputTest > test FAILED
    java.lang.RuntimeException at TestDataflowRunner.java:141

org.apache.beam.sdk.extensions.python.transforms.DataframeTransformTest > testDataframeSum FAILED
    java.lang.RuntimeException at TestDataflowRunner.java:141

org.apache.beam.sdk.extensions.python.transforms.PythonMapTest > testPythonFlatMap FAILED
    java.lang.RuntimeException at TestDataflowRunner.java:141

org.apache.beam.sdk.extensions.python.transforms.RunInferenceTransformTest > testRunInference FAILED
    java.lang.RuntimeException at TestDataflowRunner.java:141

16 tests completed, 14 failed, 2 skipped

> Task :runners:google-cloud-dataflow-java:validatesCrossLanguageRunnerJavaUsingPython FAILED
> Task :runners:google-cloud-dataflow-java:cleanupXVR UP-TO-DATE

> Task :runners:google-cloud-dataflow-java:cleanUpDockerPythonImages
WARNING: Successfully resolved tag to sha256, but it is recommended to use sha256 directly.
Tag: [us.gcr.io/apache-beam-testing/java-postcommit-it/python:20221207150953]
- referencing digest: [us.gcr.io/apache-beam-testing/java-postcommit-it/python@sha256:8f183b19e345ba74d79908cfe518a9f1de79cbc904960748230fc532f4b65d40]

Deleted [[us.gcr.io/apache-beam-testing/java-postcommit-it/python:20221207150953] (referencing [us.gcr.io/apache-beam-testing/java-postcommit-it/python@sha256:8f183b19e345ba74d79908cfe518a9f1de79cbc904960748230fc532f4b65d40])].
Digests:
- us.gcr.io/apache-beam-testing/java-postcommit-it/python@sha256:8f183b19e345ba74d79908cfe518a9f1de79cbc904960748230fc532f4b65d40
Deleted [us.gcr.io/apache-beam-testing/java-postcommit-it/python@sha256:8f183b19e345ba74d79908cfe518a9f1de79cbc904960748230fc532f4b65d40].

> Task :runners:google-cloud-dataflow-java:cleanUpDockerJavaImages FAILED
ERROR: (gcloud.container.images.untag) Image could not be found: [us.gcr.io/apache-beam-testing/java-postcommit-it/java:20221207150953]

> Task :runners:google-cloud-dataflow-java:validatesCrossLanguageRunnerCleanup

FAILURE: Build completed with 2 failures.

1: Task failed with an exception.
-----------
* What went wrong:
Execution failed for task ':runners:google-cloud-dataflow-java:validatesCrossLanguageRunnerJavaUsingPython'.
> There were failing tests. See the report at: file://<https://ci-beam.apache.org/job/beam_PostCommit_XVR_JavaUsingPython_Dataflow/ws/src/runners/google-cloud-dataflow-java/build/reports/tests/validatesCrossLanguageRunnerJavaUsingPython/index.html>

* Try:
> Run with --stacktrace option to get the stack trace.
> Run with --info or --debug option to get more log output.
==============================================================================

2: Task failed with an exception.
-----------
* Where:
Build file '<https://ci-beam.apache.org/job/beam_PostCommit_XVR_JavaUsingPython_Dataflow/ws/src/runners/google-cloud-dataflow-java/build.gradle'> line: 300

* What went wrong:
Execution failed for task ':runners:google-cloud-dataflow-java:cleanUpDockerJavaImages'.
> Process 'command 'gcloud'' finished with non-zero exit value 1

* Try:
> Run with --stacktrace option to get the stack trace.
> Run with --info or --debug option to get more log output.
==============================================================================

* Get more help at https://help.gradle.org

Deprecated Gradle features were used in this build, making it incompatible with Gradle 8.0.

You can use '--warning-mode all' to show the individual deprecation warnings and determine if they come from your own scripts or plugins.

See https://docs.gradle.org/7.5.1/userguide/command_line_interface.html#sec:command_line_warnings

Execution optimizations have been disabled for 1 invalid unit(s) of work during this build to ensure correctness.
Please consult deprecation warnings for more details.

BUILD FAILED in 47m 41s
184 actionable tasks: 121 executed, 57 from cache, 6 up-to-date

Publishing build scan...
https://gradle.com/s/stja577xfjukm

Build step 'Invoke Gradle script' changed build result to FAILURE
Build step 'Invoke Gradle script' marked build as failure

---------------------------------------------------------------------
To unsubscribe, e-mail: builds-unsubscribe@beam.apache.org
For additional commands, e-mail: builds-help@beam.apache.org


Build failed in Jenkins: beam_PostCommit_XVR_JavaUsingPython_Dataflow #1253

Posted by Apache Jenkins Server <je...@builds.apache.org>.
See <https://ci-beam.apache.org/job/beam_PostCommit_XVR_JavaUsingPython_Dataflow/1253/display/redirect>

Changes:


------------------------------------------
[...truncated 1.10 MB...]
scipy==1.9.3
setuptools==65.6.3
six==1.16.0
sortedcontainers==2.4.0
soupsieve==2.3.2.post1
SQLAlchemy==1.4.42
sqlparse==0.4.3
tenacity==5.1.5
tensorboard==2.10.1
tensorboard-data-server==0.6.1
tensorboard-plugin-wit==1.8.1
tensorflow==2.10.0
tensorflow-estimator==2.10.0
tensorflow-io-gcs-filesystem==0.27.0
termcolor==2.0.1
testcontainers==3.7.0
threadpoolctl==3.1.0
tomli==2.0.1
tqdm==4.64.1
typing_extensions==4.4.0
uritemplate==4.1.1
urllib3==1.26.12
websocket-client==1.4.1
Werkzeug==2.2.2
wheel==0.38.4
wrapt==1.14.1
zstandard==0.18.0
Removing intermediate container a6206b8ea3fa
 ---> 3b50ea1456c3
Step 17/32 : COPY target/LICENSE /opt/apache/beam/
 ---> 88fea8eef840
Step 18/32 : COPY target/LICENSE.python /opt/apache/beam/
 ---> 4f91656853f4
Step 19/32 : COPY target/NOTICE /opt/apache/beam/
 ---> fe966cc7e682
Step 20/32 : COPY target/launcher/linux_amd64/boot /opt/apache/beam/
 ---> a4f0a470577e
Step 21/32 : ENTRYPOINT ["/opt/apache/beam/boot"]
 ---> Running in 0f88dec76da1
Removing intermediate container 0f88dec76da1
 ---> a6df6ad8ca95
Step 22/32 : FROM beam as third_party_licenses
 ---> a6df6ad8ca95
Step 23/32 : ARG pull_licenses
 ---> Running in 777de3605a00
Removing intermediate container 777de3605a00
 ---> b0e7a31efc55
Step 24/32 : COPY target/license_scripts /tmp/license_scripts/
 ---> fd4650a869a6
Step 25/32 : COPY target/LICENSE target/go-licenses/* /opt/apache/beam/third_party_licenses/golang/
 ---> 4176e9cafd2f
Step 26/32 : RUN rm /opt/apache/beam/third_party_licenses/golang/LICENSE
 ---> Running in 5e08b9d87f8f
Removing intermediate container 5e08b9d87f8f
 ---> 69ec05e22703
Step 27/32 : COPY target/license_scripts /tmp/license_scripts/
 ---> 408cc8f6a90f
Step 28/32 : RUN if [ "$pull_licenses" = "true" ] ; then       pip install 'pip-licenses<4.0.0' pyyaml tenacity &&       python /tmp/license_scripts/pull_licenses_py.py ;     fi
 ---> Running in 980509b12759
Collecting pip-licenses<4.0.0
  Downloading pip_licenses-3.5.5-py3-none-any.whl (17 kB)
Requirement already satisfied: pyyaml in /usr/local/lib/python3.10/site-packages (6.0)
Requirement already satisfied: tenacity in /usr/local/lib/python3.10/site-packages (5.1.5)
Collecting PTable
  Downloading PTable-0.9.2.tar.gz (31 kB)
  Preparing metadata (setup.py): started
  Preparing metadata (setup.py): finished with status 'done'
Requirement already satisfied: six>=1.9.0 in /usr/local/lib/python3.10/site-packages (from tenacity) (1.16.0)
Building wheels for collected packages: PTable
  Building wheel for PTable (setup.py): started
  Building wheel for PTable (setup.py): finished with status 'done'
  Created wheel for PTable: filename=PTable-0.9.2-py3-none-any.whl size=22908 sha256=125d649113b1fe2a5fc19a706d0c22dddcf19f96c53f6e5d0781d6585257f66c
  Stored in directory: /root/.cache/pip/wheels/62/2a/42/c655cf57d84ab59535337af009892aaf16256a813826b465f7
Successfully built PTable
Installing collected packages: PTable, pip-licenses
Successfully installed PTable-0.9.2 pip-licenses-3.5.5
WARNING: Running pip as the 'root' user can result in broken permissions and conflicting behaviour with the system package manager. It is recommended to use a virtual environment instead: https://pip.pypa.io/warnings/venv
Skip pulling license for  bs4
INFO:root:Successfully pulled licenses for 135 dependencies
Removing intermediate container 980509b12759
 ---> ae5817a8d9c2
Step 29/32 : FROM beam
 ---> a6df6ad8ca95
Step 30/32 : ARG pull_licenses
 ---> Running in ebf130e2973b
Removing intermediate container ebf130e2973b
 ---> 51ed58949773
Step 31/32 : COPY --from=third_party_licenses /opt/apache/beam/third_party_licenses /opt/apache/beam/third_party_licenses
 ---> 3d9c43b3dd3f
Step 32/32 : RUN if [ "$pull_licenses" != "true" ] ; then       rm -rf /opt/apache/beam/third_party_licenses ;     fi
 ---> Running in 2bcf314b2a50
Removing intermediate container 2bcf314b2a50
 ---> 56f2298e0cd4
Successfully built 56f2298e0cd4
Successfully tagged apache/beam_python3.10_sdk:2.45.0.dev

> Task :runners:google-cloud-dataflow-java:buildAndPushDockerPythonContainer
WARNING: `gcloud docker` will not be supported for Docker client versions above 18.03.

As an alternative, use `gcloud auth configure-docker` to configure `docker` to
use `gcloud` as a credential helper, then use `docker` as you would for non-GCR
registries, e.g. `docker pull gcr.io/project-id/my-image`. Add
`--verbosity=error` to silence this warning: `gcloud docker
--verbosity=error -- pull gcr.io/project-id/my-image`.

See: https://cloud.google.com/container-registry/docs/support/deprecation-notices#gcloud-docker

The push refers to repository [us.gcr.io/apache-beam-testing/java-postcommit-it/python]
c06db805f1ce: Preparing
4886c2ff4024: Preparing
712a83370639: Preparing
03b8386195c8: Preparing
b616378b964f: Preparing
aa67bd5618dc: Preparing
5c49149d3f0e: Preparing
532c882fe9a0: Preparing
546c2fe21fb1: Preparing
4d7aa687f98a: Preparing
02d9f8528e4c: Preparing
ebdff1af7038: Preparing
781f91eeb759: Preparing
9ed0b9d0c1f8: Preparing
aa67bd5618dc: Waiting
89d6344d2aa8: Preparing
404130ce4519: Preparing
17cdb8503b04: Preparing
1cad4dc57058: Preparing
5c49149d3f0e: Waiting
4ff8844d474a: Preparing
b77487480ddb: Preparing
532c882fe9a0: Waiting
cd247c0fb37b: Preparing
02d9f8528e4c: Waiting
cfdd5c3bd77e: Preparing
870a241bfebd: Preparing
ebdff1af7038: Waiting
9ed0b9d0c1f8: Waiting
546c2fe21fb1: Waiting
781f91eeb759: Waiting
404130ce4519: Waiting
4d7aa687f98a: Waiting
89d6344d2aa8: Waiting
17cdb8503b04: Waiting
b77487480ddb: Waiting
cfdd5c3bd77e: Waiting
4ff8844d474a: Waiting
870a241bfebd: Waiting
cd247c0fb37b: Waiting
1cad4dc57058: Waiting
03b8386195c8: Pushed
712a83370639: Pushed
b616378b964f: Pushed
c06db805f1ce: Pushed
4886c2ff4024: Pushed
532c882fe9a0: Pushed
546c2fe21fb1: Pushed
5c49149d3f0e: Pushed
781f91eeb759: Pushed
9ed0b9d0c1f8: Pushed
89d6344d2aa8: Layer already exists
02d9f8528e4c: Pushed
404130ce4519: Layer already exists
17cdb8503b04: Layer already exists
1cad4dc57058: Layer already exists
4ff8844d474a: Layer already exists
b77487480ddb: Layer already exists
cd247c0fb37b: Layer already exists
870a241bfebd: Layer already exists
cfdd5c3bd77e: Layer already exists
aa67bd5618dc: Pushed
4d7aa687f98a: Pushed
ebdff1af7038: Pushed
20221207095305: digest: sha256:51afd0d6a0a23549ea32c225ef4e3706d47ccc05b1c97fd363ac62acb9854f30 size: 5156

> Task :runners:google-cloud-dataflow-java:setupXVR

> Task :runners:google-cloud-dataflow-java:validatesCrossLanguageRunnerSetup
Launching Java expansion service @ 45347
Launching Python expansion service @ 42137

> Task :runners:google-cloud-dataflow-java:validatesCrossLanguageRunnerJavaUsingPython

org.apache.beam.sdk.extensions.python.transforms.DataframeTransformTest > testDataframeSum FAILED
    java.lang.RuntimeException at TestDataflowRunner.java:141

16 tests completed, 1 failed, 2 skipped

> Task :runners:google-cloud-dataflow-java:validatesCrossLanguageRunnerJavaUsingPython FAILED
> Task :runners:google-cloud-dataflow-java:cleanupXVR UP-TO-DATE

> Task :runners:google-cloud-dataflow-java:cleanUpDockerPythonImages
Untagged: us.gcr.io/apache-beam-testing/java-postcommit-it/python:20221207095305
Untagged: us.gcr.io/apache-beam-testing/java-postcommit-it/python@sha256:51afd0d6a0a23549ea32c225ef4e3706d47ccc05b1c97fd363ac62acb9854f30
WARNING: Successfully resolved tag to sha256, but it is recommended to use sha256 directly.
Tag: [us.gcr.io/apache-beam-testing/java-postcommit-it/python:20221207095305]
- referencing digest: [us.gcr.io/apache-beam-testing/java-postcommit-it/python@sha256:51afd0d6a0a23549ea32c225ef4e3706d47ccc05b1c97fd363ac62acb9854f30]

Deleted [[us.gcr.io/apache-beam-testing/java-postcommit-it/python:20221207095305] (referencing [us.gcr.io/apache-beam-testing/java-postcommit-it/python@sha256:51afd0d6a0a23549ea32c225ef4e3706d47ccc05b1c97fd363ac62acb9854f30])].
Removing untagged image us.gcr.io/apache-beam-testing/java-postcommit-it/python@sha256:51afd0d6a0a23549ea32c225ef4e3706d47ccc05b1c97fd363ac62acb9854f30
Digests:
- us.gcr.io/apache-beam-testing/java-postcommit-it/python@sha256:51afd0d6a0a23549ea32c225ef4e3706d47ccc05b1c97fd363ac62acb9854f30
Deleted [us.gcr.io/apache-beam-testing/java-postcommit-it/python@sha256:51afd0d6a0a23549ea32c225ef4e3706d47ccc05b1c97fd363ac62acb9854f30].

> Task :runners:google-cloud-dataflow-java:cleanUpDockerJavaImages
Untagged: us.gcr.io/apache-beam-testing/java-postcommit-it/java:20221207095305
Untagged: us.gcr.io/apache-beam-testing/java-postcommit-it/java@sha256:ed33bc3cb221c8427312468aea0591612618971f7327ee8f7ab222db1ba38394
WARNING: Successfully resolved tag to sha256, but it is recommended to use sha256 directly.
Tag: [us.gcr.io/apache-beam-testing/java-postcommit-it/java:20221207095305]
- referencing digest: [us.gcr.io/apache-beam-testing/java-postcommit-it/java@sha256:ed33bc3cb221c8427312468aea0591612618971f7327ee8f7ab222db1ba38394]

Deleted [[us.gcr.io/apache-beam-testing/java-postcommit-it/java:20221207095305] (referencing [us.gcr.io/apache-beam-testing/java-postcommit-it/java@sha256:ed33bc3cb221c8427312468aea0591612618971f7327ee8f7ab222db1ba38394])].
Removing untagged image us.gcr.io/apache-beam-testing/java-postcommit-it/java@sha256:ed33bc3cb221c8427312468aea0591612618971f7327ee8f7ab222db1ba38394
Digests:
- us.gcr.io/apache-beam-testing/java-postcommit-it/java@sha256:ed33bc3cb221c8427312468aea0591612618971f7327ee8f7ab222db1ba38394
Deleted [us.gcr.io/apache-beam-testing/java-postcommit-it/java@sha256:ed33bc3cb221c8427312468aea0591612618971f7327ee8f7ab222db1ba38394].

> Task :runners:google-cloud-dataflow-java:validatesCrossLanguageRunnerCleanup
Stopping expansion service pid: 1785321.
Stopping expansion service pid: 1785322.

FAILURE: Build failed with an exception.

* What went wrong:
Execution failed for task ':runners:google-cloud-dataflow-java:validatesCrossLanguageRunnerJavaUsingPython'.
> There were failing tests. See the report at: file://<https://ci-beam.apache.org/job/beam_PostCommit_XVR_JavaUsingPython_Dataflow/ws/src/runners/google-cloud-dataflow-java/build/reports/tests/validatesCrossLanguageRunnerJavaUsingPython/index.html>

* Try:
> Run with --stacktrace option to get the stack trace.
> Run with --info or --debug option to get more log output.

* Get more help at https://help.gradle.org

Deprecated Gradle features were used in this build, making it incompatible with Gradle 8.0.

You can use '--warning-mode all' to show the individual deprecation warnings and determine if they come from your own scripts or plugins.

See https://docs.gradle.org/7.5.1/userguide/command_line_interface.html#sec:command_line_warnings

Execution optimizations have been disabled for 1 invalid unit(s) of work during this build to ensure correctness.
Please consult deprecation warnings for more details.

BUILD FAILED in 43m 7s
174 actionable tasks: 25 executed, 149 up-to-date

Publishing build scan...
https://gradle.com/s/ptys4skel2rki

Build step 'Invoke Gradle script' changed build result to FAILURE
Build step 'Invoke Gradle script' marked build as failure

---------------------------------------------------------------------
To unsubscribe, e-mail: builds-unsubscribe@beam.apache.org
For additional commands, e-mail: builds-help@beam.apache.org


Build failed in Jenkins: beam_PostCommit_XVR_JavaUsingPython_Dataflow #1252

Posted by Apache Jenkins Server <je...@builds.apache.org>.
See <https://ci-beam.apache.org/job/beam_PostCommit_XVR_JavaUsingPython_Dataflow/1252/display/redirect?page=changes>

Changes:

[noreply] Revert "Bump actions/setup-java from 3.6.0 to 3.7.0 (#24484)" (#24551)

[noreply] Interface{}->any for more subfolders (#24553)

[Kenneth Knowles] Support multiple gradle tasks in one precommit job

[Kenneth Knowles] Split up some IOs from Java PreCommit


------------------------------------------
[...truncated 1.10 MB...]
Step 19/32 : COPY target/NOTICE /opt/apache/beam/
 ---> e6422bec1f62
Step 20/32 : COPY target/launcher/linux_amd64/boot /opt/apache/beam/
 ---> 98c71851e366
Step 21/32 : ENTRYPOINT ["/opt/apache/beam/boot"]
 ---> Running in a282ea99f74b
Removing intermediate container a282ea99f74b
 ---> 61d73a899879
Step 22/32 : FROM beam as third_party_licenses
 ---> 61d73a899879
Step 23/32 : ARG pull_licenses
 ---> Running in d44508e01559
Removing intermediate container d44508e01559
 ---> d0f533bb5ed5
Step 24/32 : COPY target/license_scripts /tmp/license_scripts/
 ---> 5a212db722d3
Step 25/32 : COPY target/LICENSE target/go-licenses/* /opt/apache/beam/third_party_licenses/golang/
 ---> f1fe9575c96f
Step 26/32 : RUN rm /opt/apache/beam/third_party_licenses/golang/LICENSE
 ---> Running in 4b32effaf378
Removing intermediate container 4b32effaf378
 ---> 023037ff0e41
Step 27/32 : COPY target/license_scripts /tmp/license_scripts/
 ---> 6e878067781f
Step 28/32 : RUN if [ "$pull_licenses" = "true" ] ; then       pip install 'pip-licenses<4.0.0' pyyaml tenacity &&       python /tmp/license_scripts/pull_licenses_py.py ;     fi
 ---> Running in c90194f9f40c
Collecting pip-licenses<4.0.0
  Downloading pip_licenses-3.5.5-py3-none-any.whl (17 kB)
Requirement already satisfied: pyyaml in /usr/local/lib/python3.10/site-packages (6.0)
Requirement already satisfied: tenacity in /usr/local/lib/python3.10/site-packages (5.1.5)
Collecting PTable
  Downloading PTable-0.9.2.tar.gz (31 kB)
  Preparing metadata (setup.py): started
  Preparing metadata (setup.py): finished with status 'done'
Requirement already satisfied: six>=1.9.0 in /usr/local/lib/python3.10/site-packages (from tenacity) (1.16.0)
Building wheels for collected packages: PTable
  Building wheel for PTable (setup.py): started
  Building wheel for PTable (setup.py): finished with status 'done'
  Created wheel for PTable: filename=PTable-0.9.2-py3-none-any.whl size=22908 sha256=c12b5016a816b667d3878c32ff6de082c9ab052962ab0f1b7a90a560f8931709
  Stored in directory: /root/.cache/pip/wheels/62/2a/42/c655cf57d84ab59535337af009892aaf16256a813826b465f7
Successfully built PTable
Installing collected packages: PTable, pip-licenses
Successfully installed PTable-0.9.2 pip-licenses-3.5.5
WARNING: Running pip as the 'root' user can result in broken permissions and conflicting behaviour with the system package manager. It is recommended to use a virtual environment instead: https://pip.pypa.io/warnings/venv
Skip pulling license for  bs4
INFO:root:Successfully pulled licenses for 135 dependencies
Removing intermediate container c90194f9f40c
 ---> a910671cc6fd
Step 29/32 : FROM beam
 ---> 61d73a899879
Step 30/32 : ARG pull_licenses
 ---> Running in 73cd812d7ec8
Removing intermediate container 73cd812d7ec8
 ---> 7140ff9c4e10
Step 31/32 : COPY --from=third_party_licenses /opt/apache/beam/third_party_licenses /opt/apache/beam/third_party_licenses
 ---> 8aa86d246935
Step 32/32 : RUN if [ "$pull_licenses" != "true" ] ; then       rm -rf /opt/apache/beam/third_party_licenses ;     fi
 ---> Running in ce25122bc287
Removing intermediate container ce25122bc287
 ---> 13614e72c889
Successfully built 13614e72c889
Successfully tagged apache/beam_python3.10_sdk:2.45.0.dev

> Task :runners:google-cloud-dataflow-java:buildAndPushDockerPythonContainer
WARNING: `gcloud docker` will not be supported for Docker client versions above 18.03.

As an alternative, use `gcloud auth configure-docker` to configure `docker` to
use `gcloud` as a credential helper, then use `docker` as you would for non-GCR
registries, e.g. `docker pull gcr.io/project-id/my-image`. Add
`--verbosity=error` to silence this warning: `gcloud docker
--verbosity=error -- pull gcr.io/project-id/my-image`.

See: https://cloud.google.com/container-registry/docs/support/deprecation-notices#gcloud-docker

The push refers to repository [us.gcr.io/apache-beam-testing/java-postcommit-it/python]
dc71cb339c2a: Preparing
cd1a001f1031: Preparing
3704be7ada5f: Preparing
4e3df8fb0425: Preparing
869ba6b97384: Preparing
3ac3cf89acab: Preparing
22f1954c0ff9: Preparing
8ab7ed7f23ca: Preparing
01b199e30c2d: Preparing
c7cc0e654b7b: Preparing
233460b08b22: Preparing
163549ced801: Preparing
60b00af5ef61: Preparing
edfc5145749a: Preparing
89d6344d2aa8: Preparing
404130ce4519: Preparing
17cdb8503b04: Preparing
1cad4dc57058: Preparing
4ff8844d474a: Preparing
b77487480ddb: Preparing
cd247c0fb37b: Preparing
cfdd5c3bd77e: Preparing
870a241bfebd: Preparing
22f1954c0ff9: Waiting
8ab7ed7f23ca: Waiting
cd247c0fb37b: Waiting
01b199e30c2d: Waiting
cfdd5c3bd77e: Waiting
17cdb8503b04: Waiting
870a241bfebd: Waiting
c7cc0e654b7b: Waiting
1cad4dc57058: Waiting
233460b08b22: Waiting
4ff8844d474a: Waiting
edfc5145749a: Waiting
60b00af5ef61: Waiting
b77487480ddb: Waiting
163549ced801: Waiting
89d6344d2aa8: Waiting
3ac3cf89acab: Waiting
4e3df8fb0425: Pushed
3704be7ada5f: Pushed
dc71cb339c2a: Pushed
869ba6b97384: Pushed
cd1a001f1031: Pushed
01b199e30c2d: Pushed
22f1954c0ff9: Pushed
8ab7ed7f23ca: Pushed
60b00af5ef61: Pushed
edfc5145749a: Pushed
89d6344d2aa8: Layer already exists
233460b08b22: Pushed
404130ce4519: Layer already exists
17cdb8503b04: Layer already exists
1cad4dc57058: Layer already exists
4ff8844d474a: Layer already exists
b77487480ddb: Layer already exists
cd247c0fb37b: Layer already exists
870a241bfebd: Layer already exists
cfdd5c3bd77e: Layer already exists
3ac3cf89acab: Pushed
c7cc0e654b7b: Pushed
163549ced801: Pushed
20221207034544: digest: sha256:0fef8a5c1f38a61d58ec9310d148630f8c7b8a844065f57305ab3017b1819e9a size: 5156

> Task :runners:google-cloud-dataflow-java:setupXVR

> Task :runners:google-cloud-dataflow-java:validatesCrossLanguageRunnerSetup
Launching Java expansion service @ 44561
Launching Python expansion service @ 37927

> Task :runners:google-cloud-dataflow-java:validatesCrossLanguageRunnerJavaUsingPython

org.apache.beam.sdk.extensions.python.transforms.DataframeTransformTest > testDataframeSum FAILED
    java.lang.RuntimeException at TestDataflowRunner.java:141

16 tests completed, 1 failed, 2 skipped

> Task :runners:google-cloud-dataflow-java:validatesCrossLanguageRunnerJavaUsingPython FAILED
> Task :runners:google-cloud-dataflow-java:cleanupXVR UP-TO-DATE

> Task :runners:google-cloud-dataflow-java:cleanUpDockerPythonImages
Untagged: us.gcr.io/apache-beam-testing/java-postcommit-it/python:20221207034544
Untagged: us.gcr.io/apache-beam-testing/java-postcommit-it/python@sha256:0fef8a5c1f38a61d58ec9310d148630f8c7b8a844065f57305ab3017b1819e9a
WARNING: Successfully resolved tag to sha256, but it is recommended to use sha256 directly.
Tag: [us.gcr.io/apache-beam-testing/java-postcommit-it/python:20221207034544]
- referencing digest: [us.gcr.io/apache-beam-testing/java-postcommit-it/python@sha256:0fef8a5c1f38a61d58ec9310d148630f8c7b8a844065f57305ab3017b1819e9a]

Deleted [[us.gcr.io/apache-beam-testing/java-postcommit-it/python:20221207034544] (referencing [us.gcr.io/apache-beam-testing/java-postcommit-it/python@sha256:0fef8a5c1f38a61d58ec9310d148630f8c7b8a844065f57305ab3017b1819e9a])].
Removing untagged image us.gcr.io/apache-beam-testing/java-postcommit-it/python@sha256:0fef8a5c1f38a61d58ec9310d148630f8c7b8a844065f57305ab3017b1819e9a
Digests:
- us.gcr.io/apache-beam-testing/java-postcommit-it/python@sha256:0fef8a5c1f38a61d58ec9310d148630f8c7b8a844065f57305ab3017b1819e9a
Deleted [us.gcr.io/apache-beam-testing/java-postcommit-it/python@sha256:0fef8a5c1f38a61d58ec9310d148630f8c7b8a844065f57305ab3017b1819e9a].

> Task :runners:google-cloud-dataflow-java:cleanUpDockerJavaImages
Untagged: us.gcr.io/apache-beam-testing/java-postcommit-it/java:20221207034544
Untagged: us.gcr.io/apache-beam-testing/java-postcommit-it/java@sha256:e522462b696d83e46e56ebd4bcd5c1c82dcf9ff76939b363855759c5abd7f9e9
Deleted: sha256:f9be5bd96530d9ab0b6e7c197626879dfc17a50397042a6242add3383d415071
Deleted: sha256:5092dea1ac8ce0f63d5f2f67883d4449479dfa2ef9e69e7ce26da311d40be549
Deleted: sha256:fb2c0816560cbdea27fb918af8deda34675bde98eca800e81900ba6079bbfa78
Deleted: sha256:137f95dee8e8378b2edcb3da9ce51a1de4b65b7a86e17a05e9ea48175b435b8c
Deleted: sha256:b9c80f80263695c991f858e0831c4b45026604ea9dcc1ddfcc855bab67aef5f7
Deleted: sha256:de903f6bd58a1fc782cb5dc2accf0e66f64e6234c98c8376a8057967e8f92123
Deleted: sha256:17439308055b221aa0130f7affea383efe088fe4ad25c26d2943942f6664bcf6
Deleted: sha256:636c1045656174db6af8109bae706fd48fa9fb82337ea7409ccea9db1d7e9482
Deleted: sha256:39ee7ddfe51de723a90f5afaa48e2b0d8d799baa52eaaffb9bf675971dc29a63
Deleted: sha256:d751c57b11151398f666d1a509970e21c0d80e80ed01b2c24f344fdf09b7187b
Deleted: sha256:af08f8a08d2d98c288e671cc0c58632a60f351787ec33f7e04b136a3799b852c
Deleted: sha256:c8b77fddb1196af00881b1a5fd43cdab777a56efbe24096d0726be6b0941f246
Deleted: sha256:fa8049e3db363cf9fa6c5519c6e5f95ca3699ff0718d6253dc5826de10455820
Deleted: sha256:d2c5a965900cc23bc70a15a621aeaf9bdc72fc6f48cd1fbf95d5f0820858f829
Deleted: sha256:033f59050dbf39ea5acdbc726de811a08504ad1203395859601543089b06aaa1
Deleted: sha256:a8a948115d21f7b784fbd29c4293d9137b8198cf12fb550bb789d8ada4aa99fb
Deleted: sha256:eeff285e96af0cbb8746312bd1e7da1d064b59c8dfe2882a258f9088135d4afb
Deleted: sha256:adebd3dc1112d397687466119d3337f4b6af5b6475c89631d76a40ebc644f61c
Deleted: sha256:046cda8986312315d8e6579616aefdb2d451ce2f57e6aa99731f963be422eab3
Deleted: sha256:3330478934b29ff4fba1551730089b9726cea3d805f07fe6e2e285482cdec48f
Deleted: sha256:c962e683a02bf5029c4cf59265537500e464558cf557eba1a94bdf79183aa99b
Deleted: sha256:503162c95ffa1f7cf43f6eb0eb01cd96107864c0d12551e25e52a8bff2a7e62f
Deleted: sha256:e854c0cf6c157377f20447f81c9ade205b324338e2a77e512996404e7132797f
Deleted: sha256:aa93f2ef52ceebf1ffd0910efb2f16c14f342067ba899e6ab1dfc1fe9332f1cf
Deleted: sha256:124c7cf5f1f10556134ad5de8c8f635dd682c0099234c8b6ad36000ac69e9de7
Deleted: sha256:e0c07dfb8a7f8ba149fc8819266d876d6b9089d415a335d9a783c78100eef35c
Deleted: sha256:d68ef7d86b3121358e1ce37ad61f6c9a40f9c5d3d973115e469bd2cbe3fb2e2d
Deleted: sha256:68e3fcfe69e0b2ae9d03c63e90a4603cc0161a9840c31a8baf6ffbf9a7232c93
Deleted: sha256:7744e40326506f078c8a1e57ad0e14b601601443b9e3d9ca6119ca2950e5a718
Deleted: sha256:703ed168b7f51125cbe054eddce8217b0ec9c845fa298870328937d4d9ca0b73
Deleted: sha256:3cff2df65a443c1dcb9b2e58cd21396f15b0ce5f46f6adcf52a8f2bc6cd7f45b
Deleted: sha256:cdf298002075409fcbc9b14d2cb62bc15defcffce558291eef53d2f40cf60f84
Deleted: sha256:2775dbf22fd14352c9379217d173f932f1dc3f39120e0f219276bc337a756f93
Deleted: sha256:61db551296fec187cf79a067578c7e8243ab03d529b56d21e876c6a7c07ed920
WARNING: Successfully resolved tag to sha256, but it is recommended to use sha256 directly.
Tag: [us.gcr.io/apache-beam-testing/java-postcommit-it/java:20221207034544]
- referencing digest: [us.gcr.io/apache-beam-testing/java-postcommit-it/java@sha256:e522462b696d83e46e56ebd4bcd5c1c82dcf9ff76939b363855759c5abd7f9e9]

Deleted [[us.gcr.io/apache-beam-testing/java-postcommit-it/java:20221207034544] (referencing [us.gcr.io/apache-beam-testing/java-postcommit-it/java@sha256:e522462b696d83e46e56ebd4bcd5c1c82dcf9ff76939b363855759c5abd7f9e9])].
Removing untagged image us.gcr.io/apache-beam-testing/java-postcommit-it/java@sha256:e522462b696d83e46e56ebd4bcd5c1c82dcf9ff76939b363855759c5abd7f9e9
Digests:
- us.gcr.io/apache-beam-testing/java-postcommit-it/java@sha256:e522462b696d83e46e56ebd4bcd5c1c82dcf9ff76939b363855759c5abd7f9e9
Deleted [us.gcr.io/apache-beam-testing/java-postcommit-it/java@sha256:e522462b696d83e46e56ebd4bcd5c1c82dcf9ff76939b363855759c5abd7f9e9].

> Task :runners:google-cloud-dataflow-java:validatesCrossLanguageRunnerCleanup
Stopping expansion service pid: 3319319.
Stopping expansion service pid: 3319320.

FAILURE: Build failed with an exception.

* What went wrong:
Execution failed for task ':runners:google-cloud-dataflow-java:validatesCrossLanguageRunnerJavaUsingPython'.
> There were failing tests. See the report at: file://<https://ci-beam.apache.org/job/beam_PostCommit_XVR_JavaUsingPython_Dataflow/ws/src/runners/google-cloud-dataflow-java/build/reports/tests/validatesCrossLanguageRunnerJavaUsingPython/index.html>

* Try:
> Run with --stacktrace option to get the stack trace.
> Run with --info or --debug option to get more log output.

* Get more help at https://help.gradle.org

Deprecated Gradle features were used in this build, making it incompatible with Gradle 8.0.

You can use '--warning-mode all' to show the individual deprecation warnings and determine if they come from your own scripts or plugins.

See https://docs.gradle.org/7.5.1/userguide/command_line_interface.html#sec:command_line_warnings

Execution optimizations have been disabled for 1 invalid unit(s) of work during this build to ensure correctness.
Please consult deprecation warnings for more details.

BUILD FAILED in 35m 10s
174 actionable tasks: 25 executed, 149 up-to-date

Publishing build scan...
https://gradle.com/s/472cduuyjgypw

Build step 'Invoke Gradle script' changed build result to FAILURE
Build step 'Invoke Gradle script' marked build as failure

---------------------------------------------------------------------
To unsubscribe, e-mail: builds-unsubscribe@beam.apache.org
For additional commands, e-mail: builds-help@beam.apache.org


Build failed in Jenkins: beam_PostCommit_XVR_JavaUsingPython_Dataflow #1251

Posted by Apache Jenkins Server <je...@builds.apache.org>.
See <https://ci-beam.apache.org/job/beam_PostCommit_XVR_JavaUsingPython_Dataflow/1251/display/redirect?page=changes>

Changes:

[noreply] Precommit python version update (#24526)

[noreply] [CdapIO] Add CdapIO and SparkReceiverIO documentation in website

[relax] fix null pointer exception caused by clearing member variable

[noreply] Adding support for Pubsub Lite Writes in SchemaTransforms (#24359)

[noreply] Disallow using the JRH with Python streaming pipelines (#24513)

[noreply] Add RunInference example for TensorFlow Hub pre-trained model (#24529)

[noreply] update(PULL Request template) remove Choose reviewer (#24540)


------------------------------------------
[...truncated 1.10 MB...]
 ---> 22549b9f0ad0
Step 19/32 : COPY target/NOTICE /opt/apache/beam/
 ---> 2893bea19a7a
Step 20/32 : COPY target/launcher/linux_amd64/boot /opt/apache/beam/
 ---> 3ede7c153e0e
Step 21/32 : ENTRYPOINT ["/opt/apache/beam/boot"]
 ---> Running in bff3ac23962b
Removing intermediate container bff3ac23962b
 ---> 6401cb8e4d1d
Step 22/32 : FROM beam as third_party_licenses
 ---> 6401cb8e4d1d
Step 23/32 : ARG pull_licenses
 ---> Running in f108dc395e30
Removing intermediate container f108dc395e30
 ---> f32b7bccb037
Step 24/32 : COPY target/license_scripts /tmp/license_scripts/
 ---> 379877e52c9d
Step 25/32 : COPY target/LICENSE target/go-licenses/* /opt/apache/beam/third_party_licenses/golang/
 ---> 01a105cbe9a0
Step 26/32 : RUN rm /opt/apache/beam/third_party_licenses/golang/LICENSE
 ---> Running in 98ec34884fb7
Removing intermediate container 98ec34884fb7
 ---> a76e7285f2ec
Step 27/32 : COPY target/license_scripts /tmp/license_scripts/
 ---> 3b8bf8c2eb22
Step 28/32 : RUN if [ "$pull_licenses" = "true" ] ; then       pip install 'pip-licenses<4.0.0' pyyaml tenacity &&       python /tmp/license_scripts/pull_licenses_py.py ;     fi
 ---> Running in dd67e89f23f4
Collecting pip-licenses<4.0.0
  Downloading pip_licenses-3.5.5-py3-none-any.whl (17 kB)
Requirement already satisfied: pyyaml in /usr/local/lib/python3.10/site-packages (6.0)
Requirement already satisfied: tenacity in /usr/local/lib/python3.10/site-packages (5.1.5)
Collecting PTable
  Downloading PTable-0.9.2.tar.gz (31 kB)
  Preparing metadata (setup.py): started
  Preparing metadata (setup.py): finished with status 'done'
Requirement already satisfied: six>=1.9.0 in /usr/local/lib/python3.10/site-packages (from tenacity) (1.16.0)
Building wheels for collected packages: PTable
  Building wheel for PTable (setup.py): started
  Building wheel for PTable (setup.py): finished with status 'done'
  Created wheel for PTable: filename=PTable-0.9.2-py3-none-any.whl size=22908 sha256=da79c3f03d0b368dcca75943dbeaf0e34039f0bc5a0854475dd6870dd1470c72
  Stored in directory: /root/.cache/pip/wheels/62/2a/42/c655cf57d84ab59535337af009892aaf16256a813826b465f7
Successfully built PTable
Installing collected packages: PTable, pip-licenses
Successfully installed PTable-0.9.2 pip-licenses-3.5.5
WARNING: Running pip as the 'root' user can result in broken permissions and conflicting behaviour with the system package manager. It is recommended to use a virtual environment instead: https://pip.pypa.io/warnings/venv
INFO:root:Successfully pulled licenses for 135 dependencies
Skip pulling license for  bs4
Removing intermediate container dd67e89f23f4
 ---> dd1e5ca2eaaa
Step 29/32 : FROM beam
 ---> 6401cb8e4d1d
Step 30/32 : ARG pull_licenses
 ---> Running in 2db84e21c7e1
Removing intermediate container 2db84e21c7e1
 ---> 211861d7a2d5
Step 31/32 : COPY --from=third_party_licenses /opt/apache/beam/third_party_licenses /opt/apache/beam/third_party_licenses
 ---> 7c8dc3c449f1
Step 32/32 : RUN if [ "$pull_licenses" != "true" ] ; then       rm -rf /opt/apache/beam/third_party_licenses ;     fi
 ---> Running in 39fd5f37fc0a
Removing intermediate container 39fd5f37fc0a
 ---> 6fed1d1dff28
Successfully built 6fed1d1dff28
Successfully tagged apache/beam_python3.10_sdk:2.45.0.dev

> Task :runners:google-cloud-dataflow-java:buildAndPushDockerPythonContainer
WARNING: `gcloud docker` will not be supported for Docker client versions above 18.03.

As an alternative, use `gcloud auth configure-docker` to configure `docker` to
use `gcloud` as a credential helper, then use `docker` as you would for non-GCR
registries, e.g. `docker pull gcr.io/project-id/my-image`. Add
`--verbosity=error` to silence this warning: `gcloud docker
--verbosity=error -- pull gcr.io/project-id/my-image`.

See: https://cloud.google.com/container-registry/docs/support/deprecation-notices#gcloud-docker

The push refers to repository [us.gcr.io/apache-beam-testing/java-postcommit-it/python]
3a6d0a9b14d1: Preparing
f99269307c3f: Preparing
991975d74a23: Preparing
755e2eff4f69: Preparing
4d98a80cf803: Preparing
c0b109cfb460: Preparing
22aa3bc8d830: Preparing
2133e997196c: Preparing
5882de54b899: Preparing
d01232283830: Preparing
2e73bdf8d403: Preparing
bbd1fe9194b1: Preparing
a045a65f9e1c: Preparing
17952c74c4a7: Preparing
89d6344d2aa8: Preparing
404130ce4519: Preparing
17cdb8503b04: Preparing
1cad4dc57058: Preparing
4ff8844d474a: Preparing
b77487480ddb: Preparing
cd247c0fb37b: Preparing
cfdd5c3bd77e: Preparing
870a241bfebd: Preparing
17952c74c4a7: Waiting
89d6344d2aa8: Waiting
b77487480ddb: Waiting
4ff8844d474a: Waiting
cd247c0fb37b: Waiting
cfdd5c3bd77e: Waiting
1cad4dc57058: Waiting
17cdb8503b04: Waiting
870a241bfebd: Waiting
c0b109cfb460: Waiting
2133e997196c: Waiting
22aa3bc8d830: Waiting
d01232283830: Waiting
bbd1fe9194b1: Waiting
a045a65f9e1c: Waiting
5882de54b899: Waiting
4d98a80cf803: Pushed
3a6d0a9b14d1: Pushed
755e2eff4f69: Pushed
991975d74a23: Pushed
f99269307c3f: Pushed
2133e997196c: Pushed
5882de54b899: Pushed
22aa3bc8d830: Pushed
a045a65f9e1c: Pushed
17952c74c4a7: Pushed
2e73bdf8d403: Pushed
89d6344d2aa8: Layer already exists
404130ce4519: Layer already exists
17cdb8503b04: Layer already exists
4ff8844d474a: Layer already exists
1cad4dc57058: Layer already exists
b77487480ddb: Layer already exists
cd247c0fb37b: Layer already exists
870a241bfebd: Layer already exists
cfdd5c3bd77e: Layer already exists
c0b109cfb460: Pushed
d01232283830: Pushed
bbd1fe9194b1: Pushed
20221206214540: digest: sha256:721abcf4901d031bbc95e747964608fa228fc456b0a0a6af80930b4430d55bc0 size: 5156

> Task :runners:google-cloud-dataflow-java:setupXVR

> Task :runners:google-cloud-dataflow-java:validatesCrossLanguageRunnerSetup
Launching Java expansion service @ 44975
Launching Python expansion service @ 37677

> Task :runners:google-cloud-dataflow-java:validatesCrossLanguageRunnerJavaUsingPython

org.apache.beam.sdk.extensions.python.transforms.DataframeTransformTest > testDataframeSum FAILED
    java.lang.RuntimeException at TestDataflowRunner.java:141

16 tests completed, 1 failed, 2 skipped

> Task :runners:google-cloud-dataflow-java:validatesCrossLanguageRunnerJavaUsingPython FAILED
> Task :runners:google-cloud-dataflow-java:cleanupXVR UP-TO-DATE

> Task :runners:google-cloud-dataflow-java:cleanUpDockerPythonImages
Untagged: us.gcr.io/apache-beam-testing/java-postcommit-it/python:20221206214540
Untagged: us.gcr.io/apache-beam-testing/java-postcommit-it/python@sha256:721abcf4901d031bbc95e747964608fa228fc456b0a0a6af80930b4430d55bc0
WARNING: Successfully resolved tag to sha256, but it is recommended to use sha256 directly.
Tag: [us.gcr.io/apache-beam-testing/java-postcommit-it/python:20221206214540]
- referencing digest: [us.gcr.io/apache-beam-testing/java-postcommit-it/python@sha256:721abcf4901d031bbc95e747964608fa228fc456b0a0a6af80930b4430d55bc0]

Deleted [[us.gcr.io/apache-beam-testing/java-postcommit-it/python:20221206214540] (referencing [us.gcr.io/apache-beam-testing/java-postcommit-it/python@sha256:721abcf4901d031bbc95e747964608fa228fc456b0a0a6af80930b4430d55bc0])].
Removing untagged image us.gcr.io/apache-beam-testing/java-postcommit-it/python@sha256:721abcf4901d031bbc95e747964608fa228fc456b0a0a6af80930b4430d55bc0
Digests:
- us.gcr.io/apache-beam-testing/java-postcommit-it/python@sha256:721abcf4901d031bbc95e747964608fa228fc456b0a0a6af80930b4430d55bc0
Deleted [us.gcr.io/apache-beam-testing/java-postcommit-it/python@sha256:721abcf4901d031bbc95e747964608fa228fc456b0a0a6af80930b4430d55bc0].

> Task :runners:google-cloud-dataflow-java:cleanUpDockerJavaImages
Untagged: us.gcr.io/apache-beam-testing/java-postcommit-it/java:20221206214540
Untagged: us.gcr.io/apache-beam-testing/java-postcommit-it/java@sha256:184c765885a66ce256423aeba25dfeef1d3c9d31168f3d66e2c9e4e9af4ba187
Deleted: sha256:e14af681239f4e3044ee6fb3e6395561aaca9b439c8132f83c7cf9948425c0a0
Deleted: sha256:363a802317dbc5d9d5db7f97c0fd59505132928d7eb1b3635254259bd444ddec
Deleted: sha256:48ca92b762fc11f1496a087036ef5e31d5616e01b3cfd45b460b3ed9f4ade09c
Deleted: sha256:d193855b41c59f793d4387912ca0073d81f5996935fdd93552de5291cc9806e1
Deleted: sha256:c48f15ed703aba0af20837c3f4dc3935ed2e2459ac8ef0eee8cbc846e0b97279
Deleted: sha256:2574e4aede50bc2a8b2e9a589de87afc31008cc6101cfd81d5ef7c19bdd5f486
Deleted: sha256:ca755f2e4a185a8d53d3767880d5a28b9d1e78fb91da3f0573897cfaf6a1e6af
Deleted: sha256:227c9b79cc9911691d2b64c673f3474d9587cb0710c9c5b6184630612f8fdd55
Deleted: sha256:e8a9b962f3272813c264feb503ae43888bdcf089357654af480e6d9728576132
Deleted: sha256:140499aa34d9a366d0e968e68c33a780884d2fe846d52da45cbfda883ffd4c4c
Deleted: sha256:14240b9db27ed5dc7502a749521b76a39b212d53c768168ab804497c37cfa6f0
Deleted: sha256:7cb72ea0622bb46c814df51bb6797cb0803b8d5adc53ac0a9c1da9f3bef0a9e0
Deleted: sha256:25ad59b29276e917dd73b3fc37b1f042b30af3c66e090d5e841e8200d6913b88
Deleted: sha256:eb737a86da04df1bd0db1a54e88061027678631780207e590075d34837cec441
Deleted: sha256:1b42f57ab99c8dddd5fe0e4eabcfa54b67d0e3e526aba0450e6e99e6308cf0db
Deleted: sha256:03c63769a24b587131f4f4ab5a604f480def4a18a51601ca8773b6a6fd633f73
Deleted: sha256:5e0e7a0dd67e2cc0df83291d2e6708b95573a860ac4e00f54f0fbd85deb2372e
Deleted: sha256:8e8976d67b9278bc1b4cb86fa238027fe0cee8c04dd55cde21d728b005480613
Deleted: sha256:7f3b322958b3ef217e890e6e6e122097482416fde28603e7fcd4951b23d9579d
Deleted: sha256:610b7cfc04e1fe87c7c6a9f304a16a27883ababadc79568ecc8bf598bd300c3d
Deleted: sha256:678e4358e219146804ca931a1b06ffe1fe914efe93c6755c4b8e1f67ee56a922
Deleted: sha256:8a585bef89cf5603b50e78b67e277b5007b3bfe975977a8418013d547c543573
Deleted: sha256:824a35622329a2bc1040bfa6147b59d32200aeaf0b716b4aea067481bf473c45
Deleted: sha256:836febb4f479f55d10e3bcd53108943828b267c45af98fd27129ef69709f9f21
Deleted: sha256:6c33fc6cf059c0b3d96fb92efec99413a013c51c1f8218198667b5fe9baf4def
Deleted: sha256:db4a9d42591b34338f4a3422689ed85092dcb116c8c67ab402679352172ba73b
Deleted: sha256:51101049b629fee9ed14a76a1c749434b8e665d7a6e62300c4bc0f2d39c368cf
Deleted: sha256:2266eb45b7b96508d90f39b83b4d0ed9ce513e479386b69eb942996146f38013
Deleted: sha256:44691820fe3dd6ca9f43e0d41d40fe89868ac3f7b3adf476aab3368519282053
Deleted: sha256:41c7b4eca77363b797d982105dd65c2f99401687692bb407c074cecd7ecb369a
Deleted: sha256:02d9d21798dcd4fc6472f1b18ea9efd41f2ffd49f371316439e35ab8920df34b
Deleted: sha256:54c6c190f658bcf220039b751ba0ecbf1cb0554326e90f0ec468b5b4c067d103
Deleted: sha256:87c35f7147bd5e0fd6d99ac12e5426b33248ed42517d4fdc78d94f4f94dadf7e
Deleted: sha256:9497330c5807654028893296dc8cecc4681f4f0a4cdc7505e190c6c37e088e6a
WARNING: Successfully resolved tag to sha256, but it is recommended to use sha256 directly.
Tag: [us.gcr.io/apache-beam-testing/java-postcommit-it/java:20221206214540]
- referencing digest: [us.gcr.io/apache-beam-testing/java-postcommit-it/java@sha256:184c765885a66ce256423aeba25dfeef1d3c9d31168f3d66e2c9e4e9af4ba187]

Deleted [[us.gcr.io/apache-beam-testing/java-postcommit-it/java:20221206214540] (referencing [us.gcr.io/apache-beam-testing/java-postcommit-it/java@sha256:184c765885a66ce256423aeba25dfeef1d3c9d31168f3d66e2c9e4e9af4ba187])].
Removing untagged image us.gcr.io/apache-beam-testing/java-postcommit-it/java@sha256:184c765885a66ce256423aeba25dfeef1d3c9d31168f3d66e2c9e4e9af4ba187
Digests:
- us.gcr.io/apache-beam-testing/java-postcommit-it/java@sha256:184c765885a66ce256423aeba25dfeef1d3c9d31168f3d66e2c9e4e9af4ba187
Deleted [us.gcr.io/apache-beam-testing/java-postcommit-it/java@sha256:184c765885a66ce256423aeba25dfeef1d3c9d31168f3d66e2c9e4e9af4ba187].

> Task :runners:google-cloud-dataflow-java:validatesCrossLanguageRunnerCleanup
Stopping expansion service pid: 2737760.
Stopping expansion service pid: 2737761.

FAILURE: Build failed with an exception.

* What went wrong:
Execution failed for task ':runners:google-cloud-dataflow-java:validatesCrossLanguageRunnerJavaUsingPython'.
> There were failing tests. See the report at: file://<https://ci-beam.apache.org/job/beam_PostCommit_XVR_JavaUsingPython_Dataflow/ws/src/runners/google-cloud-dataflow-java/build/reports/tests/validatesCrossLanguageRunnerJavaUsingPython/index.html>

* Try:
> Run with --stacktrace option to get the stack trace.
> Run with --info or --debug option to get more log output.

* Get more help at https://help.gradle.org

Deprecated Gradle features were used in this build, making it incompatible with Gradle 8.0.

You can use '--warning-mode all' to show the individual deprecation warnings and determine if they come from your own scripts or plugins.

See https://docs.gradle.org/7.5.1/userguide/command_line_interface.html#sec:command_line_warnings

Execution optimizations have been disabled for 1 invalid unit(s) of work during this build to ensure correctness.
Please consult deprecation warnings for more details.

BUILD FAILED in 37m 44s
174 actionable tasks: 25 executed, 149 up-to-date

Publishing build scan...
https://gradle.com/s/f3r5lii2zlzqi

Build step 'Invoke Gradle script' changed build result to FAILURE
Build step 'Invoke Gradle script' marked build as failure

---------------------------------------------------------------------
To unsubscribe, e-mail: builds-unsubscribe@beam.apache.org
For additional commands, e-mail: builds-help@beam.apache.org


beam_PostCommit_XVR_JavaUsingPython_Dataflow - Build # 1250 - Aborted!

Posted by Apache Jenkins Server <je...@builds.apache.org>.
beam_PostCommit_XVR_JavaUsingPython_Dataflow - Build # 1250 - Aborted:

Check console output at https://ci-beam.apache.org/job/beam_PostCommit_XVR_JavaUsingPython_Dataflow/1250/ to view the results.

Build failed in Jenkins: beam_PostCommit_XVR_JavaUsingPython_Dataflow #1249

Posted by Apache Jenkins Server <je...@builds.apache.org>.
See <https://ci-beam.apache.org/job/beam_PostCommit_XVR_JavaUsingPython_Dataflow/1249/display/redirect>

Changes:


------------------------------------------
[...truncated 1.10 MB...]
scipy==1.9.3
setuptools==65.6.3
six==1.16.0
sortedcontainers==2.4.0
soupsieve==2.3.2.post1
SQLAlchemy==1.4.42
sqlparse==0.4.3
tenacity==5.1.5
tensorboard==2.10.1
tensorboard-data-server==0.6.1
tensorboard-plugin-wit==1.8.1
tensorflow==2.10.0
tensorflow-estimator==2.10.0
tensorflow-io-gcs-filesystem==0.27.0
termcolor==2.0.1
testcontainers==3.7.0
threadpoolctl==3.1.0
tomli==2.0.1
tqdm==4.64.1
typing_extensions==4.4.0
uritemplate==4.1.1
urllib3==1.26.12
websocket-client==1.4.1
Werkzeug==2.2.2
wheel==0.38.4
wrapt==1.14.1
zstandard==0.18.0
Removing intermediate container 4a3b9f2054d3
 ---> 2904facd605f
Step 17/32 : COPY target/LICENSE /opt/apache/beam/
 ---> bea9f38c99bd
Step 18/32 : COPY target/LICENSE.python /opt/apache/beam/
 ---> 7f2b73a94360
Step 19/32 : COPY target/NOTICE /opt/apache/beam/
 ---> 39a5b9475bda
Step 20/32 : COPY target/launcher/linux_amd64/boot /opt/apache/beam/
 ---> f485db27c7ff
Step 21/32 : ENTRYPOINT ["/opt/apache/beam/boot"]
 ---> Running in bbb050bcea0d
Removing intermediate container bbb050bcea0d
 ---> a08934ac30bd
Step 22/32 : FROM beam as third_party_licenses
 ---> a08934ac30bd
Step 23/32 : ARG pull_licenses
 ---> Running in 3fccb9bfd359
Removing intermediate container 3fccb9bfd359
 ---> 20892594dd0f
Step 24/32 : COPY target/license_scripts /tmp/license_scripts/
 ---> 23e0ff6e131b
Step 25/32 : COPY target/LICENSE target/go-licenses/* /opt/apache/beam/third_party_licenses/golang/
 ---> 827436b55386
Step 26/32 : RUN rm /opt/apache/beam/third_party_licenses/golang/LICENSE
 ---> Running in 2ec4f3a17f9a
Removing intermediate container 2ec4f3a17f9a
 ---> 002e45ebd1ed
Step 27/32 : COPY target/license_scripts /tmp/license_scripts/
 ---> b9e28bd1f005
Step 28/32 : RUN if [ "$pull_licenses" = "true" ] ; then       pip install 'pip-licenses<4.0.0' pyyaml tenacity &&       python /tmp/license_scripts/pull_licenses_py.py ;     fi
 ---> Running in 0d836ebe69a2
Collecting pip-licenses<4.0.0
  Downloading pip_licenses-3.5.5-py3-none-any.whl (17 kB)
Requirement already satisfied: pyyaml in /usr/local/lib/python3.10/site-packages (6.0)
Requirement already satisfied: tenacity in /usr/local/lib/python3.10/site-packages (5.1.5)
Collecting PTable
  Downloading PTable-0.9.2.tar.gz (31 kB)
  Preparing metadata (setup.py): started
  Preparing metadata (setup.py): finished with status 'done'
Requirement already satisfied: six>=1.9.0 in /usr/local/lib/python3.10/site-packages (from tenacity) (1.16.0)
Building wheels for collected packages: PTable
  Building wheel for PTable (setup.py): started
  Building wheel for PTable (setup.py): finished with status 'done'
  Created wheel for PTable: filename=PTable-0.9.2-py3-none-any.whl size=22908 sha256=df2b85c9ce5de042660e8a9bb37656efcb8ff6ad0811395ccacc165927ef1f96
  Stored in directory: /root/.cache/pip/wheels/62/2a/42/c655cf57d84ab59535337af009892aaf16256a813826b465f7
Successfully built PTable
Installing collected packages: PTable, pip-licenses
Successfully installed PTable-0.9.2 pip-licenses-3.5.5
WARNING: Running pip as the 'root' user can result in broken permissions and conflicting behaviour with the system package manager. It is recommended to use a virtual environment instead: https://pip.pypa.io/warnings/venv
INFO:root:Successfully pulled licenses for 135 dependencies
Skip pulling license for  bs4
Removing intermediate container 0d836ebe69a2
 ---> 88c09e398328
Step 29/32 : FROM beam
 ---> a08934ac30bd
Step 30/32 : ARG pull_licenses
 ---> Running in 80a55bcc5ebd
Removing intermediate container 80a55bcc5ebd
 ---> fc0ae64aba60
Step 31/32 : COPY --from=third_party_licenses /opt/apache/beam/third_party_licenses /opt/apache/beam/third_party_licenses
 ---> 93b4fb979660
Step 32/32 : RUN if [ "$pull_licenses" != "true" ] ; then       rm -rf /opt/apache/beam/third_party_licenses ;     fi
 ---> Running in 16487e27677b
Removing intermediate container 16487e27677b
 ---> 34801247fc9c
Successfully built 34801247fc9c
Successfully tagged apache/beam_python3.10_sdk:2.45.0.dev

> Task :runners:google-cloud-dataflow-java:buildAndPushDockerPythonContainer
WARNING: `gcloud docker` will not be supported for Docker client versions above 18.03.

As an alternative, use `gcloud auth configure-docker` to configure `docker` to
use `gcloud` as a credential helper, then use `docker` as you would for non-GCR
registries, e.g. `docker pull gcr.io/project-id/my-image`. Add
`--verbosity=error` to silence this warning: `gcloud docker
--verbosity=error -- pull gcr.io/project-id/my-image`.

See: https://cloud.google.com/container-registry/docs/support/deprecation-notices#gcloud-docker

The push refers to repository [us.gcr.io/apache-beam-testing/java-postcommit-it/python]
87c8f00b5937: Preparing
4dba5ef274fa: Preparing
5f08959cc364: Preparing
246b06358f28: Preparing
885c0739c847: Preparing
474f31855e8f: Preparing
a10ba5f67dcc: Preparing
56d1a12e3e32: Preparing
b59745833d76: Preparing
28758379d702: Preparing
adadee051c0b: Preparing
538288d95e71: Preparing
4f7ef1ab653e: Preparing
e1e77bd11c38: Preparing
5183217745a1: Preparing
905ede8abeca: Preparing
63ab2579942e: Preparing
e6e9854ca999: Preparing
397a239a053b: Preparing
89c3244a87b2: Preparing
80231db1194c: Preparing
f1c1f2298584: Preparing
56d1a12e3e32: Waiting
ccba29d69370: Preparing
b59745833d76: Waiting
a10ba5f67dcc: Waiting
28758379d702: Waiting
e1e77bd11c38: Waiting
474f31855e8f: Waiting
adadee051c0b: Waiting
80231db1194c: Waiting
e6e9854ca999: Waiting
63ab2579942e: Waiting
f1c1f2298584: Waiting
5183217745a1: Waiting
4f7ef1ab653e: Waiting
397a239a053b: Waiting
ccba29d69370: Waiting
89c3244a87b2: Waiting
905ede8abeca: Waiting
538288d95e71: Waiting
246b06358f28: Pushed
5f08959cc364: Pushed
885c0739c847: Pushed
87c8f00b5937: Pushed
4dba5ef274fa: Pushed
b59745833d76: Pushed
a10ba5f67dcc: Pushed
56d1a12e3e32: Pushed
4f7ef1ab653e: Pushed
e1e77bd11c38: Pushed
5183217745a1: Layer already exists
905ede8abeca: Layer already exists
63ab2579942e: Layer already exists
adadee051c0b: Pushed
e6e9854ca999: Layer already exists
397a239a053b: Layer already exists
89c3244a87b2: Layer already exists
80231db1194c: Layer already exists
f1c1f2298584: Layer already exists
ccba29d69370: Layer already exists
474f31855e8f: Pushed
28758379d702: Pushed
538288d95e71: Pushed
20221206095238: digest: sha256:e9da25e95f7cfd23b44dacbc59704bed0f892a0f39eb7539c5afeee095fb35c2 size: 5156

> Task :runners:google-cloud-dataflow-java:setupXVR

> Task :runners:google-cloud-dataflow-java:validatesCrossLanguageRunnerSetup
Launching Java expansion service @ 43205
Launching Python expansion service @ 37851

> Task :runners:google-cloud-dataflow-java:validatesCrossLanguageRunnerJavaUsingPython

org.apache.beam.sdk.extensions.python.transforms.DataframeTransformTest > testDataframeSum FAILED
    java.lang.RuntimeException at TestDataflowRunner.java:141

16 tests completed, 1 failed, 2 skipped

> Task :runners:google-cloud-dataflow-java:validatesCrossLanguageRunnerJavaUsingPython FAILED
> Task :runners:google-cloud-dataflow-java:cleanupXVR UP-TO-DATE

> Task :runners:google-cloud-dataflow-java:cleanUpDockerPythonImages
Untagged: us.gcr.io/apache-beam-testing/java-postcommit-it/python:20221206095238
Untagged: us.gcr.io/apache-beam-testing/java-postcommit-it/python@sha256:e9da25e95f7cfd23b44dacbc59704bed0f892a0f39eb7539c5afeee095fb35c2
WARNING: Successfully resolved tag to sha256, but it is recommended to use sha256 directly.
Tag: [us.gcr.io/apache-beam-testing/java-postcommit-it/python:20221206095238]
- referencing digest: [us.gcr.io/apache-beam-testing/java-postcommit-it/python@sha256:e9da25e95f7cfd23b44dacbc59704bed0f892a0f39eb7539c5afeee095fb35c2]

Deleted [[us.gcr.io/apache-beam-testing/java-postcommit-it/python:20221206095238] (referencing [us.gcr.io/apache-beam-testing/java-postcommit-it/python@sha256:e9da25e95f7cfd23b44dacbc59704bed0f892a0f39eb7539c5afeee095fb35c2])].
Removing untagged image us.gcr.io/apache-beam-testing/java-postcommit-it/python@sha256:e9da25e95f7cfd23b44dacbc59704bed0f892a0f39eb7539c5afeee095fb35c2
Digests:
- us.gcr.io/apache-beam-testing/java-postcommit-it/python@sha256:e9da25e95f7cfd23b44dacbc59704bed0f892a0f39eb7539c5afeee095fb35c2
Deleted [us.gcr.io/apache-beam-testing/java-postcommit-it/python@sha256:e9da25e95f7cfd23b44dacbc59704bed0f892a0f39eb7539c5afeee095fb35c2].

> Task :runners:google-cloud-dataflow-java:cleanUpDockerJavaImages
Untagged: us.gcr.io/apache-beam-testing/java-postcommit-it/java:20221206095238
Untagged: us.gcr.io/apache-beam-testing/java-postcommit-it/java@sha256:f370fc5899c472a6690d36bac8b13fc7e677cc8147bd310a0eac0a0e35754881
WARNING: Successfully resolved tag to sha256, but it is recommended to use sha256 directly.
Tag: [us.gcr.io/apache-beam-testing/java-postcommit-it/java:20221206095238]
- referencing digest: [us.gcr.io/apache-beam-testing/java-postcommit-it/java@sha256:f370fc5899c472a6690d36bac8b13fc7e677cc8147bd310a0eac0a0e35754881]

Deleted [[us.gcr.io/apache-beam-testing/java-postcommit-it/java:20221206095238] (referencing [us.gcr.io/apache-beam-testing/java-postcommit-it/java@sha256:f370fc5899c472a6690d36bac8b13fc7e677cc8147bd310a0eac0a0e35754881])].
Removing untagged image us.gcr.io/apache-beam-testing/java-postcommit-it/java@sha256:f370fc5899c472a6690d36bac8b13fc7e677cc8147bd310a0eac0a0e35754881
Digests:
- us.gcr.io/apache-beam-testing/java-postcommit-it/java@sha256:f370fc5899c472a6690d36bac8b13fc7e677cc8147bd310a0eac0a0e35754881
Deleted [us.gcr.io/apache-beam-testing/java-postcommit-it/java@sha256:f370fc5899c472a6690d36bac8b13fc7e677cc8147bd310a0eac0a0e35754881].

> Task :runners:google-cloud-dataflow-java:validatesCrossLanguageRunnerCleanup
Stopping expansion service pid: 3314384.
Stopping expansion service pid: 3314385.

FAILURE: Build failed with an exception.

* What went wrong:
Execution failed for task ':runners:google-cloud-dataflow-java:validatesCrossLanguageRunnerJavaUsingPython'.
> There were failing tests. See the report at: file://<https://ci-beam.apache.org/job/beam_PostCommit_XVR_JavaUsingPython_Dataflow/ws/src/runners/google-cloud-dataflow-java/build/reports/tests/validatesCrossLanguageRunnerJavaUsingPython/index.html>

* Try:
> Run with --stacktrace option to get the stack trace.
> Run with --info or --debug option to get more log output.

* Get more help at https://help.gradle.org

Deprecated Gradle features were used in this build, making it incompatible with Gradle 8.0.

You can use '--warning-mode all' to show the individual deprecation warnings and determine if they come from your own scripts or plugins.

See https://docs.gradle.org/7.5.1/userguide/command_line_interface.html#sec:command_line_warnings

Execution optimizations have been disabled for 1 invalid unit(s) of work during this build to ensure correctness.
Please consult deprecation warnings for more details.

BUILD FAILED in 40m
174 actionable tasks: 25 executed, 149 up-to-date

Publishing build scan...
https://gradle.com/s/f4feeqppqgq3w

Build step 'Invoke Gradle script' changed build result to FAILURE
Build step 'Invoke Gradle script' marked build as failure

---------------------------------------------------------------------
To unsubscribe, e-mail: builds-unsubscribe@beam.apache.org
For additional commands, e-mail: builds-help@beam.apache.org


Build failed in Jenkins: beam_PostCommit_XVR_JavaUsingPython_Dataflow #1248

Posted by Apache Jenkins Server <je...@builds.apache.org>.
See <https://ci-beam.apache.org/job/beam_PostCommit_XVR_JavaUsingPython_Dataflow/1248/display/redirect?page=changes>

Changes:

[noreply] Bump cloud.google.com/go/pubsub from 1.27.0 to 1.27.1 in /sdks (#24518)

[noreply] [Playground] Healthcheck was added (#24227)

[noreply] Update dataflow container version for Pandas upgrade (#24532)


------------------------------------------
[...truncated 1.06 MB...]
Step 19/32 : COPY target/NOTICE /opt/apache/beam/
 ---> cd24152796df
Step 20/32 : COPY target/launcher/linux_amd64/boot /opt/apache/beam/
 ---> d5c065c0b026
Step 21/32 : ENTRYPOINT ["/opt/apache/beam/boot"]
 ---> Running in 6f474e55a7ba
Removing intermediate container 6f474e55a7ba
 ---> 13583a138c69
Step 22/32 : FROM beam as third_party_licenses
 ---> 13583a138c69
Step 23/32 : ARG pull_licenses
 ---> Running in 6348970610b6
Removing intermediate container 6348970610b6
 ---> 94eb21a59d4a
Step 24/32 : COPY target/license_scripts /tmp/license_scripts/
 ---> e2a6089340e3
Step 25/32 : COPY target/LICENSE target/go-licenses/* /opt/apache/beam/third_party_licenses/golang/
 ---> e87edb6d5080
Step 26/32 : RUN rm /opt/apache/beam/third_party_licenses/golang/LICENSE
 ---> Running in 87c33163c185
Removing intermediate container 87c33163c185
 ---> 2a3ed101d7c9
Step 27/32 : COPY target/license_scripts /tmp/license_scripts/
 ---> 535f77775f33
Step 28/32 : RUN if [ "$pull_licenses" = "true" ] ; then       pip install 'pip-licenses<4.0.0' pyyaml tenacity &&       python /tmp/license_scripts/pull_licenses_py.py ;     fi
 ---> Running in 6c631bca4122
Collecting pip-licenses<4.0.0
  Downloading pip_licenses-3.5.5-py3-none-any.whl (17 kB)
Requirement already satisfied: pyyaml in /usr/local/lib/python3.10/site-packages (6.0)
Requirement already satisfied: tenacity in /usr/local/lib/python3.10/site-packages (5.1.5)
Collecting PTable
  Downloading PTable-0.9.2.tar.gz (31 kB)
  Preparing metadata (setup.py): started
  Preparing metadata (setup.py): finished with status 'done'
Requirement already satisfied: six>=1.9.0 in /usr/local/lib/python3.10/site-packages (from tenacity) (1.16.0)
Building wheels for collected packages: PTable
  Building wheel for PTable (setup.py): started
  Building wheel for PTable (setup.py): finished with status 'done'
  Created wheel for PTable: filename=PTable-0.9.2-py3-none-any.whl size=22908 sha256=83aca1c94083664559dd7925a4ddd2629cfbfe633cc160c33caa45a53b7afe60
  Stored in directory: /root/.cache/pip/wheels/62/2a/42/c655cf57d84ab59535337af009892aaf16256a813826b465f7
Successfully built PTable
Installing collected packages: PTable, pip-licenses
Successfully installed PTable-0.9.2 pip-licenses-3.5.5
WARNING: Running pip as the 'root' user can result in broken permissions and conflicting behaviour with the system package manager. It is recommended to use a virtual environment instead: https://pip.pypa.io/warnings/venv
INFO:root:Successfully pulled licenses for 135 dependencies
Skip pulling license for  bs4
Removing intermediate container 6c631bca4122
 ---> 195dfc4bd0f3
Step 29/32 : FROM beam
 ---> 13583a138c69
Step 30/32 : ARG pull_licenses
 ---> Running in 0ef53f2bf58d
Removing intermediate container 0ef53f2bf58d
 ---> 1c80edb9ae6e
Step 31/32 : COPY --from=third_party_licenses /opt/apache/beam/third_party_licenses /opt/apache/beam/third_party_licenses
 ---> fcb14ebbd4ae
Step 32/32 : RUN if [ "$pull_licenses" != "true" ] ; then       rm -rf /opt/apache/beam/third_party_licenses ;     fi
 ---> Running in b778d39cb393
Removing intermediate container b778d39cb393
 ---> 4fb5305db61e
Successfully built 4fb5305db61e
Successfully tagged apache/beam_python3.10_sdk:2.45.0.dev

> Task :runners:google-cloud-dataflow-java:buildAndPushDockerPythonContainer
WARNING: `gcloud docker` will not be supported for Docker client versions above 18.03.

As an alternative, use `gcloud auth configure-docker` to configure `docker` to
use `gcloud` as a credential helper, then use `docker` as you would for non-GCR
registries, e.g. `docker pull gcr.io/project-id/my-image`. Add
`--verbosity=error` to silence this warning: `gcloud docker
--verbosity=error -- pull gcr.io/project-id/my-image`.

See: https://cloud.google.com/container-registry/docs/support/deprecation-notices#gcloud-docker

The push refers to repository [us.gcr.io/apache-beam-testing/java-postcommit-it/python]
e2f774cd6dd0: Preparing
ac8884f3268a: Preparing
9a53017c4ea1: Preparing
bbb146b5c2fe: Preparing
3bb9c6857c1e: Preparing
da23bf84548f: Preparing
0c777c7fef20: Preparing
3243496112bd: Preparing
592baa148f4e: Preparing
1f16cbbc41e0: Preparing
8f9a0afee67e: Preparing
f6c25116bddc: Preparing
8106664a6d6a: Preparing
042411f0b499: Preparing
5183217745a1: Preparing
905ede8abeca: Preparing
63ab2579942e: Preparing
e6e9854ca999: Preparing
397a239a053b: Preparing
da23bf84548f: Waiting
89c3244a87b2: Preparing
0c777c7fef20: Waiting
80231db1194c: Preparing
f1c1f2298584: Preparing
ccba29d69370: Preparing
3243496112bd: Waiting
592baa148f4e: Waiting
8f9a0afee67e: Waiting
1f16cbbc41e0: Waiting
042411f0b499: Waiting
f6c25116bddc: Waiting
5183217745a1: Waiting
8106664a6d6a: Waiting
80231db1194c: Waiting
905ede8abeca: Waiting
e6e9854ca999: Waiting
397a239a053b: Waiting
89c3244a87b2: Waiting
63ab2579942e: Waiting
ccba29d69370: Waiting
9a53017c4ea1: Pushed
bbb146b5c2fe: Pushed
e2f774cd6dd0: Pushed
3bb9c6857c1e: Pushed
ac8884f3268a: Pushed
3243496112bd: Pushed
592baa148f4e: Pushed
0c777c7fef20: Pushed
8106664a6d6a: Pushed
042411f0b499: Pushed
5183217745a1: Layer already exists
8f9a0afee67e: Pushed
905ede8abeca: Layer already exists
63ab2579942e: Layer already exists
e6e9854ca999: Layer already exists
397a239a053b: Layer already exists
89c3244a87b2: Layer already exists
80231db1194c: Layer already exists
f1c1f2298584: Layer already exists
ccba29d69370: Layer already exists
da23bf84548f: Pushed
1f16cbbc41e0: Pushed
f6c25116bddc: Pushed
20221206035338: digest: sha256:27e2a70135017f8b651897dd7640f149d35b31f7136d71b2c1bf5cafdad58abf size: 5156

> Task :runners:google-cloud-dataflow-java:setupXVR

> Task :runners:google-cloud-dataflow-java:validatesCrossLanguageRunnerSetup
Launching Java expansion service @ 46083
Launching Python expansion service @ 34265

> Task :runners:google-cloud-dataflow-java:validatesCrossLanguageRunnerJavaUsingPython

org.apache.beam.sdk.extensions.python.transforms.DataframeTransformTest > testDataframeSum FAILED
    java.lang.RuntimeException at TestDataflowRunner.java:141

16 tests completed, 1 failed, 2 skipped

> Task :runners:google-cloud-dataflow-java:validatesCrossLanguageRunnerJavaUsingPython FAILED
> Task :runners:google-cloud-dataflow-java:cleanupXVR UP-TO-DATE

> Task :runners:google-cloud-dataflow-java:cleanUpDockerPythonImages
Untagged: us.gcr.io/apache-beam-testing/java-postcommit-it/python:20221206035338
Untagged: us.gcr.io/apache-beam-testing/java-postcommit-it/python@sha256:27e2a70135017f8b651897dd7640f149d35b31f7136d71b2c1bf5cafdad58abf
WARNING: Successfully resolved tag to sha256, but it is recommended to use sha256 directly.
Tag: [us.gcr.io/apache-beam-testing/java-postcommit-it/python:20221206035338]
- referencing digest: [us.gcr.io/apache-beam-testing/java-postcommit-it/python@sha256:27e2a70135017f8b651897dd7640f149d35b31f7136d71b2c1bf5cafdad58abf]

Deleted [[us.gcr.io/apache-beam-testing/java-postcommit-it/python:20221206035338] (referencing [us.gcr.io/apache-beam-testing/java-postcommit-it/python@sha256:27e2a70135017f8b651897dd7640f149d35b31f7136d71b2c1bf5cafdad58abf])].
Removing untagged image us.gcr.io/apache-beam-testing/java-postcommit-it/python@sha256:27e2a70135017f8b651897dd7640f149d35b31f7136d71b2c1bf5cafdad58abf
Digests:
- us.gcr.io/apache-beam-testing/java-postcommit-it/python@sha256:27e2a70135017f8b651897dd7640f149d35b31f7136d71b2c1bf5cafdad58abf
Deleted [us.gcr.io/apache-beam-testing/java-postcommit-it/python@sha256:27e2a70135017f8b651897dd7640f149d35b31f7136d71b2c1bf5cafdad58abf].

> Task :runners:google-cloud-dataflow-java:cleanUpDockerJavaImages
Untagged: us.gcr.io/apache-beam-testing/java-postcommit-it/java:20221206035338
Untagged: us.gcr.io/apache-beam-testing/java-postcommit-it/java@sha256:4252c5823fd105a9cccea48d1d37436a2deaea459402131dd1f9a4d2a560a570
Deleted: sha256:f3149a4a3f1d76f3d1f93dc047aa99e7e4b7c4681e528739d6fddc6ee40beeac
Deleted: sha256:1fac3a284e154fd7a2c42fd5973aff7729c61154c45e6b9caa181328bd3d94b4
Deleted: sha256:0da7297380f7e0be4df2f85d19be0e5ba082f4594c9a73af08d6fd0c583f1a4f
Deleted: sha256:b2304e8dafce5a7087ed88f0da25b8431fd98e1571a4db7ac6f2c5c5dbef62ce
Deleted: sha256:385f67bcb5c2a8f58dc282a7bce1d9c4603fd60af6c54117dd93d82f22ae141e
Deleted: sha256:8da02b0ef1bbb155ab3a8a967c8c8f9f23e41c26c2a7a81b4b0ac7824884ba93
Deleted: sha256:cd77972eea851fd4b37b2e22b650ec383d7bebfee422d9fba99b7ef7295e4fe2
Deleted: sha256:35cbd6cfd425739c220b1e4bb699006d19b5bf50aa4b1d1d73b99f6d5c61c94e
Deleted: sha256:ff3660058cf70d4e4e4ee1ebef660e7267fa0978761e7c45b51f851739c3c251
Deleted: sha256:e9fc610f4730860dec37ed911c82bf65df4951ed7af1fb9dc6ec6def3049765f
Deleted: sha256:949b26bc675807cf0cb93ea83d9a7c5307d81d76c375a5595a74dae7c87e6cc3
Deleted: sha256:65958018ca008b50cdf8ac1b40984e5fd51dc984f64ad31f74157efd113bf6c2
Deleted: sha256:92bb352c5a51f6285c2150baaba5ac096e4f1e6f2550a78e020936a1bda65636
Deleted: sha256:a5a2ebff1f084ec5668772b1d6e21221e70133fa065879d7c4a3fb1da3b5eb36
Deleted: sha256:960685a6172ff5f4fde5f9dfaa7305d1cb4b6e603db0565800e367e175f2f5e1
Deleted: sha256:eb7d57d842b6a30bb43abec7143a37f0a83bf8654c6b0c05be2ee22ecfa21b12
Deleted: sha256:94297fc6d1c8a68a4de1641ebf076cf7eb1dc08f4179735d584c2a1ee630e301
Deleted: sha256:b7620275ceb754d1a434793df6f83aa7865e69c03d9ae2b38f5e5931e1c28791
Deleted: sha256:8b0bfd9e2fd51cebb4d64f37f07517042ea674d9ae199c1dc95640a1e86d2bce
Deleted: sha256:e9b88d7358670df3c49dbd5a63e90869e876deff25bc1cc9638a4f33882ab63a
Deleted: sha256:24075a96434429561bfe1795dcce7efbd987590318f4758609a18479d5e8baa9
Deleted: sha256:1d97d1e66f91c4d9b68b538be08409233dbc332d931f76709ee1ae461c01d38a
Deleted: sha256:f256a95d486e4c1e303f0a6cb18564464bc6c63cab34610174359ed099ff1a28
Deleted: sha256:cb1375ba3b1e48d5208df284287612b65eb1810eabe2f0095517f4ec79a26847
Deleted: sha256:348acd838305a8720320a628be32eb982ead6bd10fb4b47bdcc56a6be9551890
Deleted: sha256:f83f0a6d52d440828a8aa28e6d6e0c3d9712a5caded78cb194cebfbe58922bce
Deleted: sha256:1859269fe31d2621b316cd116f9e087c72cb9f925c3ed129104c461162772271
Deleted: sha256:e440564ff64ce65a517c7a245b5b142d276d861c999a9b5d238c3e94c8d63297
Deleted: sha256:d753cd323570799e739d1cdd206df72de83548b8c1a1512d71a1df223d23519f
Deleted: sha256:707404806cd8dc10040daa7ea906fca0213a3c73fe2cbd10ec84e54a9a7553fc
Deleted: sha256:4158b026d98219a8940b6cb7e34ea01feaa5030eca7d6cb3cc23cd7546edc1bf
Deleted: sha256:ec55a3c988fdeca920b25355a056b7969ea34a9ee9991d7b8833d3a7f9937ee9
Deleted: sha256:325f3b84d97730836b62385a231b55ad8a20062347b2656aadc36132c6fb361c
Deleted: sha256:a8eba51f8b354c88e4eb46e1e2471b67a7881d64014a2d67137219b99a325f14
WARNING: Successfully resolved tag to sha256, but it is recommended to use sha256 directly.
Tag: [us.gcr.io/apache-beam-testing/java-postcommit-it/java:20221206035338]
- referencing digest: [us.gcr.io/apache-beam-testing/java-postcommit-it/java@sha256:4252c5823fd105a9cccea48d1d37436a2deaea459402131dd1f9a4d2a560a570]

Deleted [[us.gcr.io/apache-beam-testing/java-postcommit-it/java:20221206035338] (referencing [us.gcr.io/apache-beam-testing/java-postcommit-it/java@sha256:4252c5823fd105a9cccea48d1d37436a2deaea459402131dd1f9a4d2a560a570])].
Removing untagged image us.gcr.io/apache-beam-testing/java-postcommit-it/java@sha256:4252c5823fd105a9cccea48d1d37436a2deaea459402131dd1f9a4d2a560a570
Digests:
- us.gcr.io/apache-beam-testing/java-postcommit-it/java@sha256:4252c5823fd105a9cccea48d1d37436a2deaea459402131dd1f9a4d2a560a570
Deleted [us.gcr.io/apache-beam-testing/java-postcommit-it/java@sha256:4252c5823fd105a9cccea48d1d37436a2deaea459402131dd1f9a4d2a560a570].

> Task :runners:google-cloud-dataflow-java:validatesCrossLanguageRunnerCleanup
Stopping expansion service pid: 3003487.
Stopping expansion service pid: 3003488.

FAILURE: Build failed with an exception.

* What went wrong:
Execution failed for task ':runners:google-cloud-dataflow-java:validatesCrossLanguageRunnerJavaUsingPython'.
> There were failing tests. See the report at: file://<https://ci-beam.apache.org/job/beam_PostCommit_XVR_JavaUsingPython_Dataflow/ws/src/runners/google-cloud-dataflow-java/build/reports/tests/validatesCrossLanguageRunnerJavaUsingPython/index.html>

* Try:
> Run with --stacktrace option to get the stack trace.
> Run with --info or --debug option to get more log output.

* Get more help at https://help.gradle.org

Deprecated Gradle features were used in this build, making it incompatible with Gradle 8.0.

You can use '--warning-mode all' to show the individual deprecation warnings and determine if they come from your own scripts or plugins.

See https://docs.gradle.org/7.5.1/userguide/command_line_interface.html#sec:command_line_warnings

Execution optimizations have been disabled for 1 invalid unit(s) of work during this build to ensure correctness.
Please consult deprecation warnings for more details.

BUILD FAILED in 40m 10s
174 actionable tasks: 25 executed, 149 up-to-date

Publishing build scan...
https://gradle.com/s/odcyxl3wugdlm

Build step 'Invoke Gradle script' changed build result to FAILURE
Build step 'Invoke Gradle script' marked build as failure

---------------------------------------------------------------------
To unsubscribe, e-mail: builds-unsubscribe@beam.apache.org
For additional commands, e-mail: builds-help@beam.apache.org


Build failed in Jenkins: beam_PostCommit_XVR_JavaUsingPython_Dataflow #1247

Posted by Apache Jenkins Server <je...@builds.apache.org>.
See <https://ci-beam.apache.org/job/beam_PostCommit_XVR_JavaUsingPython_Dataflow/1247/display/redirect?page=changes>

Changes:

[noreply] Update nbconvert requirement in /sdks/python

[noreply] Replaced deprecated finalize with DoFn Teardown (#24516)

[noreply] Bump cloud.google.com/go/storage from 1.28.0 to 1.28.1 in /sdks (#24517)

[noreply] add clarifier to error message (#24449)

[noreply] Batch rename requests in fileio.WriteToFiles (#24341)

[noreply] Bump golang.org/x/text from 0.4.0 to 0.5.0 in /sdks (#24520)

[noreply] Support for JsonSchema in Kafka Read Schema Transform (#24272)

[noreply] Run go fmt over full go directory with go 1.19 (#24525)

[noreply] Cloudbuild+manualsetup+playground (#24144)

[noreply] Bump golang.org/x/sys from 0.2.0 to 0.3.0 in /sdks (#24519)

[noreply] Bump cloud.google.com/go/bigtable from 1.18.0 to 1.18.1 in /sdks

[noreply] Update from interface{} -> any for core packages (#24505)

[noreply] Implement FileWriteSchemaTransformConfiguration (#24479)


------------------------------------------
[...truncated 1.04 MB...]
Step 19/32 : COPY target/NOTICE /opt/apache/beam/
 ---> e2fa4d1944b9
Step 20/32 : COPY target/launcher/linux_amd64/boot /opt/apache/beam/
 ---> 5eff5d11e792
Step 21/32 : ENTRYPOINT ["/opt/apache/beam/boot"]
 ---> Running in 90ca068570ab
Removing intermediate container 90ca068570ab
 ---> fdcceae77c22
Step 22/32 : FROM beam as third_party_licenses
 ---> fdcceae77c22
Step 23/32 : ARG pull_licenses
 ---> Running in a42f004e98de
Removing intermediate container a42f004e98de
 ---> 57856300e791
Step 24/32 : COPY target/license_scripts /tmp/license_scripts/
 ---> 17db3f90a99a
Step 25/32 : COPY target/LICENSE target/go-licenses/* /opt/apache/beam/third_party_licenses/golang/
 ---> 2c4523d66bf7
Step 26/32 : RUN rm /opt/apache/beam/third_party_licenses/golang/LICENSE
 ---> Running in da89e68a1076
Removing intermediate container da89e68a1076
 ---> 31a57bd46cc1
Step 27/32 : COPY target/license_scripts /tmp/license_scripts/
 ---> cc87ce3823e4
Step 28/32 : RUN if [ "$pull_licenses" = "true" ] ; then       pip install 'pip-licenses<4.0.0' pyyaml tenacity &&       python /tmp/license_scripts/pull_licenses_py.py ;     fi
 ---> Running in 431091521f1e
Collecting pip-licenses<4.0.0
  Downloading pip_licenses-3.5.5-py3-none-any.whl (17 kB)
Requirement already satisfied: pyyaml in /usr/local/lib/python3.10/site-packages (6.0)
Requirement already satisfied: tenacity in /usr/local/lib/python3.10/site-packages (5.1.5)
Collecting PTable
  Downloading PTable-0.9.2.tar.gz (31 kB)
  Preparing metadata (setup.py): started
  Preparing metadata (setup.py): finished with status 'done'
Requirement already satisfied: six>=1.9.0 in /usr/local/lib/python3.10/site-packages (from tenacity) (1.16.0)
Building wheels for collected packages: PTable
  Building wheel for PTable (setup.py): started
  Building wheel for PTable (setup.py): finished with status 'done'
  Created wheel for PTable: filename=PTable-0.9.2-py3-none-any.whl size=22908 sha256=959be793ca48112f0800688c8f46fa082f152c33fc9f1051a4936679b4637d16
  Stored in directory: /root/.cache/pip/wheels/62/2a/42/c655cf57d84ab59535337af009892aaf16256a813826b465f7
Successfully built PTable
Installing collected packages: PTable, pip-licenses
Successfully installed PTable-0.9.2 pip-licenses-3.5.5
WARNING: Running pip as the 'root' user can result in broken permissions and conflicting behaviour with the system package manager. It is recommended to use a virtual environment instead: https://pip.pypa.io/warnings/venv
INFO:root:Successfully pulled licenses for 135 dependencies
Skip pulling license for  bs4
Removing intermediate container 431091521f1e
 ---> d56546764a3e
Step 29/32 : FROM beam
 ---> fdcceae77c22
Step 30/32 : ARG pull_licenses
 ---> Running in 6c8ad5b995c1
Removing intermediate container 6c8ad5b995c1
 ---> bfa82357c327
Step 31/32 : COPY --from=third_party_licenses /opt/apache/beam/third_party_licenses /opt/apache/beam/third_party_licenses
 ---> 2dedfb69a9f1
Step 32/32 : RUN if [ "$pull_licenses" != "true" ] ; then       rm -rf /opt/apache/beam/third_party_licenses ;     fi
 ---> Running in 9605610c6b7d
Removing intermediate container 9605610c6b7d
 ---> 902c25b006cc
Successfully built 902c25b006cc
Successfully tagged apache/beam_python3.10_sdk:2.45.0.dev

> Task :runners:google-cloud-dataflow-java:buildAndPushDockerPythonContainer
WARNING: `gcloud docker` will not be supported for Docker client versions above 18.03.

As an alternative, use `gcloud auth configure-docker` to configure `docker` to
use `gcloud` as a credential helper, then use `docker` as you would for non-GCR
registries, e.g. `docker pull gcr.io/project-id/my-image`. Add
`--verbosity=error` to silence this warning: `gcloud docker
--verbosity=error -- pull gcr.io/project-id/my-image`.

See: https://cloud.google.com/container-registry/docs/support/deprecation-notices#gcloud-docker

The push refers to repository [us.gcr.io/apache-beam-testing/java-postcommit-it/python]
7a7920016ee6: Preparing
d5c3c4247d4b: Preparing
f354bad944e8: Preparing
b805d5cd9116: Preparing
1a2d68c400b7: Preparing
cc9e07ea5659: Preparing
bc1e14cf65bf: Preparing
46b6bf282968: Preparing
d1b3dddc2d75: Preparing
296e88138dec: Preparing
da3781755d36: Preparing
a2be575c3da4: Preparing
68dff39c8291: Preparing
f9bf5a2f2b45: Preparing
5183217745a1: Preparing
905ede8abeca: Preparing
63ab2579942e: Preparing
e6e9854ca999: Preparing
397a239a053b: Preparing
89c3244a87b2: Preparing
80231db1194c: Preparing
f1c1f2298584: Preparing
ccba29d69370: Preparing
cc9e07ea5659: Waiting
905ede8abeca: Waiting
e6e9854ca999: Waiting
80231db1194c: Waiting
bc1e14cf65bf: Waiting
63ab2579942e: Waiting
f9bf5a2f2b45: Waiting
46b6bf282968: Waiting
f1c1f2298584: Waiting
397a239a053b: Waiting
89c3244a87b2: Waiting
5183217745a1: Waiting
ccba29d69370: Waiting
d1b3dddc2d75: Waiting
68dff39c8291: Waiting
a2be575c3da4: Waiting
296e88138dec: Waiting
b805d5cd9116: Pushed
7a7920016ee6: Pushed
f354bad944e8: Pushed
1a2d68c400b7: Pushed
46b6bf282968: Pushed
d5c3c4247d4b: Pushed
bc1e14cf65bf: Pushed
d1b3dddc2d75: Pushed
68dff39c8291: Pushed
f9bf5a2f2b45: Pushed
5183217745a1: Layer already exists
905ede8abeca: Layer already exists
63ab2579942e: Layer already exists
e6e9854ca999: Layer already exists
397a239a053b: Layer already exists
89c3244a87b2: Layer already exists
80231db1194c: Layer already exists
f1c1f2298584: Layer already exists
ccba29d69370: Layer already exists
da3781755d36: Pushed
cc9e07ea5659: Pushed
296e88138dec: Pushed
a2be575c3da4: Pushed
20221205214539: digest: sha256:0be7e31a5eb7ab996ac61760f1400798b245e08204b7cfd5d4b85a91435abb2e size: 5156

> Task :runners:google-cloud-dataflow-java:setupXVR

> Task :runners:google-cloud-dataflow-java:validatesCrossLanguageRunnerSetup
Launching Java expansion service @ 40229
Launching Python expansion service @ 45235

> Task :runners:google-cloud-dataflow-java:validatesCrossLanguageRunnerJavaUsingPython

org.apache.beam.sdk.extensions.python.transforms.DataframeTransformTest > testDataframeSum FAILED
    java.lang.RuntimeException at TestDataflowRunner.java:141

16 tests completed, 1 failed, 2 skipped

> Task :runners:google-cloud-dataflow-java:validatesCrossLanguageRunnerJavaUsingPython FAILED
> Task :runners:google-cloud-dataflow-java:cleanupXVR UP-TO-DATE

> Task :runners:google-cloud-dataflow-java:cleanUpDockerPythonImages
Untagged: us.gcr.io/apache-beam-testing/java-postcommit-it/python:20221205214539
Untagged: us.gcr.io/apache-beam-testing/java-postcommit-it/python@sha256:0be7e31a5eb7ab996ac61760f1400798b245e08204b7cfd5d4b85a91435abb2e
WARNING: Successfully resolved tag to sha256, but it is recommended to use sha256 directly.
Tag: [us.gcr.io/apache-beam-testing/java-postcommit-it/python:20221205214539]
- referencing digest: [us.gcr.io/apache-beam-testing/java-postcommit-it/python@sha256:0be7e31a5eb7ab996ac61760f1400798b245e08204b7cfd5d4b85a91435abb2e]

Deleted [[us.gcr.io/apache-beam-testing/java-postcommit-it/python:20221205214539] (referencing [us.gcr.io/apache-beam-testing/java-postcommit-it/python@sha256:0be7e31a5eb7ab996ac61760f1400798b245e08204b7cfd5d4b85a91435abb2e])].
Removing untagged image us.gcr.io/apache-beam-testing/java-postcommit-it/python@sha256:0be7e31a5eb7ab996ac61760f1400798b245e08204b7cfd5d4b85a91435abb2e
Digests:
- us.gcr.io/apache-beam-testing/java-postcommit-it/python@sha256:0be7e31a5eb7ab996ac61760f1400798b245e08204b7cfd5d4b85a91435abb2e
Deleted [us.gcr.io/apache-beam-testing/java-postcommit-it/python@sha256:0be7e31a5eb7ab996ac61760f1400798b245e08204b7cfd5d4b85a91435abb2e].

> Task :runners:google-cloud-dataflow-java:cleanUpDockerJavaImages
Untagged: us.gcr.io/apache-beam-testing/java-postcommit-it/java:20221205214539
Untagged: us.gcr.io/apache-beam-testing/java-postcommit-it/java@sha256:ce2b2229ee9719e376fbf8a63026147ee0846bcae6890dbd26ffaf21146219b2
Deleted: sha256:d81d25c5f5e3700c16b1a38be62cbaec2b9d9dc54bfd9cbe1a2c0902fac21f3b
Deleted: sha256:53d1fffef044ff45e0da4d188be6b563e82870ad9031d0a1c8ba8c60d3685c00
Deleted: sha256:36c80d52dca1b82b670fa79d417ace477f92a3ade33b037e8bc65e64d7398c5e
Deleted: sha256:c1325f586fcf574f573cff54191024b184d14b39f4f7d5bab2a2a9c38951a8db
Deleted: sha256:cc54b1ab8a4b8b846a07fceb247ede08018268f270c00bde651535fdfac23ffa
Deleted: sha256:5079603ac2b033cb2ddc8ed3d9ce32cd54f274d2c7c6c4cf7a40acb2403db016
Deleted: sha256:a89a3bffc348b2a49ad515a1fc2af01b7aeff6728a796d323c3917786514001f
Deleted: sha256:753087cdf2510d2396fbc76ee5b4b690b53389c46e75e8b0b1c9afb40ce466ce
Deleted: sha256:49a89f0368bb641ac643b96b9bbf7dc7357d0ebb2c8daa4608eecb158778262b
Deleted: sha256:d735b3ecc69bb6378aca919ba27ade41abd63a03df715e3c07b464d5fbb01a97
Deleted: sha256:2a58d8293547f4248890036d33b4bf4733ceb7bef51d4d40dc845f6b2603aa54
Deleted: sha256:684710bc42060deeed9f9597853fa79ddd0af33deaebbaf3a18f4254e31c1c6a
Deleted: sha256:5d600df689653f05ed33f1e923fe15a08d2483bf5952b55cff73707ab013c38f
Deleted: sha256:2fa6af050d99472ee98e9e277c773672732de03ae6d20d4970b03f7eff180371
Deleted: sha256:02c31e3e259f85f78c2ff54649f392a8a5fad3f6d6a79b9fd86e88b711dd4bac
Deleted: sha256:e7ebfd4ac1d967d4e50171a64984508dd574919eaeff26f85112788964e3d3f9
Deleted: sha256:1c4cb597fdccc40dd5f0186665b0af49de5fe5f660d618a444371318f46c6fc2
Deleted: sha256:e32a2acfa9568ee7a184bcb400ff3fe266fd824fe7c32303cf4c1f9bf715566e
Deleted: sha256:6d92773c93c4c675b1ca8568e5ad686a1078260076cef192d23d996f555527de
Deleted: sha256:9a8849fef772866ff24e96c2965deb2d1947877a25c0e07e90c8c7c39966b413
Deleted: sha256:84b4b967e9f3002aa0f20ade3375a314372d217df0069f70b5260bb9b25aafb2
Deleted: sha256:5642d3e575a2f45250a39a32187d7fd6d95ca50c20b29555237b3a8a6ab34bd4
Deleted: sha256:a9a548c46c1f8fae0813c6ec217c965affac492a5b78d1cdbbf7343d0e623fcb
Deleted: sha256:af29281ef34948fc6eb6b4d0f3908e98dd381701e62ca9fb70739e4608db60f0
Deleted: sha256:6f9d7cc4efcf217e42cf2b23e41034a84a19962339e70f3d2dde546b196879e6
Deleted: sha256:77b7399b07ea6d42fabc08a6bb9d7e67d5b3d12d00f9dbec758f82bf62d9a25d
Deleted: sha256:6f48e29db36dd5117acbdc77137e7e2cd436d02e502fd3bdbd77dc5790b7b6b6
Deleted: sha256:01e45fb4b72929b085a4e916c7ea9f5aa8d2e75fdeb484f915a9551d4c3549fa
Deleted: sha256:6416ede06bff37d12c84d1c874e175e2cc888d4996054e3aedd469d6370730f0
Deleted: sha256:77b89ff1dc6977c76bd9277873783fda76c9c15fd466e51bbdf982854f0a5ed9
Deleted: sha256:4088bb3be4f71a5bc71de65345d781bb72e1f945b2610037b155d028383805cd
Deleted: sha256:947a9a5768337dff5fb99a634d5ac92dc2de75280313e37f47a01b396e7d6b9b
Deleted: sha256:4bee02ce93befadf258a31a426b4be7b4bebcab13c2102a4248cf71a05224cdd
Deleted: sha256:09bfc349bef4ad14f586b2331b7a957c74b145335571da7c462c2009d77206a8
WARNING: Successfully resolved tag to sha256, but it is recommended to use sha256 directly.
Tag: [us.gcr.io/apache-beam-testing/java-postcommit-it/java:20221205214539]
- referencing digest: [us.gcr.io/apache-beam-testing/java-postcommit-it/java@sha256:ce2b2229ee9719e376fbf8a63026147ee0846bcae6890dbd26ffaf21146219b2]

Deleted [[us.gcr.io/apache-beam-testing/java-postcommit-it/java:20221205214539] (referencing [us.gcr.io/apache-beam-testing/java-postcommit-it/java@sha256:ce2b2229ee9719e376fbf8a63026147ee0846bcae6890dbd26ffaf21146219b2])].
Removing untagged image us.gcr.io/apache-beam-testing/java-postcommit-it/java@sha256:ce2b2229ee9719e376fbf8a63026147ee0846bcae6890dbd26ffaf21146219b2
Digests:
- us.gcr.io/apache-beam-testing/java-postcommit-it/java@sha256:ce2b2229ee9719e376fbf8a63026147ee0846bcae6890dbd26ffaf21146219b2
Deleted [us.gcr.io/apache-beam-testing/java-postcommit-it/java@sha256:ce2b2229ee9719e376fbf8a63026147ee0846bcae6890dbd26ffaf21146219b2].

> Task :runners:google-cloud-dataflow-java:validatesCrossLanguageRunnerCleanup
Stopping expansion service pid: 1044967.
Stopping expansion service pid: 1044968.

FAILURE: Build failed with an exception.

* What went wrong:
Execution failed for task ':runners:google-cloud-dataflow-java:validatesCrossLanguageRunnerJavaUsingPython'.
> There were failing tests. See the report at: file://<https://ci-beam.apache.org/job/beam_PostCommit_XVR_JavaUsingPython_Dataflow/ws/src/runners/google-cloud-dataflow-java/build/reports/tests/validatesCrossLanguageRunnerJavaUsingPython/index.html>

* Try:
> Run with --stacktrace option to get the stack trace.
> Run with --info or --debug option to get more log output.

* Get more help at https://help.gradle.org

Deprecated Gradle features were used in this build, making it incompatible with Gradle 8.0.

You can use '--warning-mode all' to show the individual deprecation warnings and determine if they come from your own scripts or plugins.

See https://docs.gradle.org/7.5.1/userguide/command_line_interface.html#sec:command_line_warnings

Execution optimizations have been disabled for 1 invalid unit(s) of work during this build to ensure correctness.
Please consult deprecation warnings for more details.

BUILD FAILED in 35m 19s
174 actionable tasks: 25 executed, 149 up-to-date

Publishing build scan...
https://gradle.com/s/44kcyfeqfkwhk

Build step 'Invoke Gradle script' changed build result to FAILURE
Build step 'Invoke Gradle script' marked build as failure

---------------------------------------------------------------------
To unsubscribe, e-mail: builds-unsubscribe@beam.apache.org
For additional commands, e-mail: builds-help@beam.apache.org


Build failed in Jenkins: beam_PostCommit_XVR_JavaUsingPython_Dataflow #1246

Posted by Apache Jenkins Server <je...@builds.apache.org>.
See <https://ci-beam.apache.org/job/beam_PostCommit_XVR_JavaUsingPython_Dataflow/1246/display/redirect?page=changes>

Changes:

[noreply] [CdapIO] Add readme for CdapIO. Update readme for SparkReceiverIO.

[Moritz Mack] [Spark Dataset runner] Add @Experimental and reduce visibility where

[noreply] Fix grafana dashboard id (#24524)

[noreply] [Spark runner] Support running (VR) tests with Java 17 (closes #24400)


------------------------------------------
[...truncated 588.84 KB...]
	at java.util.concurrent.ThreadPoolExecutor.runWorker(ThreadPoolExecutor.java:1149)
	at java.util.concurrent.ThreadPoolExecutor$Worker.run(ThreadPoolExecutor.java:624)
	at java.lang.Thread.run(Thread.java:750)
Caused by: java.io.IOException: No space left on device
	at java.io.FileOutputStream.writeBytes(Native Method)
	at java.io.FileOutputStream.write(FileOutputStream.java:326)
	at com.esotericsoftware.kryo.io.Output.flush(Output.java:163)
	... 54 more
java.io.IOException: No space left on device
com.esotericsoftware.kryo.KryoException: java.io.IOException: No space left on device
	at com.esotericsoftware.kryo.io.Output.flush(Output.java:165)
	at com.esotericsoftware.kryo.io.Output.require(Output.java:142)
	at com.esotericsoftware.kryo.io.Output.writeBoolean(Output.java:613)
	at org.gradle.internal.serialize.kryo.KryoBackedEncoder.writeBoolean(KryoBackedEncoder.java:73)
	at org.gradle.api.internal.tasks.testing.junit.result.TestOutputStore$Writer.onOutput(TestOutputStore.java:107)
	at org.gradle.api.internal.tasks.testing.junit.result.TestReportDataCollector.onOutput(TestReportDataCollector.java:152)
	at sun.reflect.GeneratedMethodAccessor790.invoke(Unknown Source)
	at sun.reflect.DelegatingMethodAccessorImpl.invoke(DelegatingMethodAccessorImpl.java:43)
	at java.lang.reflect.Method.invoke(Method.java:498)
	at org.gradle.internal.dispatch.ReflectionDispatch.dispatch(ReflectionDispatch.java:36)
	at org.gradle.internal.dispatch.ReflectionDispatch.dispatch(ReflectionDispatch.java:24)
	at org.gradle.internal.event.AbstractBroadcastDispatch.dispatch(AbstractBroadcastDispatch.java:43)
	at org.gradle.internal.event.BroadcastDispatch$SingletonDispatch.dispatch(BroadcastDispatch.java:245)
	at org.gradle.internal.event.BroadcastDispatch$SingletonDispatch.dispatch(BroadcastDispatch.java:157)
	at org.gradle.internal.event.AbstractBroadcastDispatch.dispatch(AbstractBroadcastDispatch.java:61)
	at org.gradle.internal.event.BroadcastDispatch$CompositeDispatch.dispatch(BroadcastDispatch.java:346)
	at org.gradle.internal.event.BroadcastDispatch$CompositeDispatch.dispatch(BroadcastDispatch.java:249)
	at org.gradle.internal.event.ListenerBroadcast.dispatch(ListenerBroadcast.java:141)
	at org.gradle.internal.event.ListenerBroadcast.dispatch(ListenerBroadcast.java:37)
	at org.gradle.internal.dispatch.ProxyDispatchAdapter$DispatchingInvocationHandler.invoke(ProxyDispatchAdapter.java:94)
	at com.sun.proxy.$Proxy107.onOutput(Unknown Source)
	at org.gradle.api.internal.tasks.testing.results.TestListenerAdapter.output(TestListenerAdapter.java:56)
	at sun.reflect.GeneratedMethodAccessor789.invoke(Unknown Source)
	at sun.reflect.DelegatingMethodAccessorImpl.invoke(DelegatingMethodAccessorImpl.java:43)
	at java.lang.reflect.Method.invoke(Method.java:498)
	at org.gradle.internal.dispatch.ReflectionDispatch.dispatch(ReflectionDispatch.java:36)
	at org.gradle.internal.dispatch.ReflectionDispatch.dispatch(ReflectionDispatch.java:24)
	at org.gradle.internal.event.AbstractBroadcastDispatch.dispatch(AbstractBroadcastDispatch.java:43)
	at org.gradle.internal.event.BroadcastDispatch$SingletonDispatch.dispatch(BroadcastDispatch.java:245)
	at org.gradle.internal.event.BroadcastDispatch$SingletonDispatch.dispatch(BroadcastDispatch.java:157)
	at org.gradle.internal.event.AbstractBroadcastDispatch.dispatch(AbstractBroadcastDispatch.java:61)
	at org.gradle.internal.event.BroadcastDispatch$CompositeDispatch.dispatch(BroadcastDispatch.java:346)
	at org.gradle.internal.event.BroadcastDispatch$CompositeDispatch.dispatch(BroadcastDispatch.java:249)
	at org.gradle.internal.event.ListenerBroadcast.dispatch(ListenerBroadcast.java:141)
	at org.gradle.internal.event.ListenerBroadcast.dispatch(ListenerBroadcast.java:37)
	at org.gradle.internal.dispatch.ProxyDispatchAdapter$DispatchingInvocationHandler.invoke(ProxyDispatchAdapter.java:94)
	at com.sun.proxy.$Proxy108.output(Unknown Source)
	at org.gradle.api.internal.tasks.testing.results.StateTrackingTestResultProcessor.output(StateTrackingTestResultProcessor.java:112)
	at org.gradle.api.internal.tasks.testing.results.AttachParentTestResultProcessor.output(AttachParentTestResultProcessor.java:48)
	at sun.reflect.GeneratedMethodAccessor794.invoke(Unknown Source)
	at sun.reflect.DelegatingMethodAccessorImpl.invoke(DelegatingMethodAccessorImpl.java:43)
	at java.lang.reflect.Method.invoke(Method.java:498)
	at org.gradle.internal.dispatch.ReflectionDispatch.dispatch(ReflectionDispatch.java:36)
	at org.gradle.internal.dispatch.ReflectionDispatch.dispatch(ReflectionDispatch.java:24)
	at org.gradle.internal.dispatch.FailureHandlingDispatch.dispatch(FailureHandlingDispatch.java:30)
	at org.gradle.internal.dispatch.AsyncDispatch.dispatchMessages(AsyncDispatch.java:87)
	at org.gradle.internal.dispatch.AsyncDispatch.access$000(AsyncDispatch.java:36)
	at org.gradle.internal.dispatch.AsyncDispatch$1.run(AsyncDispatch.java:71)
	at org.gradle.internal.concurrent.InterruptibleRunnable.run(InterruptibleRunnable.java:42)
	at org.gradle.internal.operations.CurrentBuildOperationPreservingRunnable.run(CurrentBuildOperationPreservingRunnable.java:42)
	at org.gradle.internal.concurrent.ExecutorPolicy$CatchAndRecordFailures.onExecute(ExecutorPolicy.java:64)
	at org.gradle.internal.concurrent.ManagedExecutorImpl$1.run(ManagedExecutorImpl.java:48)
	at java.util.concurrent.ThreadPoolExecutor.runWorker(ThreadPoolExecutor.java:1149)
	at java.util.concurrent.ThreadPoolExecutor$Worker.run(ThreadPoolExecutor.java:624)
	at java.lang.Thread.run(Thread.java:750)
Caused by: java.io.IOException: No space left on device
	at java.io.FileOutputStream.writeBytes(Native Method)
	at java.io.FileOutputStream.write(FileOutputStream.java:326)
	at com.esotericsoftware.kryo.io.Output.flush(Output.java:163)
	... 54 more
java.io.IOException: No space left on device
com.esotericsoftware.kryo.KryoException: java.io.IOException: No space left on device
	at com.esotericsoftware.kryo.io.Output.flush(Output.java:165)
	at com.esotericsoftware.kryo.io.Output.require(Output.java:142)
	at com.esotericsoftware.kryo.io.Output.writeBoolean(Output.java:613)
	at org.gradle.internal.serialize.kryo.KryoBackedEncoder.writeBoolean(KryoBackedEncoder.java:73)
	at org.gradle.api.internal.tasks.testing.junit.result.TestOutputStore$Writer.onOutput(TestOutputStore.java:107)
	at org.gradle.api.internal.tasks.testing.junit.result.TestReportDataCollector.onOutput(TestReportDataCollector.java:152)
	at sun.reflect.GeneratedMethodAccessor790.invoke(Unknown Source)
	at sun.reflect.DelegatingMethodAccessorImpl.invoke(DelegatingMethodAccessorImpl.java:43)
	at java.lang.reflect.Method.invoke(Method.java:498)
	at org.gradle.internal.dispatch.ReflectionDispatch.dispatch(ReflectionDispatch.java:36)
	at org.gradle.internal.dispatch.ReflectionDispatch.dispatch(ReflectionDispatch.java:24)
	at org.gradle.internal.event.AbstractBroadcastDispatch.dispatch(AbstractBroadcastDispatch.java:43)
	at org.gradle.internal.event.BroadcastDispatch$SingletonDispatch.dispatch(BroadcastDispatch.java:245)
	at org.gradle.internal.event.BroadcastDispatch$SingletonDispatch.dispatch(BroadcastDispatch.java:157)
	at org.gradle.internal.event.AbstractBroadcastDispatch.dispatch(AbstractBroadcastDispatch.java:61)
	at org.gradle.internal.event.BroadcastDispatch$CompositeDispatch.dispatch(BroadcastDispatch.java:346)
	at org.gradle.internal.event.BroadcastDispatch$CompositeDispatch.dispatch(BroadcastDispatch.java:249)
	at org.gradle.internal.event.ListenerBroadcast.dispatch(ListenerBroadcast.java:141)
	at org.gradle.internal.event.ListenerBroadcast.dispatch(ListenerBroadcast.java:37)
	at org.gradle.internal.dispatch.ProxyDispatchAdapter$DispatchingInvocationHandler.invoke(ProxyDispatchAdapter.java:94)
	at com.sun.proxy.$Proxy107.onOutput(Unknown Source)
	at org.gradle.api.internal.tasks.testing.results.TestListenerAdapter.output(TestListenerAdapter.java:56)
	at sun.reflect.GeneratedMethodAccessor789.invoke(Unknown Source)
	at sun.reflect.DelegatingMethodAccessorImpl.invoke(DelegatingMethodAccessorImpl.java:43)
	at java.lang.reflect.Method.invoke(Method.java:498)
	at org.gradle.internal.dispatch.ReflectionDispatch.dispatch(ReflectionDispatch.java:36)
	at org.gradle.internal.dispatch.ReflectionDispatch.dispatch(ReflectionDispatch.java:24)
	at org.gradle.internal.event.AbstractBroadcastDispatch.dispatch(AbstractBroadcastDispatch.java:43)
	at org.gradle.internal.event.BroadcastDispatch$SingletonDispatch.dispatch(BroadcastDispatch.java:245)
	at org.gradle.internal.event.BroadcastDispatch$SingletonDispatch.dispatch(BroadcastDispatch.java:157)
	at org.gradle.internal.event.AbstractBroadcastDispatch.dispatch(AbstractBroadcastDispatch.java:61)
	at org.gradle.internal.event.BroadcastDispatch$CompositeDispatch.dispatch(BroadcastDispatch.java:346)
	at org.gradle.internal.event.BroadcastDispatch$CompositeDispatch.dispatch(BroadcastDispatch.java:249)
	at org.gradle.internal.event.ListenerBroadcast.dispatch(ListenerBroadcast.java:141)
	at org.gradle.internal.event.ListenerBroadcast.dispatch(ListenerBroadcast.java:37)
	at org.gradle.internal.dispatch.ProxyDispatchAdapter$DispatchingInvocationHandler.invoke(ProxyDispatchAdapter.java:94)
	at com.sun.proxy.$Proxy108.output(Unknown Source)
	at org.gradle.api.internal.tasks.testing.results.StateTrackingTestResultProcessor.output(StateTrackingTestResultProcessor.java:112)
	at org.gradle.api.internal.tasks.testing.results.AttachParentTestResultProcessor.output(AttachParentTestResultProcessor.java:48)
	at sun.reflect.GeneratedMethodAccessor794.invoke(Unknown Source)
	at sun.reflect.DelegatingMethodAccessorImpl.invoke(DelegatingMethodAccessorImpl.java:43)
	at java.lang.reflect.Method.invoke(Method.java:498)
	at org.gradle.internal.dispatch.ReflectionDispatch.dispatch(ReflectionDispatch.java:36)
	at org.gradle.internal.dispatch.ReflectionDispatch.dispatch(ReflectionDispatch.java:24)
	at org.gradle.internal.dispatch.FailureHandlingDispatch.dispatch(FailureHandlingDispatch.java:30)
	at org.gradle.internal.dispatch.AsyncDispatch.dispatchMessages(AsyncDispatch.java:87)
	at org.gradle.internal.dispatch.AsyncDispatch.access$000(AsyncDispatch.java:36)
	at org.gradle.internal.dispatch.AsyncDispatch$1.run(AsyncDispatch.java:71)
	at org.gradle.internal.concurrent.InterruptibleRunnable.run(InterruptibleRunnable.java:42)
	at org.gradle.internal.operations.CurrentBuildOperationPreservingRunnable.run(CurrentBuildOperationPreservingRunnable.java:42)
	at org.gradle.internal.concurrent.ExecutorPolicy$CatchAndRecordFailures.onExecute(ExecutorPolicy.java:64)
	at org.gradle.internal.concurrent.ManagedExecutorImpl$1.run(ManagedExecutorImpl.java:48)
	at java.util.concurrent.ThreadPoolExecutor.runWorker(ThreadPoolExecutor.java:1149)
	at java.util.concurrent.ThreadPoolExecutor$Worker.run(ThreadPoolExecutor.java:624)
	at java.lang.Thread.run(Thread.java:750)
Caused by: java.io.IOException: No space left on device
	at java.io.FileOutputStream.writeBytes(Native Method)
	at java.io.FileOutputStream.write(FileOutputStream.java:326)
	at com.esotericsoftware.kryo.io.Output.flush(Output.java:163)
	... 54 more
java.io.IOException: No space left on device
com.esotericsoftware.kryo.KryoException: java.io.IOException: No space left on device
	at com.esotericsoftware.kryo.io.Output.flush(Output.java:165)
	at com.esotericsoftware.kryo.io.Output.require(Output.java:142)
	at com.esotericsoftware.kryo.io.Output.writeBoolean(Output.java:613)
	at org.gradle.internal.serialize.kryo.KryoBackedEncoder.writeBoolean(KryoBackedEncoder.java:73)
	at org.gradle.api.internal.tasks.testing.junit.result.TestOutputStore$Writer.onOutput(TestOutputStore.java:107)
	at org.gradle.api.internal.tasks.testing.junit.result.TestReportDataCollector.onOutput(TestReportDataCollector.java:152)
	at sun.reflect.GeneratedMethodAccessor790.invoke(Unknown Source)
	at sun.reflect.DelegatingMethodAccessorImpl.invoke(DelegatingMethodAccessorImpl.java:43)
	at java.lang.reflect.Method.invoke(Method.java:498)
	at org.gradle.internal.dispatch.ReflectionDispatch.dispatch(ReflectionDispatch.java:36)
	at org.gradle.internal.dispatch.ReflectionDispatch.dispatch(ReflectionDispatch.java:24)
	at org.gradle.internal.event.AbstractBroadcastDispatch.dispatch(AbstractBroadcastDispatch.java:43)
	at org.gradle.internal.event.BroadcastDispatch$SingletonDispatch.dispatch(BroadcastDispatch.java:245)
	at org.gradle.internal.event.BroadcastDispatch$SingletonDispatch.dispatch(BroadcastDispatch.java:157)
	at org.gradle.internal.event.AbstractBroadcastDispatch.dispatch(AbstractBroadcastDispatch.java:61)
	at org.gradle.internal.event.BroadcastDispatch$CompositeDispatch.dispatch(BroadcastDispatch.java:346)
	at org.gradle.internal.event.BroadcastDispatch$CompositeDispatch.dispatch(BroadcastDispatch.java:249)
	at org.gradle.internal.event.ListenerBroadcast.dispatch(ListenerBroadcast.java:141)
	at org.gradle.internal.event.ListenerBroadcast.dispatch(ListenerBroadcast.java:37)
	at org.gradle.internal.dispatch.ProxyDispatchAdapter$DispatchingInvocationHandler.invoke(ProxyDispatchAdapter.java:94)
	at com.sun.proxy.$Proxy107.onOutput(Unknown Source)
	at org.gradle.api.internal.tasks.testing.results.TestListenerAdapter.output(TestListenerAdapter.java:56)
	at sun.reflect.GeneratedMethodAccessor789.invoke(Unknown Source)
	at sun.reflect.DelegatingMethodAccessorImpl.invoke(DelegatingMethodAccessorImpl.java:43)
	at java.lang.reflect.Method.invoke(Method.java:498)
	at org.gradle.internal.dispatch.ReflectionDispatch.dispatch(ReflectionDispatch.java:36)
	at org.gradle.internal.dispatch.ReflectionDispatch.dispatch(ReflectionDispatch.java:24)
	at org.gradle.internal.event.AbstractBroadcastDispatch.dispatch(AbstractBroadcastDispatch.java:43)
	at org.gradle.internal.event.BroadcastDispatch$SingletonDispatch.dispatch(BroadcastDispatch.java:245)
	at org.gradle.internal.event.BroadcastDispatch$SingletonDispatch.dispatch(BroadcastDispatch.java:157)
	at org.gradle.internal.event.AbstractBroadcastDispatch.dispatch(AbstractBroadcastDispatch.java:61)
	at org.gradle.internal.event.BroadcastDispatch$CompositeDispatch.dispatch(BroadcastDispatch.java:346)
	at org.gradle.internal.event.BroadcastDispatch$CompositeDispatch.dispatch(BroadcastDispatch.java:249)
	at org.gradle.internal.event.ListenerBroadcast.dispatch(ListenerBroadcast.java:141)
	at org.gradle.internal.event.ListenerBroadcast.dispatch(ListenerBroadcast.java:37)
	at org.gradle.internal.dispatch.ProxyDispatchAdapter$DispatchingInvocationHandler.invoke(ProxyDispatchAdapter.java:94)
	at com.sun.proxy.$Proxy108.output(Unknown Source)
	at org.gradle.api.internal.tasks.testing.results.StateTrackingTestResultProcessor.output(StateTrackingTestResultProcessor.java:112)
	at org.gradle.api.internal.tasks.testing.results.AttachParentTestResultProcessor.output(AttachParentTestResultProcessor.java:48)
	at sun.reflect.GeneratedMethodAccessor794.invoke(Unknown Source)
	at sun.reflect.DelegatingMethodAccessorImpl.invoke(DelegatingMethodAccessorImpl.java:43)
	at java.lang.reflect.Method.invoke(Method.java:498)
	at org.gradle.internal.dispatch.ReflectionDispatch.dispatch(ReflectionDispatch.java:36)
	at org.gradle.internal.dispatch.ReflectionDispatch.dispatch(ReflectionDispatch.java:24)
	at org.gradle.internal.dispatch.FailureHandlingDispatch.dispatch(FailureHandlingDispatch.java:30)
	at org.gradle.internal.dispatch.AsyncDispatch.dispatchMessages(AsyncDispatch.java:87)
	at org.gradle.internal.dispatch.AsyncDispatch.access$000(AsyncDispatch.java:36)
	at org.gradle.internal.dispatch.AsyncDispatch$1.run(AsyncDispatch.java:71)
	at org.gradle.internal.concurrent.InterruptibleRunnable.run(InterruptibleRunnable.java:42)
	at org.gradle.internal.operations.CurrentBuildOperationPreservingRunnable.run(CurrentBuildOperationPreservingRunnable.java:42)
	at org.gradle.internal.concurrent.ExecutorPolicy$CatchAndRecordFailures.onExecute(ExecutorPolicy.java:64)
	at org.gradle.internal.concurrent.ManagedExecutorImpl$1.run(ManagedExecutorImpl.java:48)
	at java.util.concurrent.ThreadPoolExecutor.runWorker(ThreadPoolExecutor.java:1149)
	at java.util.concurrent.ThreadPoolExecutor$Worker.run(ThreadPoolExecutor.java:624)
	at java.lang.Thread.run(Thread.java:750)
Caused by: java.io.IOException: No space left on device
	at java.io.FileOutputStream.writeBytes(Native Method)
	at java.io.FileOutputStream.write(FileOutputStream.java:326)
	at com.esotericsoftware.kryo.io.Output.flush(Output.java:163)
	... 54 more

> Task :runners:google-cloud-dataflow-java:validatesCrossLanguageRunnerJavaUsingPython FAILED
> Task :runners:google-cloud-dataflow-java:cleanupXVR UP-TO-DATE

> Task :runners:google-cloud-dataflow-java:cleanUpDockerPythonImages
WARNING: Successfully resolved tag to sha256, but it is recommended to use sha256 directly.
Tag: [us.gcr.io/apache-beam-testing/java-postcommit-it/python:20221205150945]
- referencing digest: [us.gcr.io/apache-beam-testing/java-postcommit-it/python@sha256:889a3e7eefa2ced5a840dd274f285b270ae6e8f66764ae6fab141eb11de1728d]

Deleted [[us.gcr.io/apache-beam-testing/java-postcommit-it/python:20221205150945] (referencing [us.gcr.io/apache-beam-testing/java-postcommit-it/python@sha256:889a3e7eefa2ced5a840dd274f285b270ae6e8f66764ae6fab141eb11de1728d])].
Digests:
- us.gcr.io/apache-beam-testing/java-postcommit-it/python@sha256:889a3e7eefa2ced5a840dd274f285b270ae6e8f66764ae6fab141eb11de1728d
Deleted [us.gcr.io/apache-beam-testing/java-postcommit-it/python@sha256:889a3e7eefa2ced5a840dd274f285b270ae6e8f66764ae6fab141eb11de1728d].

> Task :runners:google-cloud-dataflow-java:cleanUpDockerJavaImages
WARNING: Successfully resolved tag to sha256, but it is recommended to use sha256 directly.
Tag: [us.gcr.io/apache-beam-testing/java-postcommit-it/java:20221205150945]
- referencing digest: [us.gcr.io/apache-beam-testing/java-postcommit-it/java@sha256:3f3288ec8bcc2ed434ee42402a6b4bd09c3be1cfac10954df42f538b40557bb3]

Deleted [[us.gcr.io/apache-beam-testing/java-postcommit-it/java:20221205150945] (referencing [us.gcr.io/apache-beam-testing/java-postcommit-it/java@sha256:3f3288ec8bcc2ed434ee42402a6b4bd09c3be1cfac10954df42f538b40557bb3])].
Digests:
- us.gcr.io/apache-beam-testing/java-postcommit-it/java@sha256:3f3288ec8bcc2ed434ee42402a6b4bd09c3be1cfac10954df42f538b40557bb3
Deleted [us.gcr.io/apache-beam-testing/java-postcommit-it/java@sha256:3f3288ec8bcc2ed434ee42402a6b4bd09c3be1cfac10954df42f538b40557bb3].

> Task :runners:google-cloud-dataflow-java:validatesCrossLanguageRunnerCleanup

FAILURE: Build failed with an exception.

* What went wrong:
Execution failed for task ':runners:google-cloud-dataflow-java:validatesCrossLanguageRunnerJavaUsingPython'.
> java.io.IOException: No space left on device

* Try:
> Run with --stacktrace option to get the stack trace.
> Run with --info or --debug option to get more log output.

* Get more help at https://help.gradle.org

Deprecated Gradle features were used in this build, making it incompatible with Gradle 8.0.

You can use '--warning-mode all' to show the individual deprecation warnings and determine if they come from your own scripts or plugins.

See https://docs.gradle.org/7.5.1/userguide/command_line_interface.html#sec:command_line_warnings

Execution optimizations have been disabled for 1 invalid unit(s) of work during this build to ensure correctness.
Please consult deprecation warnings for more details.

BUILD FAILED in 44m 58s
184 actionable tasks: 121 executed, 57 from cache, 6 up-to-date

Publishing build scan...
https://gradle.com/s/gbcjoa5si6ccc

Build step 'Invoke Gradle script' changed build result to FAILURE
Build step 'Invoke Gradle script' marked build as failure

---------------------------------------------------------------------
To unsubscribe, e-mail: builds-unsubscribe@beam.apache.org
For additional commands, e-mail: builds-help@beam.apache.org