You are viewing a plain text version of this content. The canonical link for it is here.
Posted to notifications@jclouds.apache.org by BuildHive <bu...@cloudbees.com> on 2014/04/24 14:36:39 UTC

Build failed in Jenkins: jclouds » jclouds-karaf #919

See <https://buildhive.cloudbees.com/job/jclouds/job/jclouds-karaf/919/>

------------------------------------------
[...truncated 368 lines...]
[INFO] ------------------------------------------------------------------------
[INFO] 
[INFO] --- maven-clean-plugin:2.5:clean (default-clean) @ cache ---
[INFO] 
[INFO] --- maven-remote-resources-plugin:1.4:process (default) @ cache ---
[INFO] Using 'UTF-8' encoding to copy filtered resources.
[INFO] skip non existing resourceDirectory <https://buildhive.cloudbees.com/job/jclouds/job/jclouds-karaf/ws/cache/src/main/resources>
[INFO] Copying 3 resources
[INFO] 
[INFO] --- maven-resources-plugin:2.6:resources (default-resources) @ cache ---
[INFO] 
[INFO] --- maven-compiler-plugin:2.0.2:compile (default-compile) @ cache ---
[INFO] Compiling 7 source files to <https://buildhive.cloudbees.com/job/jclouds/job/jclouds-karaf/ws/cache/target/classes>
[INFO] 
[INFO] --- maven-bundle-plugin:2.1.0:manifest (bundle-manifest) @ cache ---
[INFO] 
[INFO] --- maven-resources-plugin:2.6:testResources (default-testResources) @ cache ---
[INFO] Using 'UTF-8' encoding to copy filtered resources.
[INFO] skip non existing resourceDirectory <https://buildhive.cloudbees.com/job/jclouds/job/jclouds-karaf/ws/cache/src/test/resources>
[INFO] Copying 3 resources
[INFO] 
[INFO] --- maven-compiler-plugin:2.0.2:testCompile (default-testCompile) @ cache ---
[INFO] No sources to compile
[INFO] 
[INFO] --- maven-surefire-plugin:2.12.4:test (default-test) @ cache ---
[JENKINS] Recording test results
[INFO] 
[INFO] --- maven-bundle-plugin:2.1.0:bundle (default-bundle) @ cache ---
[INFO] Expanding: <https://buildhive.cloudbees.com/job/jclouds/job/jclouds-karaf/ws/cache/target/cache-1.8.0-SNAPSHOT.jar> into <https://buildhive.cloudbees.com/job/jclouds/job/jclouds-karaf/ws/cache/target/classes>
[INFO] 
[INFO] --- maven-site-plugin:3.2:attach-descriptor (attach-descriptor) @ cache ---
[INFO] 
[INFO] --- apache-rat-plugin:0.10:check (default) @ cache ---
[INFO] 51 implicit excludes (use -debug for more details).
[INFO] Exclude: **/LICENSE.txt
[INFO] Exclude: **/header.txt
[INFO] Exclude: **/NOTICE.txt
[INFO] Exclude: **/DISCLAIMER
[INFO] Exclude: **/BUILD.txt
[INFO] Exclude: **/CHANGES.txt
[INFO] Exclude: **/README.md
[INFO] Exclude: **/README.txt
[INFO] Exclude: **/DEPENDENCIES
[INFO] Exclude: .git/**
[INFO] Exclude: **/.gitignore
[INFO] Exclude: **/*.json
[INFO] Exclude: **/*.log*
[INFO] Exclude: **/TODO
[INFO] Exclude: .mailmap
[INFO] Exclude: .idea/**
[INFO] Exclude: **/*.iml
[INFO] Exclude: **/.project
[INFO] Exclude: **/.classpath
[INFO] Exclude: **/.settings/**
[INFO] Exclude: **/.checkstyle
[INFO] Exclude: **/target/**
[INFO] Exclude: .repository/**
[INFO] Exclude: **/src/main/resources/**/*.txt
[INFO] 8 resources included (use -debug for more details)
Warning:  org.apache.xerces.jaxp.SAXParserImpl$JAXPSAXParser: Property 'http://www.oracle.com/xml/jaxp/properties/entityExpansionLimit' is not recognized.
Compiler warnings:
  WARNING:  'org.apache.xerces.jaxp.SAXParserImpl: Property 'http://javax.xml.XMLConstants/property/accessExternalDTD' is not recognized.'
Warning:  org.apache.xerces.parsers.SAXParser: Feature 'http://javax.xml.XMLConstants/feature/secure-processing' is not recognized.
Warning:  org.apache.xerces.parsers.SAXParser: Property 'http://javax.xml.XMLConstants/property/accessExternalDTD' is not recognized.
Warning:  org.apache.xerces.parsers.SAXParser: Property 'http://www.oracle.com/xml/jaxp/properties/entityExpansionLimit' is not recognized.
[INFO] Rat check: Summary of files. Unapproved: 0 unknown: 0 generated: 0 approved: 8 licence.
[INFO] [INFO] Installing <https://buildhive.cloudbees.com/job/jclouds/job/jclouds-karaf/ws/cache/target/cache-1.8.0-SNAPSHOT.jar> to /home/jenkins/.m2/repository/org/apache/jclouds/karaf/cache/1.8.0-SNAPSHOT/cache-1.8.0-SNAPSHOT.jar

[INFO] --- maven-install-plugin:2.3.1:install (default-install) @ cache ---
[INFO] Installing <https://buildhive.cloudbees.com/job/jclouds/job/jclouds-karaf/ws/cache/pom.xml> to /home/jenkins/.m2/repository/org/apache/jclouds/karaf/cache/1.8.0-SNAPSHOT/cache-1.8.0-SNAPSHOT.pom
[INFO] 
[INFO] --- maven-bundle-plugin:2.1.0:install (default-install) @ cache ---
[INFO] Installing org/apache/jclouds/karaf/cache/1.8.0-SNAPSHOT/cache-1.8.0-SNAPSHOT.jar
[INFO] Writing OBR metadata
[JENKINS] Archiving <https://buildhive.cloudbees.com/job/jclouds/job/jclouds-karaf/ws/cache/pom.xml> to /home/jenkins/jenkins_home/jobs/jclouds/jobs/jclouds-karaf/modules/org.apache.jclouds.karaf$cache/builds/2014-04-24_12-34-49/archive/org.apache.jclouds.karaf/cache/1.8.0-SNAPSHOT/cache-1.8.0-SNAPSHOT.pom
[JENKINS] Archiving <https://buildhive.cloudbees.com/job/jclouds/job/jclouds-karaf/ws/cache/target/cache-1.8.0-SNAPSHOT.jar> to /home/jenkins/jenkins_home/jobs/jclouds/jobs/jclouds-karaf/modules/org.apache.jclouds.karaf$cache/builds/2014-04-24_12-34-49/archive/org.apache.jclouds.karaf/cache/1.8.0-SNAPSHOT/cache-1.8.0-SNAPSHOT.jar
[INFO]                                                                         
[INFO] ------------------------------------------------------------------------
[INFO] Building jclouds :: Karaf :: Services 1.8.0-SNAPSHOT
[INFO] ------------------------------------------------------------------------
Downloading: https://repository.apache.org/content/repositories/snapshots/org/apache/jclouds/labs/management/management-core/1.8.0-SNAPSHOT/maven-metadata.xml
Downloading: http://download.java.net/maven/2/org/apache/jclouds/labs/management/management-core/1.8.0-SNAPSHOT/maven-metadata.xml
Downloading: https://oss.sonatype.org/content/repositories/releases/org/apache/jclouds/labs/management/management-core/1.8.0-SNAPSHOT/maven-metadata.xml
Downloading: http://repository.apache.org/snapshots/org/apache/jclouds/labs/management/management-core/1.8.0-SNAPSHOT/maven-metadata.xml
Downloaded: https://repository.apache.org/content/repositories/snapshots/org/apache/jclouds/labs/management/management-core/1.8.0-SNAPSHOT/maven-metadata.xml (2 KB at 0.1 KB/sec)
Downloaded: http://repository.apache.org/snapshots/org/apache/jclouds/labs/management/management-core/1.8.0-SNAPSHOT/maven-metadata.xml (2 KB at 0.1 KB/sec)
Downloading: https://repository.apache.org/content/repositories/snapshots/org/apache/jclouds/labs/management/management-core/1.8.0-SNAPSHOT/management-core-1.8.0-20140422.111958-110.pom
Downloaded: https://repository.apache.org/content/repositories/snapshots/org/apache/jclouds/labs/management/management-core/1.8.0-SNAPSHOT/management-core-1.8.0-20140422.111958-110.pom (3 KB at 8.6 KB/sec)
Downloading: https://repository.apache.org/content/repositories/snapshots/org/apache/jclouds/labs/jclouds-management/1.8.0-SNAPSHOT/maven-metadata.xml
Downloading: http://download.java.net/maven/2/org/apache/jclouds/labs/jclouds-management/1.8.0-SNAPSHOT/maven-metadata.xml
Downloading: https://oss.sonatype.org/content/repositories/releases/org/apache/jclouds/labs/jclouds-management/1.8.0-SNAPSHOT/maven-metadata.xml
Downloading: http://repository.apache.org/snapshots/org/apache/jclouds/labs/jclouds-management/1.8.0-SNAPSHOT/maven-metadata.xml
Downloaded: https://repository.apache.org/content/repositories/snapshots/org/apache/jclouds/labs/jclouds-management/1.8.0-SNAPSHOT/maven-metadata.xml (836 B at 1.4 KB/sec)
Downloaded: http://repository.apache.org/snapshots/org/apache/jclouds/labs/jclouds-management/1.8.0-SNAPSHOT/maven-metadata.xml (836 B at 1.1 KB/sec)
Downloading: https://repository.apache.org/content/repositories/snapshots/org/apache/jclouds/labs/jclouds-management/1.8.0-SNAPSHOT/jclouds-management-1.8.0-20140422.111935-110.pom
Downloaded: https://repository.apache.org/content/repositories/snapshots/org/apache/jclouds/labs/jclouds-management/1.8.0-SNAPSHOT/jclouds-management-1.8.0-20140422.111935-110.pom (2 KB at 5.7 KB/sec)
Downloading: https://repository.apache.org/content/repositories/snapshots/org/apache/jclouds/labs/jclouds-labs/1.8.0-SNAPSHOT/maven-metadata.xml
Downloading: http://download.java.net/maven/2/org/apache/jclouds/labs/jclouds-labs/1.8.0-SNAPSHOT/maven-metadata.xml
Downloading: https://oss.sonatype.org/content/repositories/releases/org/apache/jclouds/labs/jclouds-labs/1.8.0-SNAPSHOT/maven-metadata.xml
Downloading: http://repository.apache.org/snapshots/org/apache/jclouds/labs/jclouds-labs/1.8.0-SNAPSHOT/maven-metadata.xml
Downloaded: https://repository.apache.org/content/repositories/snapshots/org/apache/jclouds/labs/jclouds-labs/1.8.0-SNAPSHOT/maven-metadata.xml (2 KB at 1.9 KB/sec)
Downloaded: http://repository.apache.org/snapshots/org/apache/jclouds/labs/jclouds-labs/1.8.0-SNAPSHOT/maven-metadata.xml (2 KB at 1.7 KB/sec)
Downloading: https://repository.apache.org/content/repositories/snapshots/org/apache/jclouds/labs/jclouds-labs/1.8.0-SNAPSHOT/jclouds-labs-1.8.0-20140422.105912-123.pom
Downloaded: https://repository.apache.org/content/repositories/snapshots/org/apache/jclouds/labs/jclouds-labs/1.8.0-SNAPSHOT/jclouds-labs-1.8.0-20140422.105912-123.pom (10 KB at 38.6 KB/sec)
Downloading: https://repository.apache.org/content/repositories/snapshots/org/apache/jclouds/labs/representations/representations-codec/1.8.0-SNAPSHOT/maven-metadata.xml
Downloading: http://download.java.net/maven/2/org/apache/jclouds/labs/representations/representations-codec/1.8.0-SNAPSHOT/maven-metadata.xml
Downloading: https://oss.sonatype.org/content/repositories/releases/org/apache/jclouds/labs/representations/representations-codec/1.8.0-SNAPSHOT/maven-metadata.xml
Downloading: http://repository.apache.org/snapshots/org/apache/jclouds/labs/representations/representations-codec/1.8.0-SNAPSHOT/maven-metadata.xml
Downloading: https://oss.sonatype.org/content/repositories/snapshots/org/apache/jclouds/labs/representations/representations-codec/1.8.0-SNAPSHOT/maven-metadata.xml
Downloaded: https://repository.apache.org/content/repositories/snapshots/org/apache/jclouds/labs/representations/representations-codec/1.8.0-SNAPSHOT/maven-metadata.xml (2 KB at 2.2 KB/sec)
Downloaded: http://repository.apache.org/snapshots/org/apache/jclouds/labs/representations/representations-codec/1.8.0-SNAPSHOT/maven-metadata.xml (2 KB at 2.0 KB/sec)
Downloading: https://repository.apache.org/content/repositories/snapshots/org/apache/jclouds/labs/representations/representations-codec/1.8.0-SNAPSHOT/representations-codec-1.8.0-20140422.111922-110.pom
Downloaded: https://repository.apache.org/content/repositories/snapshots/org/apache/jclouds/labs/representations/representations-codec/1.8.0-SNAPSHOT/representations-codec-1.8.0-20140422.111922-110.pom (4 KB at 11.1 KB/sec)
Downloading: https://repository.apache.org/content/repositories/snapshots/org/apache/jclouds/labs/jclouds-represetations/1.8.0-SNAPSHOT/maven-metadata.xml
Downloading: http://download.java.net/maven/2/org/apache/jclouds/labs/jclouds-represetations/1.8.0-SNAPSHOT/maven-metadata.xml
Downloading: https://oss.sonatype.org/content/repositories/releases/org/apache/jclouds/labs/jclouds-represetations/1.8.0-SNAPSHOT/maven-metadata.xml
Downloading: http://repository.apache.org/snapshots/org/apache/jclouds/labs/jclouds-represetations/1.8.0-SNAPSHOT/maven-metadata.xml
Downloading: https://oss.sonatype.org/content/repositories/snapshots/org/apache/jclouds/labs/jclouds-represetations/1.8.0-SNAPSHOT/maven-metadata.xml
Downloaded: http://repository.apache.org/snapshots/org/apache/jclouds/labs/jclouds-represetations/1.8.0-SNAPSHOT/maven-metadata.xml (840 B at 1.5 KB/sec)
Downloaded: https://repository.apache.org/content/repositories/snapshots/org/apache/jclouds/labs/jclouds-represetations/1.8.0-SNAPSHOT/maven-metadata.xml (840 B at 1.5 KB/sec)
Downloading: https://repository.apache.org/content/repositories/snapshots/org/apache/jclouds/labs/jclouds-represetations/1.8.0-SNAPSHOT/jclouds-represetations-1.8.0-20140422.111826-110.pom
Downloaded: https://repository.apache.org/content/repositories/snapshots/org/apache/jclouds/labs/jclouds-represetations/1.8.0-SNAPSHOT/jclouds-represetations-1.8.0-20140422.111826-110.pom (2 KB at 5.0 KB/sec)
Downloading: https://repository.apache.org/content/repositories/snapshots/org/apache/jclouds/labs/representations/representations-core/1.8.0-SNAPSHOT/maven-metadata.xml
Downloading: http://download.java.net/maven/2/org/apache/jclouds/labs/representations/representations-core/1.8.0-SNAPSHOT/maven-metadata.xml
Downloading: https://oss.sonatype.org/content/repositories/releases/org/apache/jclouds/labs/representations/representations-core/1.8.0-SNAPSHOT/maven-metadata.xml
Downloading: http://repository.apache.org/snapshots/org/apache/jclouds/labs/representations/representations-core/1.8.0-SNAPSHOT/maven-metadata.xml
Downloading: https://oss.sonatype.org/content/repositories/snapshots/org/apache/jclouds/labs/representations/representations-core/1.8.0-SNAPSHOT/maven-metadata.xml
Downloaded: https://repository.apache.org/content/repositories/snapshots/org/apache/jclouds/labs/representations/representations-core/1.8.0-SNAPSHOT/maven-metadata.xml (2 KB at 3.2 KB/sec)
Downloaded: http://repository.apache.org/snapshots/org/apache/jclouds/labs/representations/representations-core/1.8.0-SNAPSHOT/maven-metadata.xml (2 KB at 2.9 KB/sec)
Downloading: https://repository.apache.org/content/repositories/snapshots/org/apache/jclouds/labs/representations/representations-core/1.8.0-SNAPSHOT/representations-core-1.8.0-20140422.111849-110.pom
Downloaded: https://repository.apache.org/content/repositories/snapshots/org/apache/jclouds/labs/representations/representations-core/1.8.0-SNAPSHOT/representations-core-1.8.0-20140422.111849-110.pom (3 KB at 8.5 KB/sec)
Downloading: https://repository.apache.org/content/repositories/snapshots/org/apache/jclouds/driver/jclouds-log4j/1.8.0-SNAPSHOT/maven-metadata.xml
Downloading: http://download.java.net/maven/2/org/apache/jclouds/driver/jclouds-log4j/1.8.0-SNAPSHOT/maven-metadata.xml
Downloading: https://oss.sonatype.org/content/repositories/releases/org/apache/jclouds/driver/jclouds-log4j/1.8.0-SNAPSHOT/maven-metadata.xml
Downloading: http://repository.apache.org/snapshots/org/apache/jclouds/driver/jclouds-log4j/1.8.0-SNAPSHOT/maven-metadata.xml
Downloaded: https://repository.apache.org/content/repositories/snapshots/org/apache/jclouds/driver/jclouds-log4j/1.8.0-SNAPSHOT/maven-metadata.xml (2 KB at 3.4 KB/sec)
Downloaded: http://repository.apache.org/snapshots/org/apache/jclouds/driver/jclouds-log4j/1.8.0-SNAPSHOT/maven-metadata.xml (2 KB at 3.0 KB/sec)
Downloading: https://repository.apache.org/content/repositories/snapshots/org/apache/jclouds/driver/jclouds-sshj/1.8.0-SNAPSHOT/maven-metadata.xml
Downloading: http://download.java.net/maven/2/org/apache/jclouds/driver/jclouds-sshj/1.8.0-SNAPSHOT/maven-metadata.xml
Downloading: https://oss.sonatype.org/content/repositories/releases/org/apache/jclouds/driver/jclouds-sshj/1.8.0-SNAPSHOT/maven-metadata.xml
Downloading: http://repository.apache.org/snapshots/org/apache/jclouds/driver/jclouds-sshj/1.8.0-SNAPSHOT/maven-metadata.xml
Downloaded: http://repository.apache.org/snapshots/org/apache/jclouds/driver/jclouds-sshj/1.8.0-SNAPSHOT/maven-metadata.xml (2 KB at 2.9 KB/sec)
[WARNING] Could not transfer metadata org.apache.jclouds.driver:jclouds-sshj:1.8.0-SNAPSHOT/maven-metadata.xml from/to apache-snapshots (https://repository.apache.org/content/repositories/snapshots): Failed to transfer file: https://repository.apache.org/content/repositories/snapshots/org/apache/jclouds/driver/jclouds-sshj/1.8.0-SNAPSHOT/maven-metadata.xml. Return code is: 503 , ReasonPhrase:Service Temporarily Unavailable.
Downloading: https://repository.apache.org/content/repositories/snapshots/org/apache/jclouds/driver/jclouds-slf4j/1.8.0-SNAPSHOT/maven-metadata.xml
Downloading: http://download.java.net/maven/2/org/apache/jclouds/driver/jclouds-slf4j/1.8.0-SNAPSHOT/maven-metadata.xml
Downloading: https://oss.sonatype.org/content/repositories/releases/org/apache/jclouds/driver/jclouds-slf4j/1.8.0-SNAPSHOT/maven-metadata.xml
Downloading: http://repository.apache.org/snapshots/org/apache/jclouds/driver/jclouds-slf4j/1.8.0-SNAPSHOT/maven-metadata.xml
Downloading: https://oss.sonatype.org/content/repositories/snapshots/org/apache/jclouds/driver/jclouds-slf4j/1.8.0-SNAPSHOT/maven-metadata.xml
Downloaded: http://repository.apache.org/snapshots/org/apache/jclouds/driver/jclouds-slf4j/1.8.0-SNAPSHOT/maven-metadata.xml (2 KB at 2.0 KB/sec)
[WARNING] Could not transfer metadata org.apache.jclouds.driver:jclouds-slf4j:1.8.0-SNAPSHOT/maven-metadata.xml from/to apache-snapshots (https://repository.apache.org/content/repositories/snapshots): Failed to transfer file: https://repository.apache.org/content/repositories/snapshots/org/apache/jclouds/driver/jclouds-slf4j/1.8.0-SNAPSHOT/maven-metadata.xml. Return code is: 503 , ReasonPhrase:Service Temporarily Unavailable.
Downloading: https://repository.apache.org/content/repositories/snapshots/org/apache/jclouds/driver/jclouds-bouncycastle/1.8.0-SNAPSHOT/maven-metadata.xml
Downloading: http://download.java.net/maven/2/org/apache/jclouds/driver/jclouds-bouncycastle/1.8.0-SNAPSHOT/maven-metadata.xml
Downloading: https://oss.sonatype.org/content/repositories/releases/org/apache/jclouds/driver/jclouds-bouncycastle/1.8.0-SNAPSHOT/maven-metadata.xml
Downloading: http://repository.apache.org/snapshots/org/apache/jclouds/driver/jclouds-bouncycastle/1.8.0-SNAPSHOT/maven-metadata.xml
Downloading: https://oss.sonatype.org/content/repositories/snapshots/org/apache/jclouds/driver/jclouds-bouncycastle/1.8.0-SNAPSHOT/maven-metadata.xml
[WARNING] Checksum validation failed, could not read expected checksum: Failed to transfer file: https://repository.apache.org/content/repositories/snapshots/org/apache/jclouds/driver/jclouds-bouncycastle/1.8.0-SNAPSHOT/maven-metadata.xml.sha1. Return code is: 503 , ReasonPhrase:Service Temporarily Unavailable. for https://repository.apache.org/content/repositories/snapshots/org/apache/jclouds/driver/jclouds-bouncycastle/1.8.0-SNAPSHOT/maven-metadata.xml
Downloaded: http://repository.apache.org/snapshots/org/apache/jclouds/driver/jclouds-bouncycastle/1.8.0-SNAPSHOT/maven-metadata.xml (2 KB at 2.8 KB/sec)
Downloaded: https://repository.apache.org/content/repositories/snapshots/org/apache/jclouds/driver/jclouds-bouncycastle/1.8.0-SNAPSHOT/maven-metadata.xml (2 KB at 1.8 KB/sec)
Downloading: https://repository.apache.org/content/repositories/snapshots/org/apache/jclouds/labs/management/management-core/1.8.0-SNAPSHOT/management-core-1.8.0-20140422.111958-110.jar
Downloading: https://repository.apache.org/content/repositories/snapshots/org/apache/jclouds/labs/representations/representations-codec/1.8.0-SNAPSHOT/representations-codec-1.8.0-20140422.111922-110.jar
Downloading: https://repository.apache.org/content/repositories/snapshots/org/apache/jclouds/labs/representations/representations-core/1.8.0-SNAPSHOT/representations-core-1.8.0-20140422.111849-110.jar
[JENKINS] Archiving <https://buildhive.cloudbees.com/job/jclouds/job/jclouds-karaf/ws/services/pom.xml> to /home/jenkins/jenkins_home/jobs/jclouds/jobs/jclouds-karaf/modules/org.apache.jclouds.karaf$services/builds/2014-04-24_12-34-49/archive/org.apache.jclouds.karaf/services/1.8.0-SNAPSHOT/services-1.8.0-SNAPSHOT.pom
[INFO] ------------------------------------------------------------------------
[INFO] Reactor Summary:
[INFO] 
[INFO] Apache jclouds :: Karaf ........................... SUCCESS [20.712s]
[INFO] jclouds :: Karaf :: Core .......................... SUCCESS [20.727s]
[INFO] jclouds :: Karaf :: Utils ......................... SUCCESS [8.437s]
[INFO] jclouds :: Karaf :: Recipe ........................ SUCCESS [7.401s]
[INFO] jclouds :: Karaf :: Cache ......................... SUCCESS [6.121s]
[INFO] jclouds :: Karaf :: Services ...................... FAILURE [24.231s]
[INFO] jclouds :: Karaf :: Commands ...................... SKIPPED
[INFO] jclouds :: Karaf :: URL Handler ................... SKIPPED
[INFO] jclouds :: Karaf :: Chef .......................... SKIPPED
[INFO] jclouds :: Karaf :: Chef :: Core .................. SKIPPED
[INFO] jclouds :: Karaf :: Chef :: Services .............. SKIPPED
[INFO] jclouds :: Karaf :: Chef :: Commands .............. SKIPPED
[INFO] jclouds :: Karaf :: Chef :: Cache ................. SKIPPED
[INFO] jclouds :: Karaf :: Feature ....................... SKIPPED
[INFO] jclouds :: Karaf :: Integration Tests ............. SKIPPED
[INFO] ------------------------------------------------------------------------
[INFO] BUILD FAILURE
[INFO] ------------------------------------------------------------------------
[INFO] Total time: 1:36.810s
[INFO] Finished at: Thu Apr 24 12:36:38 UTC 2014
[INFO] Final Memory: 43M/103M
[INFO] ------------------------------------------------------------------------
mavenExecutionResult exceptions not empty
message : Failed to execute goal on project services: Could not resolve dependencies for project org.apache.jclouds.karaf:services:bundle:1.8.0-SNAPSHOT: The following artifacts could not be resolved: org.apache.jclouds.labs.management:management-core:jar:1.8.0-SNAPSHOT, org.apache.jclouds.labs.representations:representations-codec:jar:1.8.0-SNAPSHOT, org.apache.jclouds.labs.representations:representations-core:jar:1.8.0-SNAPSHOT: Could not transfer artifact org.apache.jclouds.labs.management:management-core:jar:1.8.0-20140422.111958-110 from/to apache-snapshots (https://repository.apache.org/content/repositories/snapshots): Failed to transfer file: https://repository.apache.org/content/repositories/snapshots/org/apache/jclouds/labs/management/management-core/1.8.0-SNAPSHOT/management-core-1.8.0-20140422.111958-110.jar. Return code is: 503 , ReasonPhrase:Service Temporarily Unavailable.
cause : Could not resolve dependencies for project org.apache.jclouds.karaf:services:bundle:1.8.0-SNAPSHOT: The following artifacts could not be resolved: org.apache.jclouds.labs.management:management-core:jar:1.8.0-SNAPSHOT, org.apache.jclouds.labs.representations:representations-codec:jar:1.8.0-SNAPSHOT, org.apache.jclouds.labs.representations:representations-core:jar:1.8.0-SNAPSHOT: Could not transfer artifact org.apache.jclouds.labs.management:management-core:jar:1.8.0-20140422.111958-110 from/to apache-snapshots (https://repository.apache.org/content/repositories/snapshots): Failed to transfer file: https://repository.apache.org/content/repositories/snapshots/org/apache/jclouds/labs/management/management-core/1.8.0-SNAPSHOT/management-core-1.8.0-20140422.111958-110.jar. Return code is: 503 , ReasonPhrase:Service Temporarily Unavailable.
Stack trace : 
org.apache.maven.lifecycle.LifecycleExecutionException: Failed to execute goal on project services: Could not resolve dependencies for project org.apache.jclouds.karaf:services:bundle:1.8.0-SNAPSHOT: The following artifacts could not be resolved: org.apache.jclouds.labs.management:management-core:jar:1.8.0-SNAPSHOT, org.apache.jclouds.labs.representations:representations-codec:jar:1.8.0-SNAPSHOT, org.apache.jclouds.labs.representations:representations-core:jar:1.8.0-SNAPSHOT: Could not transfer artifact org.apache.jclouds.labs.management:management-core:jar:1.8.0-20140422.111958-110 from/to apache-snapshots (https://repository.apache.org/content/repositories/snapshots): Failed to transfer file: https://repository.apache.org/content/repositories/snapshots/org/apache/jclouds/labs/management/management-core/1.8.0-SNAPSHOT/management-core-1.8.0-20140422.111958-110.jar. Return code is: 503 , ReasonPhrase:Service Temporarily Unavailable.
	at org.apache.maven.lifecycle.internal.LifecycleDependencyResolver.getDependencies(LifecycleDependencyResolver.java:210)
	at org.apache.maven.lifecycle.internal.LifecycleDependencyResolver.resolveProjectDependencies(LifecycleDependencyResolver.java:117)
	at org.apache.maven.lifecycle.internal.MojoExecutor.ensureDependenciesAreResolved(MojoExecutor.java:258)
	at org.apache.maven.lifecycle.internal.MojoExecutor.execute(MojoExecutor.java:201)
	at org.apache.maven.lifecycle.internal.MojoExecutor.execute(MojoExecutor.java:153)
	at org.apache.maven.lifecycle.internal.MojoExecutor.execute(MojoExecutor.java:145)
	at org.apache.maven.lifecycle.internal.LifecycleModuleBuilder.buildProject(LifecycleModuleBuilder.java:84)
	at org.apache.maven.lifecycle.internal.LifecycleModuleBuilder.buildProject(LifecycleModuleBuilder.java:59)
	at org.apache.maven.lifecycle.internal.LifecycleStarter.singleThreadedBuild(LifecycleStarter.java:183)
	at org.apache.maven.lifecycle.internal.LifecycleStarter.execute(LifecycleStarter.java:161)
	at org.apache.maven.DefaultMaven.doExecute(DefaultMaven.java:320)
	at org.apache.maven.DefaultMaven.execute(DefaultMaven.java:156)
	at org.jvnet.hudson.maven3.launcher.Maven3Launcher.main(Maven3Launcher.java:79)
	at sun.reflect.NativeMethodAccessorImpl.invoke0(Native Method)
	at sun.reflect.NativeMethodAccessorImpl.invoke(NativeMethodAccessorImpl.java:57)
	at sun.reflect.DelegatingMethodAccessorImpl.invoke(DelegatingMethodAccessorImpl.java:43)
	at java.lang.reflect.Method.invoke(Method.java:606)
	at org.codehaus.plexus.classworlds.launcher.Launcher.launchStandard(Launcher.java:329)
	at org.codehaus.plexus.classworlds.launcher.Launcher.launch(Launcher.java:239)
	at org.jvnet.hudson.maven3.agent.Maven3Main.launch(Maven3Main.java:158)
	at hudson.maven.Maven3Builder.call(Maven3Builder.java:104)
	at hudson.maven.Maven3Builder.call(Maven3Builder.java:70)
	at hudson.remoting.UserRequest.perform(UserRequest.java:118)
	at hudson.remoting.UserRequest.perform(UserRequest.java:48)
	at hudson.remoting.Request$2.run(Request.java:328)
	at hudson.remoting.InterceptingExecutorService$1.call(InterceptingExecutorService.java:72)
	at java.util.concurrent.FutureTask.run(FutureTask.java:262)
	at java.util.concurrent.ThreadPoolExecutor.runWorker(ThreadPoolExecutor.java:1145)
	at java.util.concurrent.ThreadPoolExecutor$Worker.run(ThreadPoolExecutor.java:615)
	at java.lang.Thread.run(Thread.java:744)
Caused by: org.apache.maven.project.DependencyResolutionException: Could not resolve dependencies for project org.apache.jclouds.karaf:services:bundle:1.8.0-SNAPSHOT: The following artifacts could not be resolved: org.apache.jclouds.labs.management:management-core:jar:1.8.0-SNAPSHOT, org.apache.jclouds.labs.representations:representations-codec:jar:1.8.0-SNAPSHOT, org.apache.jclouds.labs.representations:representations-core:jar:1.8.0-SNAPSHOT: Could not transfer artifact org.apache.jclouds.labs.management:management-core:jar:1.8.0-20140422.111958-110 from/to apache-snapshots (https://repository.apache.org/content/repositories/snapshots): Failed to transfer file: https://repository.apache.org/content/repositories/snapshots/org/apache/jclouds/labs/management/management-core/1.8.0-SNAPSHOT/management-core-1.8.0-20140422.111958-110.jar. Return code is: 503 , ReasonPhrase:Service Temporarily Unavailable.
	at org.apache.maven.project.DefaultProjectDependenciesResolver.resolve(DefaultProjectDependenciesResolver.java:189)
	at org.apache.maven.lifecycle.internal.LifecycleDependencyResolver.getDependencies(LifecycleDependencyResolver.java:185)
	... 29 more
Caused by: org.sonatype.aether.resolution.DependencyResolutionException: The following artifacts could not be resolved: org.apache.jclouds.labs.management:management-core:jar:1.8.0-SNAPSHOT, org.apache.jclouds.labs.representations:representations-codec:jar:1.8.0-SNAPSHOT, org.apache.jclouds.labs.representations:representations-core:jar:1.8.0-SNAPSHOT: Could not transfer artifact org.apache.jclouds.labs.management:management-core:jar:1.8.0-20140422.111958-110 from/to apache-snapshots (https://repository.apache.org/content/repositories/snapshots): Failed to transfer file: https://repository.apache.org/content/repositories/snapshots/org/apache/jclouds/labs/management/management-core/1.8.0-SNAPSHOT/management-core-1.8.0-20140422.111958-110.jar. Return code is: 503 , ReasonPhrase:Service Temporarily Unavailable.
	at org.sonatype.aether.impl.internal.DefaultRepositorySystem.resolveDependencies(DefaultRepositorySystem.java:375)
	at org.apache.maven.project.DefaultProjectDependenciesResolver.resolve(DefaultProjectDependenciesResolver.java:183)
	... 30 more
Caused by: org.sonatype.aether.resolution.ArtifactResolutionException: The following artifacts could not be resolved: org.apache.jclouds.labs.management:management-core:jar:1.8.0-SNAPSHOT, org.apache.jclouds.labs.representations:representations-codec:jar:1.8.0-SNAPSHOT, org.apache.jclouds.labs.representations:representations-core:jar:1.8.0-SNAPSHOT: Could not transfer artifact org.apache.jclouds.labs.management:management-core:jar:1.8.0-20140422.111958-110 from/to apache-snapshots (https://repository.apache.org/content/repositories/snapshots): Failed to transfer file: https://repository.apache.org/content/repositories/snapshots/org/apache/jclouds/labs/management/management-core/1.8.0-SNAPSHOT/management-core-1.8.0-20140422.111958-110.jar. Return code is: 503 , ReasonPhrase:Service Temporarily Unavailable.
	at org.sonatype.aether.impl.internal.DefaultArtifactResolver.resolve(DefaultArtifactResolver.java:538)
	at org.sonatype.aether.impl.internal.DefaultArtifactResolver.resolveArtifacts(DefaultArtifactResolver.java:216)
	at org.sonatype.aether.impl.internal.DefaultRepositorySystem.resolveDependencies(DefaultRepositorySystem.java:358)
	... 31 more
Caused by: org.sonatype.aether.transfer.ArtifactTransferException: Could not transfer artifact org.apache.jclouds.labs.management:management-core:jar:1.8.0-20140422.111958-110 from/to apache-snapshots (https://repository.apache.org/content/repositories/snapshots): Failed to transfer file: https://repository.apache.org/content/repositories/snapshots/org/apache/jclouds/labs/management/management-core/1.8.0-SNAPSHOT/management-core-1.8.0-20140422.111958-110.jar. Return code is: 503 , ReasonPhrase:Service Temporarily Unavailable.
	at org.sonatype.aether.connector.wagon.WagonRepositoryConnector$4.wrap(WagonRepositoryConnector.java:951)
	at org.sonatype.aether.connector.wagon.WagonRepositoryConnector$4.wrap(WagonRepositoryConnector.java:941)
	at org.sonatype.aether.connector.wagon.WagonRepositoryConnector$GetTask.run(WagonRepositoryConnector.java:669)
	at org.sonatype.aether.util.concurrency.RunnableErrorForwarder$1.run(RunnableErrorForwarder.java:60)
	... 3 more
Caused by: org.apache.maven.wagon.TransferFailedException: Failed to transfer file: https://repository.apache.org/content/repositories/snapshots/org/apache/jclouds/labs/management/management-core/1.8.0-SNAPSHOT/management-core-1.8.0-20140422.111958-110.jar. Return code is: 503 , ReasonPhrase:Service Temporarily Unavailable.
	at org.apache.maven.wagon.shared.http4.AbstractHttpClientWagon.fillInputData(AbstractHttpClientWagon.java:945)
	at org.apache.maven.wagon.StreamWagon.getInputStream(StreamWagon.java:116)
	at org.apache.maven.wagon.StreamWagon.getIfNewer(StreamWagon.java:88)
	at org.apache.maven.wagon.StreamWagon.get(StreamWagon.java:61)
	at org.sonatype.aether.connector.wagon.WagonRepositoryConnector$GetTask.run(WagonRepositoryConnector.java:601)
	... 4 more
channel stopped

Jenkins build is back to normal : jclouds » jclouds-karaf #920

Posted by BuildHive <bu...@cloudbees.com>.
See <https://buildhive.cloudbees.com/job/jclouds/job/jclouds-karaf/920/>