You are viewing a plain text version of this content. The canonical link for it is here.
Posted to dev@kafka.apache.org by Apache Jenkins Server <je...@builds.apache.org> on 2022/08/30 12:20:54 UTC
Build failed in Jenkins: Kafka » Kafka Branch Builder » trunk #1187
See <https://ci-builds.apache.org/job/Kafka/job/kafka/job/trunk/1187/display/redirect>
Changes:
------------------------------------------
[...truncated 504490 lines...]
[2022-08-30T12:17:12.862Z] [INFO] --- maven-resources-plugin:2.6:resources (default-resources) @ streams.examples ---
[2022-08-30T12:17:13.795Z] [INFO] Using 'UTF-8' encoding to copy filtered resources.
[2022-08-30T12:17:13.795Z] [INFO] Copying 1 resource
[2022-08-30T12:17:13.795Z] [INFO]
[2022-08-30T12:17:13.795Z] [INFO] --- maven-compiler-plugin:3.1:compile (default-compile) @ streams.examples ---
[2022-08-30T12:17:13.795Z] [INFO] Changes detected - recompiling the module!
[2022-08-30T12:17:13.795Z] [INFO] Compiling 3 source files to /home/jenkins/jenkins-agent/workspace/Kafka_kafka_trunk/streams/quickstart/test-streams-archetype/streams.examples/target/classes
[2022-08-30T12:17:15.542Z] [INFO] ------------------------------------------------------------------------
[2022-08-30T12:17:15.543Z] [INFO] BUILD SUCCESS
[2022-08-30T12:17:15.543Z] [INFO] ------------------------------------------------------------------------
[2022-08-30T12:17:15.543Z] [INFO] Total time: 2.645 s
[2022-08-30T12:17:15.543Z] [INFO] Finished at: 2022-08-30T12:17:15Z
[2022-08-30T12:17:15.543Z] [INFO] ------------------------------------------------------------------------
[Pipeline] }
[Pipeline] // dir
[Pipeline] }
[Pipeline] // dir
[Pipeline] }
[Pipeline] // dir
[Pipeline] }
[Pipeline] // withEnv
[Pipeline] }
[Pipeline] // withEnv
[Pipeline] }
[Pipeline] // withEnv
[Pipeline] }
[Pipeline] // node
[Pipeline] }
[Pipeline] // timestamps
[Pipeline] }
[Pipeline] // timeout
[Pipeline] }
[Pipeline] // stage
[Pipeline] }
[2022-08-30T12:17:17.517Z]
[2022-08-30T12:17:17.517Z] AdjustStreamThreadCountTest > shouldAddAndRemoveThreadsMultipleTimes() PASSED
[2022-08-30T12:17:17.517Z]
[2022-08-30T12:17:17.518Z] AdjustStreamThreadCountTest > shouldnNotRemoveStreamThreadWithinTimeout() STARTED
[2022-08-30T12:17:17.518Z]
[2022-08-30T12:17:17.518Z] AdjustStreamThreadCountTest > shouldnNotRemoveStreamThreadWithinTimeout() PASSED
[2022-08-30T12:17:17.518Z]
[2022-08-30T12:17:17.518Z] AdjustStreamThreadCountTest > shouldAddAndRemoveStreamThreadsWhileKeepingNamesCorrect() STARTED
[2022-08-30T12:17:39.851Z]
[2022-08-30T12:17:39.851Z] AdjustStreamThreadCountTest > shouldAddAndRemoveStreamThreadsWhileKeepingNamesCorrect() PASSED
[2022-08-30T12:17:39.851Z]
[2022-08-30T12:17:39.851Z] AdjustStreamThreadCountTest > shouldAddStreamThread() STARTED
[2022-08-30T12:17:41.604Z]
[2022-08-30T12:17:41.604Z] AdjustStreamThreadCountTest > shouldAddStreamThread() PASSED
[2022-08-30T12:17:41.604Z]
[2022-08-30T12:17:41.604Z] AdjustStreamThreadCountTest > shouldRemoveStreamThreadWithStaticMembership() STARTED
[2022-08-30T12:17:46.343Z]
[2022-08-30T12:17:46.343Z] AdjustStreamThreadCountTest > shouldRemoveStreamThreadWithStaticMembership() PASSED
[2022-08-30T12:17:46.343Z]
[2022-08-30T12:17:46.343Z] AdjustStreamThreadCountTest > shouldRemoveStreamThread() STARTED
[2022-08-30T12:17:50.955Z]
[2022-08-30T12:17:50.955Z] AdjustStreamThreadCountTest > shouldRemoveStreamThread() PASSED
[2022-08-30T12:17:50.955Z]
[2022-08-30T12:17:50.955Z] AdjustStreamThreadCountTest > shouldResizeCacheAfterThreadRemovalTimesOut() STARTED
[2022-08-30T12:17:51.891Z]
[2022-08-30T12:17:51.892Z] AdjustStreamThreadCountTest > shouldResizeCacheAfterThreadRemovalTimesOut() PASSED
[2022-08-30T12:17:55.458Z]
[2022-08-30T12:17:55.458Z] FineGrainedAutoResetIntegrationTest > shouldOnlyReadRecordsWhereEarliestSpecifiedWithNoCommittedOffsetsWithGlobalAutoOffsetResetLatest() STARTED
[2022-08-30T12:17:56.487Z]
[2022-08-30T12:17:56.487Z] FineGrainedAutoResetIntegrationTest > shouldOnlyReadRecordsWhereEarliestSpecifiedWithNoCommittedOffsetsWithGlobalAutoOffsetResetLatest() PASSED
[2022-08-30T12:17:56.487Z]
[2022-08-30T12:17:56.487Z] FineGrainedAutoResetIntegrationTest > shouldThrowExceptionOverlappingPattern() STARTED
[2022-08-30T12:17:56.487Z]
[2022-08-30T12:17:56.487Z] FineGrainedAutoResetIntegrationTest > shouldThrowExceptionOverlappingPattern() PASSED
[2022-08-30T12:17:56.487Z]
[2022-08-30T12:17:56.487Z] FineGrainedAutoResetIntegrationTest > shouldThrowExceptionOverlappingTopic() STARTED
[2022-08-30T12:17:56.487Z]
[2022-08-30T12:17:56.487Z] FineGrainedAutoResetIntegrationTest > shouldThrowExceptionOverlappingTopic() PASSED
[2022-08-30T12:17:56.487Z]
[2022-08-30T12:17:56.487Z] FineGrainedAutoResetIntegrationTest > shouldOnlyReadRecordsWhereEarliestSpecifiedWithInvalidCommittedOffsets() STARTED
[2022-08-30T12:18:42.282Z]
[2022-08-30T12:18:42.282Z] FineGrainedAutoResetIntegrationTest > shouldOnlyReadRecordsWhereEarliestSpecifiedWithInvalidCommittedOffsets() PASSED
[2022-08-30T12:18:42.282Z]
[2022-08-30T12:18:42.282Z] FineGrainedAutoResetIntegrationTest > shouldOnlyReadRecordsWhereEarliestSpecifiedWithNoCommittedOffsetsWithDefaultGlobalAutoOffsetResetEarliest() STARTED
[2022-08-30T12:19:31.103Z]
[2022-08-30T12:19:31.103Z] FineGrainedAutoResetIntegrationTest > shouldOnlyReadRecordsWhereEarliestSpecifiedWithNoCommittedOffsetsWithDefaultGlobalAutoOffsetResetEarliest() PASSED
[2022-08-30T12:19:31.103Z]
[2022-08-30T12:19:31.103Z] FineGrainedAutoResetIntegrationTest > shouldThrowStreamsExceptionNoResetSpecified() STARTED
[2022-08-30T12:19:31.103Z]
[2022-08-30T12:19:31.103Z] FineGrainedAutoResetIntegrationTest > shouldThrowStreamsExceptionNoResetSpecified() PASSED
[2022-08-30T12:19:31.103Z]
[2022-08-30T12:19:31.103Z] GlobalKTableIntegrationTest > shouldGetToRunningWithOnlyGlobalTopology() STARTED
[2022-08-30T12:19:31.103Z]
[2022-08-30T12:19:31.103Z] GlobalKTableIntegrationTest > shouldGetToRunningWithOnlyGlobalTopology() PASSED
[2022-08-30T12:19:31.103Z]
[2022-08-30T12:19:31.103Z] GlobalKTableIntegrationTest > shouldKStreamGlobalKTableLeftJoin() STARTED
[2022-08-30T12:19:32.048Z]
[2022-08-30T12:19:32.048Z] GlobalKTableIntegrationTest > shouldKStreamGlobalKTableLeftJoin() PASSED
[2022-08-30T12:19:32.048Z]
[2022-08-30T12:19:32.048Z] GlobalKTableIntegrationTest > shouldRestoreGlobalInMemoryKTableOnRestart() STARTED
[2022-08-30T12:19:34.110Z]
[2022-08-30T12:19:34.110Z] GlobalKTableIntegrationTest > shouldRestoreGlobalInMemoryKTableOnRestart() PASSED
[2022-08-30T12:19:34.110Z]
[2022-08-30T12:19:34.110Z] GlobalKTableIntegrationTest > shouldKStreamGlobalKTableJoin() STARTED
[2022-08-30T12:19:35.877Z]
[2022-08-30T12:19:35.877Z] GlobalKTableIntegrationTest > shouldKStreamGlobalKTableJoin() PASSED
[2022-08-30T12:19:37.645Z]
[2022-08-30T12:19:37.645Z] GlobalThreadShutDownOrderTest > shouldFinishGlobalStoreOperationOnShutDown() STARTED
[2022-08-30T12:19:43.435Z]
[2022-08-30T12:19:43.435Z] GlobalThreadShutDownOrderTest > shouldFinishGlobalStoreOperationOnShutDown() PASSED
[2022-08-30T12:19:44.401Z]
[2022-08-30T12:19:44.401Z] IQv2IntegrationTest > shouldFailStopped() STARTED
[2022-08-30T12:19:44.401Z]
[2022-08-30T12:19:44.401Z] IQv2IntegrationTest > shouldFailStopped() PASSED
[2022-08-30T12:19:44.401Z]
[2022-08-30T12:19:44.401Z] IQv2IntegrationTest > shouldNotRequireQueryHandler(TestInfo) STARTED
[2022-08-30T12:19:45.348Z]
[2022-08-30T12:19:45.348Z] IQv2IntegrationTest > shouldNotRequireQueryHandler(TestInfo) PASSED
[2022-08-30T12:19:45.348Z]
[2022-08-30T12:19:45.348Z] IQv2IntegrationTest > shouldFailNotStarted() STARTED
[2022-08-30T12:19:45.348Z]
[2022-08-30T12:19:45.348Z] IQv2IntegrationTest > shouldFailNotStarted() PASSED
[2022-08-30T12:19:45.348Z]
[2022-08-30T12:19:45.348Z] IQv2IntegrationTest > shouldFetchFromPartition() STARTED
[2022-08-30T12:19:47.175Z]
[2022-08-30T12:19:47.175Z] IQv2IntegrationTest > shouldFetchFromPartition() PASSED
[2022-08-30T12:19:47.175Z]
[2022-08-30T12:19:47.175Z] IQv2IntegrationTest > shouldFetchExplicitlyFromAllPartitions() STARTED
[2022-08-30T12:19:48.944Z]
[2022-08-30T12:19:48.944Z] IQv2IntegrationTest > shouldFetchExplicitlyFromAllPartitions() PASSED
[2022-08-30T12:19:48.944Z]
[2022-08-30T12:19:48.944Z] IQv2IntegrationTest > shouldFailUnknownStore() STARTED
[2022-08-30T12:19:48.944Z]
[2022-08-30T12:19:48.944Z] IQv2IntegrationTest > shouldFailUnknownStore() PASSED
[2022-08-30T12:19:48.944Z]
[2022-08-30T12:19:48.944Z] IQv2IntegrationTest > shouldRejectNonRunningActive() STARTED
[2022-08-30T12:19:50.714Z]
[2022-08-30T12:19:50.714Z] IQv2IntegrationTest > shouldRejectNonRunningActive() PASSED
[2022-08-30T12:19:52.472Z]
[2022-08-30T12:19:52.472Z] InternalTopicIntegrationTest > shouldCompactTopicsForKeyValueStoreChangelogs() STARTED
[2022-08-30T12:19:54.219Z]
[2022-08-30T12:19:54.219Z] InternalTopicIntegrationTest > shouldCompactTopicsForKeyValueStoreChangelogs() PASSED
[2022-08-30T12:19:54.219Z]
[2022-08-30T12:19:54.219Z] InternalTopicIntegrationTest > shouldGetToRunningWithWindowedTableInFKJ() STARTED
[2022-08-30T12:19:55.978Z]
[2022-08-30T12:19:55.978Z] InternalTopicIntegrationTest > shouldGetToRunningWithWindowedTableInFKJ() PASSED
[2022-08-30T12:19:55.978Z]
[2022-08-30T12:19:55.978Z] InternalTopicIntegrationTest > shouldCompactAndDeleteTopicsForWindowStoreChangelogs() STARTED
[2022-08-30T12:19:56.902Z]
[2022-08-30T12:19:56.902Z] InternalTopicIntegrationTest > shouldCompactAndDeleteTopicsForWindowStoreChangelogs() PASSED
[2022-08-30T12:19:58.636Z]
[2022-08-30T12:19:58.636Z] KStreamAggregationIntegrationTest > shouldAggregateSlidingWindows(TestInfo) STARTED
[2022-08-30T12:20:03.366Z]
[2022-08-30T12:20:03.366Z] KStreamAggregationIntegrationTest > shouldAggregateSlidingWindows(TestInfo) PASSED
[2022-08-30T12:20:03.366Z]
[2022-08-30T12:20:03.366Z] KStreamAggregationIntegrationTest > shouldReduceSessionWindows() STARTED
[2022-08-30T12:20:05.098Z]
[2022-08-30T12:20:05.098Z] KStreamAggregationIntegrationTest > shouldReduceSessionWindows() PASSED
[2022-08-30T12:20:05.098Z]
[2022-08-30T12:20:05.098Z] KStreamAggregationIntegrationTest > shouldReduceSlidingWindows(TestInfo) STARTED
[2022-08-30T12:20:08.636Z]
[2022-08-30T12:20:08.636Z] KStreamAggregationIntegrationTest > shouldReduceSlidingWindows(TestInfo) PASSED
[2022-08-30T12:20:08.636Z]
[2022-08-30T12:20:08.636Z] KStreamAggregationIntegrationTest > shouldReduce(TestInfo) STARTED
[2022-08-30T12:20:12.172Z]
[2022-08-30T12:20:12.172Z] KStreamAggregationIntegrationTest > shouldReduce(TestInfo) PASSED
[2022-08-30T12:20:12.172Z]
[2022-08-30T12:20:12.172Z] KStreamAggregationIntegrationTest > shouldAggregate(TestInfo) STARTED
[2022-08-30T12:20:17.019Z]
[2022-08-30T12:20:17.019Z] KStreamAggregationIntegrationTest > shouldAggregate(TestInfo) PASSED
[2022-08-30T12:20:17.019Z]
[2022-08-30T12:20:17.019Z] KStreamAggregationIntegrationTest > shouldCount(TestInfo) STARTED
[2022-08-30T12:20:20.557Z]
[2022-08-30T12:20:20.557Z] KStreamAggregationIntegrationTest > shouldCount(TestInfo) PASSED
[2022-08-30T12:20:20.557Z]
[2022-08-30T12:20:20.557Z] KStreamAggregationIntegrationTest > shouldGroupByKey(TestInfo) STARTED
[2022-08-30T12:20:25.119Z]
[2022-08-30T12:20:25.119Z] KStreamAggregationIntegrationTest > shouldGroupByKey(TestInfo) PASSED
[2022-08-30T12:20:25.119Z]
[2022-08-30T12:20:25.119Z] KStreamAggregationIntegrationTest > shouldCountWithInternalStore(TestInfo) STARTED
[2022-08-30T12:20:29.681Z]
[2022-08-30T12:20:29.681Z] KStreamAggregationIntegrationTest > shouldCountWithInternalStore(TestInfo) PASSED
[2022-08-30T12:20:29.681Z]
[2022-08-30T12:20:29.681Z] KStreamAggregationIntegrationTest > shouldCountUnlimitedWindows() STARTED
[2022-08-30T12:20:30.856Z]
[2022-08-30T12:20:30.856Z] KStreamAggregationIntegrationTest > shouldCountUnlimitedWindows() PASSED
[2022-08-30T12:20:30.856Z]
[2022-08-30T12:20:30.856Z] KStreamAggregationIntegrationTest > shouldReduceWindowed(TestInfo) STARTED
[2022-08-30T12:20:34.395Z]
[2022-08-30T12:20:34.395Z] KStreamAggregationIntegrationTest > shouldReduceWindowed(TestInfo) PASSED
[2022-08-30T12:20:34.395Z]
[2022-08-30T12:20:34.395Z] KStreamAggregationIntegrationTest > shouldCountSessionWindows() STARTED
[2022-08-30T12:20:36.127Z]
[2022-08-30T12:20:36.127Z] KStreamAggregationIntegrationTest > shouldCountSessionWindows() PASSED
[2022-08-30T12:20:36.127Z]
[2022-08-30T12:20:36.127Z] KStreamAggregationIntegrationTest > shouldAggregateWindowed(TestInfo) STARTED
[2022-08-30T12:20:39.666Z]
[2022-08-30T12:20:39.666Z] KStreamAggregationIntegrationTest > shouldAggregateWindowed(TestInfo) PASSED
[2022-08-30T12:20:46.610Z] streams-1: SMOKE-TEST-CLIENT-CLOSED
[2022-08-30T12:20:46.610Z] streams-3: SMOKE-TEST-CLIENT-CLOSED
[2022-08-30T12:20:46.610Z] streams-2: SMOKE-TEST-CLIENT-CLOSED
[2022-08-30T12:20:46.610Z] streams-4: SMOKE-TEST-CLIENT-CLOSED
[2022-08-30T12:20:46.610Z] streams-0: SMOKE-TEST-CLIENT-CLOSED
[2022-08-30T12:20:46.610Z] streams-5: SMOKE-TEST-CLIENT-CLOSED
[2022-08-30T12:20:47.533Z]
[2022-08-30T12:20:47.533Z] 643 tests completed, 1 failed
[2022-08-30T12:20:50.136Z] There were failing tests. See the report at: file:///home/jenkins/jenkins-agent/workspace/Kafka_kafka_trunk/streams/build/reports/tests/integrationTest/index.html
[2022-08-30T12:20:53.719Z]
[2022-08-30T12:20:53.719Z] FAILURE: Build failed with an exception.
[2022-08-30T12:20:53.719Z]
[2022-08-30T12:20:53.719Z] * What went wrong:
[2022-08-30T12:20:53.719Z] Execution failed for task ':server-common:integrationTest'.
[2022-08-30T12:20:53.719Z] > Process 'Gradle Test Executor 131' finished with non-zero exit value 1
[2022-08-30T12:20:53.719Z] This problem might be caused by incorrect test process configuration.
[2022-08-30T12:20:53.719Z] Please refer to the test execution section in the User Manual at https://docs.gradle.org/7.5.1/userguide/java_testing.html#sec:test_execution
[2022-08-30T12:20:53.719Z]
[2022-08-30T12:20:53.719Z] * Try:
[2022-08-30T12:20:53.719Z] > Run with --stacktrace option to get the stack trace.
[2022-08-30T12:20:53.719Z] > Run with --info or --debug option to get more log output.
[2022-08-30T12:20:53.719Z] > Run with --scan to get full insights.
[2022-08-30T12:20:53.719Z]
[2022-08-30T12:20:53.719Z] * Get more help at https://help.gradle.org
[2022-08-30T12:20:53.719Z]
[2022-08-30T12:20:53.719Z] BUILD FAILED in 2h 22m 49s
[2022-08-30T12:20:53.719Z] 212 actionable tasks: 115 executed, 97 up-to-date
[2022-08-30T12:20:53.719Z]
[2022-08-30T12:20:53.719Z] See the profiling report at: file:///home/jenkins/jenkins-agent/workspace/Kafka_kafka_trunk/build/reports/profile/profile-2022-08-30-09-58-10.html
[2022-08-30T12:20:53.719Z] A fine-grained performance profile is available: use the --scan option.
[Pipeline] }
[Pipeline] // withEnv
[Pipeline] }
[Pipeline] // withEnv
[Pipeline] }
[Pipeline] // withEnv
[Pipeline] }
[Pipeline] // node
[Pipeline] }
[Pipeline] // timestamps
[Pipeline] }
[Pipeline] // timeout
[Pipeline] }
[Pipeline] // stage
[Pipeline] }
Failed in branch JDK 11 and Scala 2.12
[Pipeline] // parallel
[Pipeline] }
[Pipeline] // stage
[Pipeline] stage
[Pipeline] { (Declarative: Post Actions)
[Pipeline] node
Running on builds35 in /home/jenkins/workspace/Kafka_kafka_trunk
[Pipeline] {
[Pipeline] script
[Pipeline] {
[Pipeline] step
Build failed in Jenkins: Kafka » Kafka Branch Builder » trunk #1194
Posted by Apache Jenkins Server <je...@builds.apache.org>.
See <https://ci-builds.apache.org/job/Kafka/job/kafka/job/trunk/1194/display/redirect>
Changes:
------------------------------------------
[...truncated 507984 lines...]
[2022-09-02T00:25:49.635Z]
[2022-09-02T00:25:49.635Z] IQv2IntegrationTest > shouldFetchFromPartition() STARTED
[2022-09-02T00:25:51.203Z]
[2022-09-02T00:25:51.203Z] IQv2IntegrationTest > shouldRejectNonRunningActive() PASSED
[2022-09-02T00:25:51.724Z]
[2022-09-02T00:25:51.724Z] IQv2IntegrationTest > shouldFetchFromPartition() PASSED
[2022-09-02T00:25:51.724Z]
[2022-09-02T00:25:51.724Z] IQv2IntegrationTest > shouldFetchExplicitlyFromAllPartitions() STARTED
[2022-09-02T00:25:53.264Z]
[2022-09-02T00:25:53.264Z] InternalTopicIntegrationTest > shouldCompactTopicsForKeyValueStoreChangelogs() STARTED
[2022-09-02T00:25:54.651Z]
[2022-09-02T00:25:54.651Z] IQv2IntegrationTest > shouldFetchExplicitlyFromAllPartitions() PASSED
[2022-09-02T00:25:54.651Z]
[2022-09-02T00:25:54.651Z] IQv2IntegrationTest > shouldFailUnknownStore() STARTED
[2022-09-02T00:25:54.651Z]
[2022-09-02T00:25:54.651Z] IQv2IntegrationTest > shouldFailUnknownStore() PASSED
[2022-09-02T00:25:54.651Z]
[2022-09-02T00:25:54.651Z] IQv2IntegrationTest > shouldRejectNonRunningActive() STARTED
[2022-09-02T00:25:55.174Z]
[2022-09-02T00:25:55.174Z] InternalTopicIntegrationTest > shouldCompactTopicsForKeyValueStoreChangelogs() PASSED
[2022-09-02T00:25:55.174Z]
[2022-09-02T00:25:55.174Z] InternalTopicIntegrationTest > shouldGetToRunningWithWindowedTableInFKJ() STARTED
[2022-09-02T00:25:56.739Z]
[2022-09-02T00:25:56.740Z] IQv2IntegrationTest > shouldRejectNonRunningActive() PASSED
[2022-09-02T00:25:58.308Z]
[2022-09-02T00:25:58.308Z] InternalTopicIntegrationTest > shouldGetToRunningWithWindowedTableInFKJ() PASSED
[2022-09-02T00:25:58.308Z]
[2022-09-02T00:25:58.308Z] InternalTopicIntegrationTest > shouldCompactAndDeleteTopicsForWindowStoreChangelogs() STARTED
[2022-09-02T00:25:58.828Z]
[2022-09-02T00:25:58.829Z] InternalTopicIntegrationTest > shouldCompactTopicsForKeyValueStoreChangelogs() STARTED
[2022-09-02T00:25:59.351Z]
[2022-09-02T00:25:59.351Z] InternalTopicIntegrationTest > shouldCompactAndDeleteTopicsForWindowStoreChangelogs() PASSED
[2022-09-02T00:26:00.394Z]
[2022-09-02T00:26:00.394Z] KStreamAggregationIntegrationTest > shouldAggregateSlidingWindows(TestInfo) STARTED
[2022-09-02T00:26:00.915Z]
[2022-09-02T00:26:00.915Z] InternalTopicIntegrationTest > shouldCompactTopicsForKeyValueStoreChangelogs() PASSED
[2022-09-02T00:26:00.915Z]
[2022-09-02T00:26:00.915Z] InternalTopicIntegrationTest > shouldGetToRunningWithWindowedTableInFKJ() STARTED
[2022-09-02T00:26:04.059Z]
[2022-09-02T00:26:04.059Z] InternalTopicIntegrationTest > shouldGetToRunningWithWindowedTableInFKJ() PASSED
[2022-09-02T00:26:04.059Z]
[2022-09-02T00:26:04.059Z] InternalTopicIntegrationTest > shouldCompactAndDeleteTopicsForWindowStoreChangelogs() STARTED
[2022-09-02T00:26:04.059Z]
[2022-09-02T00:26:04.059Z] InternalTopicIntegrationTest > shouldCompactAndDeleteTopicsForWindowStoreChangelogs() PASSED
[2022-09-02T00:26:06.143Z]
[2022-09-02T00:26:06.143Z] KStreamAggregationIntegrationTest > shouldAggregateSlidingWindows(TestInfo) PASSED
[2022-09-02T00:26:06.143Z]
[2022-09-02T00:26:06.143Z] KStreamAggregationIntegrationTest > shouldReduceSessionWindows() STARTED
[2022-09-02T00:26:06.317Z]
[2022-09-02T00:26:06.317Z] KStreamAggregationIntegrationTest > shouldAggregateSlidingWindows(TestInfo) STARTED
[2022-09-02T00:26:07.262Z]
[2022-09-02T00:26:07.262Z] KStreamAggregationIntegrationTest > shouldReduceSessionWindows() PASSED
[2022-09-02T00:26:07.262Z]
[2022-09-02T00:26:07.262Z] KStreamAggregationIntegrationTest > shouldReduceSlidingWindows(TestInfo) STARTED
[2022-09-02T00:26:11.868Z]
[2022-09-02T00:26:11.868Z] KStreamAggregationIntegrationTest > shouldAggregateSlidingWindows(TestInfo) PASSED
[2022-09-02T00:26:11.868Z]
[2022-09-02T00:26:11.868Z] KStreamAggregationIntegrationTest > shouldReduceSessionWindows() STARTED
[2022-09-02T00:26:14.056Z]
[2022-09-02T00:26:14.056Z] KStreamAggregationIntegrationTest > shouldReduceSessionWindows() PASSED
[2022-09-02T00:26:14.056Z]
[2022-09-02T00:26:14.056Z] KStreamAggregationIntegrationTest > shouldReduceSlidingWindows(TestInfo) STARTED
[2022-09-02T00:26:15.150Z]
[2022-09-02T00:26:15.150Z] KStreamAggregationIntegrationTest > shouldReduceSlidingWindows(TestInfo) PASSED
[2022-09-02T00:26:15.150Z]
[2022-09-02T00:26:15.150Z] KStreamAggregationIntegrationTest > shouldReduce(TestInfo) STARTED
[2022-09-02T00:26:18.714Z]
[2022-09-02T00:26:18.714Z] KStreamAggregationIntegrationTest > shouldReduceSlidingWindows(TestInfo) PASSED
[2022-09-02T00:26:18.714Z]
[2022-09-02T00:26:18.714Z] KStreamAggregationIntegrationTest > shouldReduce(TestInfo) STARTED
[2022-09-02T00:26:20.457Z]
[2022-09-02T00:26:20.457Z] KStreamAggregationIntegrationTest > shouldReduce(TestInfo) PASSED
[2022-09-02T00:26:20.457Z]
[2022-09-02T00:26:20.457Z] KStreamAggregationIntegrationTest > shouldAggregate(TestInfo) STARTED
[2022-09-02T00:26:24.371Z]
[2022-09-02T00:26:24.371Z] KStreamAggregationIntegrationTest > shouldReduce(TestInfo) PASSED
[2022-09-02T00:26:24.371Z]
[2022-09-02T00:26:24.371Z] KStreamAggregationIntegrationTest > shouldAggregate(TestInfo) STARTED
[2022-09-02T00:26:25.939Z]
[2022-09-02T00:26:25.939Z] KStreamAggregationIntegrationTest > shouldAggregate(TestInfo) PASSED
[2022-09-02T00:26:25.939Z]
[2022-09-02T00:26:25.939Z] KStreamAggregationIntegrationTest > shouldCount(TestInfo) STARTED
[2022-09-02T00:26:31.173Z]
[2022-09-02T00:26:31.173Z] KStreamAggregationIntegrationTest > shouldAggregate(TestInfo) PASSED
[2022-09-02T00:26:31.173Z]
[2022-09-02T00:26:31.173Z] KStreamAggregationIntegrationTest > shouldCount(TestInfo) STARTED
[2022-09-02T00:26:31.695Z]
[2022-09-02T00:26:31.695Z] KStreamAggregationIntegrationTest > shouldCount(TestInfo) PASSED
[2022-09-02T00:26:31.695Z]
[2022-09-02T00:26:31.695Z] KStreamAggregationIntegrationTest > shouldGroupByKey(TestInfo) STARTED
[2022-09-02T00:26:36.670Z]
[2022-09-02T00:26:36.670Z] KStreamAggregationIntegrationTest > shouldCount(TestInfo) PASSED
[2022-09-02T00:26:36.670Z]
[2022-09-02T00:26:36.670Z] KStreamAggregationIntegrationTest > shouldGroupByKey(TestInfo) STARTED
[2022-09-02T00:26:37.192Z]
[2022-09-02T00:26:37.193Z] KStreamAggregationIntegrationTest > shouldGroupByKey(TestInfo) PASSED
[2022-09-02T00:26:37.193Z]
[2022-09-02T00:26:37.193Z] KStreamAggregationIntegrationTest > shouldCountWithInternalStore(TestInfo) STARTED
[2022-09-02T00:26:42.164Z]
[2022-09-02T00:26:42.164Z] KStreamAggregationIntegrationTest > shouldGroupByKey(TestInfo) PASSED
[2022-09-02T00:26:42.164Z]
[2022-09-02T00:26:42.164Z] KStreamAggregationIntegrationTest > shouldCountWithInternalStore(TestInfo) STARTED
[2022-09-02T00:26:43.833Z]
[2022-09-02T00:26:43.833Z] KStreamAggregationIntegrationTest > shouldCountWithInternalStore(TestInfo) PASSED
[2022-09-02T00:26:43.833Z]
[2022-09-02T00:26:43.833Z] KStreamAggregationIntegrationTest > shouldCountUnlimitedWindows() STARTED
[2022-09-02T00:26:45.924Z]
[2022-09-02T00:26:45.924Z] KStreamAggregationIntegrationTest > shouldCountUnlimitedWindows() PASSED
[2022-09-02T00:26:45.924Z]
[2022-09-02T00:26:45.924Z] KStreamAggregationIntegrationTest > shouldReduceWindowed(TestInfo) STARTED
[2022-09-02T00:26:48.010Z]
[2022-09-02T00:26:48.010Z] KStreamAggregationIntegrationTest > shouldCountWithInternalStore(TestInfo) PASSED
[2022-09-02T00:26:48.010Z]
[2022-09-02T00:26:48.010Z] KStreamAggregationIntegrationTest > shouldCountUnlimitedWindows() STARTED
[2022-09-02T00:26:50.001Z]
[2022-09-02T00:26:50.001Z] KStreamAggregationIntegrationTest > shouldCountUnlimitedWindows() PASSED
[2022-09-02T00:26:50.001Z]
[2022-09-02T00:26:50.001Z] KStreamAggregationIntegrationTest > shouldReduceWindowed(TestInfo) STARTED
[2022-09-02T00:26:50.525Z]
[2022-09-02T00:26:50.525Z] KStreamAggregationIntegrationTest > shouldReduceWindowed(TestInfo) PASSED
[2022-09-02T00:26:50.525Z]
[2022-09-02T00:26:50.525Z] KStreamAggregationIntegrationTest > shouldCountSessionWindows() STARTED
[2022-09-02T00:26:52.567Z]
[2022-09-02T00:26:52.567Z] KStreamAggregationIntegrationTest > shouldCountSessionWindows() PASSED
[2022-09-02T00:26:52.567Z]
[2022-09-02T00:26:52.567Z] KStreamAggregationIntegrationTest > shouldAggregateWindowed(TestInfo) STARTED
[2022-09-02T00:26:54.317Z]
[2022-09-02T00:26:54.318Z] KStreamAggregationIntegrationTest > shouldReduceWindowed(TestInfo) PASSED
[2022-09-02T00:26:54.318Z]
[2022-09-02T00:26:54.318Z] KStreamAggregationIntegrationTest > shouldCountSessionWindows() STARTED
[2022-09-02T00:26:56.308Z]
[2022-09-02T00:26:56.308Z] KStreamAggregationIntegrationTest > shouldCountSessionWindows() PASSED
[2022-09-02T00:26:56.308Z]
[2022-09-02T00:26:56.308Z] KStreamAggregationIntegrationTest > shouldAggregateWindowed(TestInfo) STARTED
[2022-09-02T00:26:58.394Z]
[2022-09-02T00:26:58.394Z] KStreamAggregationIntegrationTest > shouldAggregateWindowed(TestInfo) PASSED
[2022-09-02T00:27:00.909Z]
[2022-09-02T00:27:00.909Z] KStreamAggregationIntegrationTest > shouldAggregateWindowed(TestInfo) PASSED
[2022-09-02T00:27:06.684Z] streams-6: SMOKE-TEST-CLIENT-CLOSED
[2022-09-02T00:27:06.684Z] streams-3: SMOKE-TEST-CLIENT-CLOSED
[2022-09-02T00:27:06.684Z] streams-1: SMOKE-TEST-CLIENT-CLOSED
[2022-09-02T00:27:06.684Z] streams-0: SMOKE-TEST-CLIENT-CLOSED
[2022-09-02T00:27:06.684Z] streams-5: SMOKE-TEST-CLIENT-CLOSED
[2022-09-02T00:27:06.684Z] streams-2: SMOKE-TEST-CLIENT-CLOSED
[2022-09-02T00:27:06.684Z] streams-4: SMOKE-TEST-CLIENT-CLOSED
[2022-09-02T00:27:08.176Z] streams-11: SMOKE-TEST-CLIENT-CLOSED
[2022-09-02T00:27:08.176Z] streams-7: SMOKE-TEST-CLIENT-CLOSED
[2022-09-02T00:27:08.176Z] streams-6: SMOKE-TEST-CLIENT-CLOSED
[2022-09-02T00:27:08.176Z] streams-13: SMOKE-TEST-CLIENT-CLOSED
[2022-09-02T00:27:08.176Z] streams-0: SMOKE-TEST-CLIENT-CLOSED
[2022-09-02T00:27:08.176Z] streams-14: SMOKE-TEST-CLIENT-CLOSED
[2022-09-02T00:27:08.176Z] streams-2: SMOKE-TEST-CLIENT-CLOSED
[2022-09-02T00:27:08.176Z] streams-3: SMOKE-TEST-CLIENT-CLOSED
[2022-09-02T00:27:08.176Z] streams-12: SMOKE-TEST-CLIENT-CLOSED
[2022-09-02T00:27:08.176Z] streams-8: SMOKE-TEST-CLIENT-CLOSED
[2022-09-02T00:27:08.176Z] streams-1: SMOKE-TEST-CLIENT-CLOSED
[2022-09-02T00:27:08.176Z] streams-9: SMOKE-TEST-CLIENT-CLOSED
[2022-09-02T00:27:08.176Z] streams-5: SMOKE-TEST-CLIENT-CLOSED
[2022-09-02T00:27:08.176Z] streams-15: SMOKE-TEST-CLIENT-CLOSED
[2022-09-02T00:27:08.176Z] streams-4: SMOKE-TEST-CLIENT-CLOSED
[2022-09-02T00:27:08.176Z] streams-10: SMOKE-TEST-CLIENT-CLOSED
[2022-09-02T00:27:09.220Z]
[2022-09-02T00:27:09.220Z] 643 tests completed, 1 failed
[2022-09-02T00:27:09.743Z]
[2022-09-02T00:27:09.743Z] FAILURE: Build failed with an exception.
[2022-09-02T00:27:09.743Z]
[2022-09-02T00:27:09.743Z] * What went wrong:
[2022-09-02T00:27:09.743Z] Execution failed for task ':core:unitTest'.
[2022-09-02T00:27:09.743Z] > Process 'Gradle Test Executor 130' finished with non-zero exit value 1
[2022-09-02T00:27:09.743Z] This problem might be caused by incorrect test process configuration.
[2022-09-02T00:27:09.743Z] Please refer to the test execution section in the User Manual at https://docs.gradle.org/7.5.1/userguide/java_testing.html#sec:test_execution
[2022-09-02T00:27:09.743Z]
[2022-09-02T00:27:09.743Z] * Try:
[2022-09-02T00:27:09.743Z] > Run with --stacktrace option to get the stack trace.
[2022-09-02T00:27:09.743Z] > Run with --info or --debug option to get more log output.
[2022-09-02T00:27:09.743Z] > Run with --scan to get full insights.
[2022-09-02T00:27:09.743Z]
[2022-09-02T00:27:09.743Z] * Get more help at https://help.gradle.org
[2022-09-02T00:27:09.743Z]
[2022-09-02T00:27:09.743Z] BUILD FAILED in 2h 40m
[2022-09-02T00:27:09.743Z] 212 actionable tasks: 115 executed, 97 up-to-date
[2022-09-02T00:27:09.743Z]
[2022-09-02T00:27:09.743Z] See the profiling report at: file:///home/jenkins/jenkins-agent/workspace/Kafka_kafka_trunk@2/build/reports/profile/profile-2022-09-01-21-47-14.html
[2022-09-02T00:27:09.743Z] A fine-grained performance profile is available: use the --scan option.
[Pipeline] }
[Pipeline] // withEnv
[Pipeline] }
[Pipeline] // withEnv
[Pipeline] }
[Pipeline] // withEnv
[Pipeline] }
[Pipeline] // node
[Pipeline] }
[Pipeline] // timestamps
[Pipeline] }
[Pipeline] // timeout
[Pipeline] }
[Pipeline] // stage
[Pipeline] }
Failed in branch JDK 11 and Scala 2.12
[2022-09-02T00:27:12.388Z] There were failing tests. See the report at: file:///home/jenkins/jenkins-agent/workspace/Kafka_kafka_trunk/streams/build/reports/tests/integrationTest/index.html
[2022-09-02T00:27:13.335Z]
[2022-09-02T00:27:13.335Z] FAILURE: Build failed with an exception.
[2022-09-02T00:27:13.335Z]
[2022-09-02T00:27:13.335Z] * What went wrong:
[2022-09-02T00:27:13.335Z] Execution failed for task ':core:unitTest'.
[2022-09-02T00:27:13.335Z] > Process 'Gradle Test Executor 134' finished with non-zero exit value 1
[2022-09-02T00:27:13.335Z] This problem might be caused by incorrect test process configuration.
[2022-09-02T00:27:13.335Z] Please refer to the test execution section in the User Manual at https://docs.gradle.org/7.5.1/userguide/java_testing.html#sec:test_execution
[2022-09-02T00:27:13.335Z]
[2022-09-02T00:27:13.335Z] * Try:
[2022-09-02T00:27:13.335Z] > Run with --stacktrace option to get the stack trace.
[2022-09-02T00:27:13.335Z] > Run with --info or --debug option to get more log output.
[2022-09-02T00:27:13.335Z] > Run with --scan to get full insights.
[2022-09-02T00:27:13.335Z]
[2022-09-02T00:27:13.335Z] * Get more help at https://help.gradle.org
[2022-09-02T00:27:13.335Z]
[2022-09-02T00:27:13.335Z] BUILD FAILED in 2h 39m 59s
[2022-09-02T00:27:13.335Z] 212 actionable tasks: 115 executed, 97 up-to-date
[2022-09-02T00:27:13.335Z]
[2022-09-02T00:27:13.335Z] See the profiling report at: file:///home/jenkins/jenkins-agent/workspace/Kafka_kafka_trunk/build/reports/profile/profile-2022-09-01-21-47-17.html
[2022-09-02T00:27:13.335Z] A fine-grained performance profile is available: use the --scan option.
[Pipeline] }
[Pipeline] // withEnv
[Pipeline] }
[Pipeline] // withEnv
[Pipeline] }
[Pipeline] // withEnv
[Pipeline] }
[Pipeline] // node
[Pipeline] }
[Pipeline] // timestamps
[Pipeline] }
[Pipeline] // timeout
[Pipeline] }
[Pipeline] // stage
[Pipeline] }
Failed in branch JDK 17 and Scala 2.13
[Pipeline] // parallel
[Pipeline] }
[Pipeline] // stage
[Pipeline] stage
[Pipeline] { (Declarative: Post Actions)
[Pipeline] node
Running on builds35 in /home/jenkins/workspace/Kafka_kafka_trunk
[Pipeline] {
[Pipeline] script
[Pipeline] {
[Pipeline] step
Build failed in Jenkins: Kafka » Kafka Branch Builder » trunk #1193
Posted by Apache Jenkins Server <je...@builds.apache.org>.
See <https://ci-builds.apache.org/job/Kafka/job/kafka/job/trunk/1193/display/redirect>
Changes:
------------------------------------------
[...truncated 422658 lines...]
[2022-09-01T15:35:53.146Z] KStreamAggregationIntegrationTest > shouldReduce(TestInfo) STARTED
[2022-09-01T15:35:57.137Z]
[2022-09-01T15:35:57.137Z] KStreamAggregationIntegrationTest > shouldReduce(TestInfo) PASSED
[2022-09-01T15:35:57.137Z]
[2022-09-01T15:35:57.137Z] KStreamAggregationIntegrationTest > shouldAggregate(TestInfo) STARTED
[2022-09-01T15:36:00.006Z]
[2022-09-01T15:36:00.006Z] KStreamAggregationIntegrationTest > shouldAggregate(TestInfo) PASSED
[2022-09-01T15:36:00.006Z]
[2022-09-01T15:36:00.006Z] KStreamAggregationIntegrationTest > shouldCount(TestInfo) STARTED
[2022-09-01T15:36:04.731Z]
[2022-09-01T15:36:04.731Z] KStreamAggregationIntegrationTest > shouldCount(TestInfo) PASSED
[2022-09-01T15:36:04.731Z]
[2022-09-01T15:36:04.731Z] KStreamAggregationIntegrationTest > shouldGroupByKey(TestInfo) STARTED
[2022-09-01T15:36:08.558Z]
[2022-09-01T15:36:08.558Z] KStreamAggregationIntegrationTest > shouldGroupByKey(TestInfo) PASSED
[2022-09-01T15:36:08.558Z]
[2022-09-01T15:36:08.558Z] KStreamAggregationIntegrationTest > shouldCountWithInternalStore(TestInfo) STARTED
[2022-09-01T15:36:12.433Z]
[2022-09-01T15:36:12.433Z] KStreamAggregationIntegrationTest > shouldCountWithInternalStore(TestInfo) PASSED
[2022-09-01T15:36:12.433Z]
[2022-09-01T15:36:12.433Z] KStreamAggregationIntegrationTest > shouldCountUnlimitedWindows() STARTED
[2022-09-01T15:36:14.373Z]
[2022-09-01T15:36:14.373Z] KStreamAggregationIntegrationTest > shouldCountUnlimitedWindows() PASSED
[2022-09-01T15:36:14.373Z]
[2022-09-01T15:36:14.373Z] KStreamAggregationIntegrationTest > shouldReduceWindowed(TestInfo) STARTED
[2022-09-01T15:36:17.926Z]
[2022-09-01T15:36:17.926Z] KStreamAggregationIntegrationTest > shouldReduceWindowed(TestInfo) PASSED
[2022-09-01T15:36:17.926Z]
[2022-09-01T15:36:17.926Z] KStreamAggregationIntegrationTest > shouldCountSessionWindows() STARTED
[2022-09-01T15:36:18.855Z]
[2022-09-01T15:36:18.855Z] KStreamAggregationIntegrationTest > shouldCountSessionWindows() PASSED
[2022-09-01T15:36:18.855Z]
[2022-09-01T15:36:18.855Z] KStreamAggregationIntegrationTest > shouldAggregateWindowed(TestInfo) STARTED
[2022-09-01T15:36:23.523Z]
[2022-09-01T15:36:23.523Z] KStreamAggregationIntegrationTest > shouldAggregateWindowed(TestInfo) PASSED
[2022-09-01T15:36:25.598Z]
[2022-09-01T15:36:25.599Z] FineGrainedAutoResetIntegrationTest > shouldOnlyReadRecordsWhereEarliestSpecifiedWithNoCommittedOffsetsWithDefaultGlobalAutoOffsetResetEarliest() PASSED
[2022-09-01T15:36:25.599Z]
[2022-09-01T15:36:25.599Z] FineGrainedAutoResetIntegrationTest > shouldThrowStreamsExceptionNoResetSpecified() STARTED
[2022-09-01T15:36:25.599Z]
[2022-09-01T15:36:25.599Z] FineGrainedAutoResetIntegrationTest > shouldThrowStreamsExceptionNoResetSpecified() PASSED
[2022-09-01T15:36:25.599Z]
[2022-09-01T15:36:25.599Z] GlobalKTableIntegrationTest > shouldGetToRunningWithOnlyGlobalTopology() STARTED
[2022-09-01T15:36:25.599Z]
[2022-09-01T15:36:25.599Z] GlobalKTableIntegrationTest > shouldGetToRunningWithOnlyGlobalTopology() PASSED
[2022-09-01T15:36:25.599Z]
[2022-09-01T15:36:25.599Z] GlobalKTableIntegrationTest > shouldKStreamGlobalKTableLeftJoin() STARTED
[2022-09-01T15:36:28.084Z]
[2022-09-01T15:36:28.084Z] GlobalKTableIntegrationTest > shouldKStreamGlobalKTableLeftJoin() PASSED
[2022-09-01T15:36:28.084Z]
[2022-09-01T15:36:28.084Z] GlobalKTableIntegrationTest > shouldRestoreGlobalInMemoryKTableOnRestart() STARTED
[2022-09-01T15:36:29.181Z]
[2022-09-01T15:36:29.181Z] GlobalKTableIntegrationTest > shouldRestoreGlobalInMemoryKTableOnRestart() PASSED
[2022-09-01T15:36:29.181Z]
[2022-09-01T15:36:29.181Z] GlobalKTableIntegrationTest > shouldKStreamGlobalKTableJoin() STARTED
[2022-09-01T15:36:30.651Z] streams-3: SMOKE-TEST-CLIENT-CLOSED
[2022-09-01T15:36:30.651Z] streams-5: SMOKE-TEST-CLIENT-CLOSED
[2022-09-01T15:36:30.651Z] streams-1: SMOKE-TEST-CLIENT-CLOSED
[2022-09-01T15:36:31.159Z]
[2022-09-01T15:36:31.159Z] GlobalKTableIntegrationTest > shouldKStreamGlobalKTableJoin() PASSED
[2022-09-01T15:36:31.668Z] streams-4: SMOKE-TEST-CLIENT-CLOSED
[2022-09-01T15:36:31.668Z] streams-0: SMOKE-TEST-CLIENT-CLOSED
[2022-09-01T15:36:31.668Z] streams-6: SMOKE-TEST-CLIENT-CLOSED
[2022-09-01T15:36:31.668Z] streams-2: SMOKE-TEST-CLIENT-CLOSED
[2022-09-01T15:36:33.208Z]
[2022-09-01T15:36:33.208Z] GlobalThreadShutDownOrderTest > shouldFinishGlobalStoreOperationOnShutDown() STARTED
[2022-09-01T15:36:38.347Z]
[2022-09-01T15:36:38.347Z] FAILURE: Build failed with an exception.
[2022-09-01T15:36:38.347Z]
[2022-09-01T15:36:38.347Z] * What went wrong:
[2022-09-01T15:36:38.347Z] Execution failed for task ':core:unitTest'.
[2022-09-01T15:36:38.347Z] > Process 'Gradle Test Executor 131' finished with non-zero exit value 1
[2022-09-01T15:36:38.347Z] This problem might be caused by incorrect test process configuration.
[2022-09-01T15:36:38.347Z] Please refer to the test execution section in the User Manual at https://docs.gradle.org/7.5.1/userguide/java_testing.html#sec:test_execution
[2022-09-01T15:36:38.347Z]
[2022-09-01T15:36:38.347Z] * Try:
[2022-09-01T15:36:38.347Z] > Run with --stacktrace option to get the stack trace.
[2022-09-01T15:36:38.347Z] > Run with --info or --debug option to get more log output.
[2022-09-01T15:36:38.347Z] > Run with --scan to get full insights.
[2022-09-01T15:36:38.347Z]
[2022-09-01T15:36:38.347Z] * Get more help at https://help.gradle.org
[2022-09-01T15:36:38.347Z]
[2022-09-01T15:36:38.347Z] BUILD FAILED in 2h 47m 18s
[2022-09-01T15:36:38.347Z] 212 actionable tasks: 115 executed, 97 up-to-date
[2022-09-01T15:36:38.347Z]
[2022-09-01T15:36:38.347Z] See the profiling report at: file:///home/jenkins/workspace/Kafka_kafka_trunk/build/reports/profile/profile-2022-09-01-12-49-27.html
[2022-09-01T15:36:38.347Z] A fine-grained performance profile is available: use the --scan option.
[2022-09-01T15:36:38.853Z]
[2022-09-01T15:36:38.853Z] GlobalThreadShutDownOrderTest > shouldFinishGlobalStoreOperationOnShutDown() PASSED
[Pipeline] }
[Pipeline] // withEnv
[Pipeline] }
[Pipeline] // withEnv
[Pipeline] }
[Pipeline] // withEnv
[Pipeline] }
[Pipeline] // node
[Pipeline] }
[Pipeline] // timestamps
[Pipeline] }
[Pipeline] // timeout
[Pipeline] }
[Pipeline] // stage
[Pipeline] }
Failed in branch JDK 11 and Scala 2.13
[2022-09-01T15:36:39.943Z]
[2022-09-01T15:36:39.944Z] IQv2IntegrationTest > shouldFailStopped() STARTED
[2022-09-01T15:36:39.944Z]
[2022-09-01T15:36:39.944Z] IQv2IntegrationTest > shouldFailStopped() PASSED
[2022-09-01T15:36:39.944Z]
[2022-09-01T15:36:39.944Z] IQv2IntegrationTest > shouldNotRequireQueryHandler(TestInfo) STARTED
[2022-09-01T15:36:40.875Z]
[2022-09-01T15:36:40.875Z] IQv2IntegrationTest > shouldNotRequireQueryHandler(TestInfo) PASSED
[2022-09-01T15:36:40.875Z]
[2022-09-01T15:36:40.875Z] IQv2IntegrationTest > shouldFailNotStarted() STARTED
[2022-09-01T15:36:40.875Z]
[2022-09-01T15:36:40.875Z] IQv2IntegrationTest > shouldFailNotStarted() PASSED
[2022-09-01T15:36:40.875Z]
[2022-09-01T15:36:40.875Z] IQv2IntegrationTest > shouldFetchFromPartition() STARTED
[2022-09-01T15:36:46.595Z]
[2022-09-01T15:36:46.595Z] IQv2IntegrationTest > shouldFetchFromPartition() PASSED
[2022-09-01T15:36:46.595Z]
[2022-09-01T15:36:46.595Z] IQv2IntegrationTest > shouldFetchExplicitlyFromAllPartitions() STARTED
[2022-09-01T15:36:48.338Z]
[2022-09-01T15:36:48.338Z] IQv2IntegrationTest > shouldFetchExplicitlyFromAllPartitions() PASSED
[2022-09-01T15:36:48.338Z]
[2022-09-01T15:36:48.338Z] IQv2IntegrationTest > shouldFailUnknownStore() STARTED
[2022-09-01T15:36:48.338Z]
[2022-09-01T15:36:48.338Z] IQv2IntegrationTest > shouldFailUnknownStore() PASSED
[2022-09-01T15:36:48.338Z]
[2022-09-01T15:36:48.338Z] IQv2IntegrationTest > shouldRejectNonRunningActive() STARTED
[2022-09-01T15:36:50.079Z]
[2022-09-01T15:36:50.079Z] IQv2IntegrationTest > shouldRejectNonRunningActive() PASSED
[2022-09-01T15:36:51.010Z]
[2022-09-01T15:36:51.010Z] InternalTopicIntegrationTest > shouldCompactTopicsForKeyValueStoreChangelogs() STARTED
[2022-09-01T15:36:52.753Z]
[2022-09-01T15:36:52.753Z] InternalTopicIntegrationTest > shouldCompactTopicsForKeyValueStoreChangelogs() PASSED
[2022-09-01T15:36:52.753Z]
[2022-09-01T15:36:52.753Z] InternalTopicIntegrationTest > shouldGetToRunningWithWindowedTableInFKJ() STARTED
[2022-09-01T15:36:55.368Z]
[2022-09-01T15:36:55.368Z] InternalTopicIntegrationTest > shouldGetToRunningWithWindowedTableInFKJ() PASSED
[2022-09-01T15:36:55.368Z]
[2022-09-01T15:36:55.368Z] InternalTopicIntegrationTest > shouldCompactAndDeleteTopicsForWindowStoreChangelogs() STARTED
[2022-09-01T15:36:55.368Z]
[2022-09-01T15:36:55.368Z] InternalTopicIntegrationTest > shouldCompactAndDeleteTopicsForWindowStoreChangelogs() PASSED
[2022-09-01T15:36:57.112Z]
[2022-09-01T15:36:57.112Z] KStreamAggregationIntegrationTest > shouldAggregateSlidingWindows(TestInfo) STARTED
[2022-09-01T15:37:00.671Z]
[2022-09-01T15:37:00.671Z] KStreamAggregationIntegrationTest > shouldAggregateSlidingWindows(TestInfo) PASSED
[2022-09-01T15:37:00.671Z]
[2022-09-01T15:37:00.671Z] KStreamAggregationIntegrationTest > shouldReduceSessionWindows() STARTED
[2022-09-01T15:37:02.413Z]
[2022-09-01T15:37:02.413Z] KStreamAggregationIntegrationTest > shouldReduceSessionWindows() PASSED
[2022-09-01T15:37:02.413Z]
[2022-09-01T15:37:02.413Z] KStreamAggregationIntegrationTest > shouldReduceSlidingWindows(TestInfo) STARTED
[2022-09-01T15:37:05.027Z]
[2022-09-01T15:37:05.027Z] KStreamAggregationIntegrationTest > shouldReduceSlidingWindows(TestInfo) PASSED
[2022-09-01T15:37:05.027Z]
[2022-09-01T15:37:05.027Z] KStreamAggregationIntegrationTest > shouldReduce(TestInfo) STARTED
[2022-09-01T15:37:09.617Z]
[2022-09-01T15:37:09.617Z] KStreamAggregationIntegrationTest > shouldReduce(TestInfo) PASSED
[2022-09-01T15:37:09.617Z]
[2022-09-01T15:37:09.617Z] KStreamAggregationIntegrationTest > shouldAggregate(TestInfo) STARTED
[2022-09-01T15:37:13.175Z]
[2022-09-01T15:37:13.175Z] KStreamAggregationIntegrationTest > shouldAggregate(TestInfo) PASSED
[2022-09-01T15:37:13.175Z]
[2022-09-01T15:37:13.175Z] KStreamAggregationIntegrationTest > shouldCount(TestInfo) STARTED
[2022-09-01T15:37:18.897Z]
[2022-09-01T15:37:18.897Z] KStreamAggregationIntegrationTest > shouldCount(TestInfo) PASSED
[2022-09-01T15:37:18.897Z]
[2022-09-01T15:37:18.897Z] KStreamAggregationIntegrationTest > shouldGroupByKey(TestInfo) STARTED
[2022-09-01T15:37:22.454Z]
[2022-09-01T15:37:22.455Z] KStreamAggregationIntegrationTest > shouldGroupByKey(TestInfo) PASSED
[2022-09-01T15:37:22.455Z]
[2022-09-01T15:37:22.455Z] KStreamAggregationIntegrationTest > shouldCountWithInternalStore(TestInfo) STARTED
[2022-09-01T15:37:26.012Z]
[2022-09-01T15:37:26.012Z] KStreamAggregationIntegrationTest > shouldCountWithInternalStore(TestInfo) PASSED
[2022-09-01T15:37:26.012Z]
[2022-09-01T15:37:26.012Z] KStreamAggregationIntegrationTest > shouldCountUnlimitedWindows() STARTED
[2022-09-01T15:37:27.755Z]
[2022-09-01T15:37:27.755Z] KStreamAggregationIntegrationTest > shouldCountUnlimitedWindows() PASSED
[2022-09-01T15:37:27.755Z]
[2022-09-01T15:37:27.755Z] KStreamAggregationIntegrationTest > shouldReduceWindowed(TestInfo) STARTED
[2022-09-01T15:37:31.314Z]
[2022-09-01T15:37:31.314Z] KStreamAggregationIntegrationTest > shouldReduceWindowed(TestInfo) PASSED
[2022-09-01T15:37:31.314Z]
[2022-09-01T15:37:31.314Z] KStreamAggregationIntegrationTest > shouldCountSessionWindows() STARTED
[2022-09-01T15:37:33.058Z]
[2022-09-01T15:37:33.058Z] KStreamAggregationIntegrationTest > shouldCountSessionWindows() PASSED
[2022-09-01T15:37:33.058Z]
[2022-09-01T15:37:33.058Z] KStreamAggregationIntegrationTest > shouldAggregateWindowed(TestInfo) STARTED
[2022-09-01T15:37:36.615Z]
[2022-09-01T15:37:36.615Z] KStreamAggregationIntegrationTest > shouldAggregateWindowed(TestInfo) PASSED
[2022-09-01T15:37:43.595Z] streams-2: SMOKE-TEST-CLIENT-CLOSED
[2022-09-01T15:37:43.595Z] streams-0: SMOKE-TEST-CLIENT-CLOSED
[2022-09-01T15:37:43.595Z] streams-3: SMOKE-TEST-CLIENT-CLOSED
[2022-09-01T15:37:43.595Z] streams-7: SMOKE-TEST-CLIENT-CLOSED
[2022-09-01T15:37:43.595Z] streams-1: SMOKE-TEST-CLIENT-CLOSED
[2022-09-01T15:37:43.595Z] streams-4: SMOKE-TEST-CLIENT-CLOSED
[2022-09-01T15:37:43.595Z] streams-6: SMOKE-TEST-CLIENT-CLOSED
[2022-09-01T15:37:43.595Z] streams-5: SMOKE-TEST-CLIENT-CLOSED
[2022-09-01T15:37:49.487Z]
[2022-09-01T15:37:49.487Z] FAILURE: Build failed with an exception.
[2022-09-01T15:37:49.487Z]
[2022-09-01T15:37:49.487Z] * What went wrong:
[2022-09-01T15:37:49.487Z] Execution failed for task ':core:unitTest'.
[2022-09-01T15:37:49.487Z] > Process 'Gradle Test Executor 129' finished with non-zero exit value 1
[2022-09-01T15:37:49.487Z] This problem might be caused by incorrect test process configuration.
[2022-09-01T15:37:49.487Z] Please refer to the test execution section in the User Manual at https://docs.gradle.org/7.5.1/userguide/java_testing.html#sec:test_execution
[2022-09-01T15:37:49.487Z]
[2022-09-01T15:37:49.487Z] * Try:
[2022-09-01T15:37:49.487Z] > Run with --stacktrace option to get the stack trace.
[2022-09-01T15:37:49.487Z] > Run with --info or --debug option to get more log output.
[2022-09-01T15:37:49.487Z] > Run with --scan to get full insights.
[2022-09-01T15:37:49.487Z]
[2022-09-01T15:37:49.487Z] * Get more help at https://help.gradle.org
[2022-09-01T15:37:49.487Z]
[2022-09-01T15:37:49.487Z] BUILD FAILED in 2h 47m 49s
[2022-09-01T15:37:49.487Z] 212 actionable tasks: 115 executed, 97 up-to-date
[2022-09-01T15:37:49.487Z]
[2022-09-01T15:37:49.487Z] See the profiling report at: file:///home/jenkins/workspace/Kafka_kafka_trunk@2/build/reports/profile/profile-2022-09-01-12-50-17.html
[2022-09-01T15:37:49.487Z] A fine-grained performance profile is available: use the --scan option.
[Pipeline] }
[Pipeline] // withEnv
[Pipeline] }
[Pipeline] // withEnv
[Pipeline] }
[Pipeline] // withEnv
[Pipeline] }
[Pipeline] // node
[Pipeline] }
[Pipeline] // timestamps
[Pipeline] }
[Pipeline] // timeout
[Pipeline] }
[Pipeline] // stage
[Pipeline] }
Failed in branch JDK 11 and Scala 2.12
[Pipeline] // parallel
[Pipeline] }
[Pipeline] // stage
[Pipeline] stage
[Pipeline] { (Declarative: Post Actions)
[Pipeline] node
Running on builds35 in /home/jenkins/workspace/Kafka_kafka_trunk
[Pipeline] {
[Pipeline] script
[Pipeline] {
[Pipeline] step
Build failed in Jenkins: Kafka » Kafka Branch Builder » trunk #1192
Posted by Apache Jenkins Server <je...@builds.apache.org>.
See <https://ci-builds.apache.org/job/Kafka/job/kafka/job/trunk/1192/display/redirect>
Changes:
------------------------------------------
[...truncated 504392 lines...]
[2022-09-01T00:19:43.478Z] KStreamAggregationIntegrationTest > shouldCountSessionWindows() STARTED
[2022-09-01T00:19:44.171Z]
[2022-09-01T00:19:44.171Z] AdjustStreamThreadCountTest > shouldRemoveStreamThreadWithStaticMembership() PASSED
[2022-09-01T00:19:44.171Z]
[2022-09-01T00:19:44.171Z] AdjustStreamThreadCountTest > shouldRemoveStreamThread() STARTED
[2022-09-01T00:19:45.722Z]
[2022-09-01T00:19:45.722Z] KStreamAggregationIntegrationTest > shouldCountSessionWindows() PASSED
[2022-09-01T00:19:45.722Z]
[2022-09-01T00:19:45.722Z] KStreamAggregationIntegrationTest > shouldAggregateWindowed(TestInfo) STARTED
[2022-09-01T00:19:48.399Z]
[2022-09-01T00:19:48.399Z] AdjustStreamThreadCountTest > shouldRemoveStreamThread() PASSED
[2022-09-01T00:19:48.399Z]
[2022-09-01T00:19:48.399Z] AdjustStreamThreadCountTest > shouldResizeCacheAfterThreadRemovalTimesOut() STARTED
[2022-09-01T00:19:48.914Z]
[2022-09-01T00:19:48.915Z] KStreamAggregationIntegrationTest > shouldAggregateWindowed(TestInfo) PASSED
[2022-09-01T00:19:50.468Z]
[2022-09-01T00:19:50.468Z] AdjustStreamThreadCountTest > shouldResizeCacheAfterThreadRemovalTimesOut() PASSED
[2022-09-01T00:19:54.966Z]
[2022-09-01T00:19:54.966Z] FineGrainedAutoResetIntegrationTest > shouldOnlyReadRecordsWhereEarliestSpecifiedWithNoCommittedOffsetsWithGlobalAutoOffsetResetLatest() STARTED
[2022-09-01T00:19:54.966Z]
[2022-09-01T00:19:54.966Z] FineGrainedAutoResetIntegrationTest > shouldOnlyReadRecordsWhereEarliestSpecifiedWithNoCommittedOffsetsWithGlobalAutoOffsetResetLatest() PASSED
[2022-09-01T00:19:54.966Z]
[2022-09-01T00:19:54.966Z] FineGrainedAutoResetIntegrationTest > shouldThrowExceptionOverlappingPattern() STARTED
[2022-09-01T00:19:54.966Z]
[2022-09-01T00:19:54.966Z] FineGrainedAutoResetIntegrationTest > shouldThrowExceptionOverlappingPattern() PASSED
[2022-09-01T00:19:54.966Z]
[2022-09-01T00:19:54.966Z] FineGrainedAutoResetIntegrationTest > shouldThrowExceptionOverlappingTopic() STARTED
[2022-09-01T00:19:54.966Z]
[2022-09-01T00:19:54.966Z] FineGrainedAutoResetIntegrationTest > shouldThrowExceptionOverlappingTopic() PASSED
[2022-09-01T00:19:54.966Z]
[2022-09-01T00:19:54.966Z] FineGrainedAutoResetIntegrationTest > shouldOnlyReadRecordsWhereEarliestSpecifiedWithInvalidCommittedOffsets() STARTED
[2022-09-01T00:19:57.613Z] streams-4: SMOKE-TEST-CLIENT-CLOSED
[2022-09-01T00:19:57.613Z] streams-1: SMOKE-TEST-CLIENT-CLOSED
[2022-09-01T00:19:57.613Z] streams-3: SMOKE-TEST-CLIENT-CLOSED
[2022-09-01T00:19:57.613Z] streams-2: SMOKE-TEST-CLIENT-CLOSED
[2022-09-01T00:19:57.613Z] streams-5: SMOKE-TEST-CLIENT-CLOSED
[2022-09-01T00:19:57.613Z] streams-0: SMOKE-TEST-CLIENT-CLOSED
[2022-09-01T00:20:02.591Z]
[2022-09-01T00:20:02.591Z] FAILURE: Build failed with an exception.
[2022-09-01T00:20:02.591Z]
[2022-09-01T00:20:02.591Z] * What went wrong:
[2022-09-01T00:20:02.591Z] Execution failed for task ':storage:unitTest'.
[2022-09-01T00:20:02.591Z] > Process 'Gradle Test Executor 137' finished with non-zero exit value 1
[2022-09-01T00:20:02.591Z] This problem might be caused by incorrect test process configuration.
[2022-09-01T00:20:02.591Z] Please refer to the test execution section in the User Manual at https://docs.gradle.org/7.5.1/userguide/java_testing.html#sec:test_execution
[2022-09-01T00:20:02.591Z]
[2022-09-01T00:20:02.591Z] * Try:
[2022-09-01T00:20:02.591Z] > Run with --stacktrace option to get the stack trace.
[2022-09-01T00:20:02.591Z] > Run with --info or --debug option to get more log output.
[2022-09-01T00:20:02.591Z] > Run with --scan to get full insights.
[2022-09-01T00:20:02.591Z]
[2022-09-01T00:20:02.591Z] * Get more help at https://help.gradle.org
[2022-09-01T00:20:02.591Z]
[2022-09-01T00:20:02.591Z] BUILD FAILED in 2h 33m 25s
[2022-09-01T00:20:02.591Z] 212 actionable tasks: 115 executed, 97 up-to-date
[2022-09-01T00:20:02.591Z]
[2022-09-01T00:20:02.591Z] See the profiling report at: file:///home/jenkins/jenkins-agent/workspace/Kafka_kafka_trunk/build/reports/profile/profile-2022-08-31-21-46-41.html
[2022-09-01T00:20:02.591Z] A fine-grained performance profile is available: use the --scan option.
[Pipeline] }
[Pipeline] // withEnv
[Pipeline] }
[Pipeline] // withEnv
[Pipeline] }
[Pipeline] // withEnv
[Pipeline] }
[Pipeline] // node
[Pipeline] }
[Pipeline] // timestamps
[Pipeline] }
[Pipeline] // timeout
[Pipeline] }
[Pipeline] // stage
[Pipeline] }
Failed in branch JDK 17 and Scala 2.13
[2022-09-01T00:20:45.570Z]
[2022-09-01T00:20:45.570Z] FineGrainedAutoResetIntegrationTest > shouldOnlyReadRecordsWhereEarliestSpecifiedWithInvalidCommittedOffsets() PASSED
[2022-09-01T00:20:45.570Z]
[2022-09-01T00:20:45.570Z] FineGrainedAutoResetIntegrationTest > shouldOnlyReadRecordsWhereEarliestSpecifiedWithNoCommittedOffsetsWithDefaultGlobalAutoOffsetResetEarliest() STARTED
[2022-09-01T00:21:27.069Z]
[2022-09-01T00:21:27.070Z] FineGrainedAutoResetIntegrationTest > shouldOnlyReadRecordsWhereEarliestSpecifiedWithNoCommittedOffsetsWithDefaultGlobalAutoOffsetResetEarliest() PASSED
[2022-09-01T00:21:27.070Z]
[2022-09-01T00:21:27.070Z] FineGrainedAutoResetIntegrationTest > shouldThrowStreamsExceptionNoResetSpecified() STARTED
[2022-09-01T00:21:27.070Z]
[2022-09-01T00:21:27.070Z] FineGrainedAutoResetIntegrationTest > shouldThrowStreamsExceptionNoResetSpecified() PASSED
[2022-09-01T00:21:27.070Z]
[2022-09-01T00:21:27.070Z] GlobalKTableIntegrationTest > shouldGetToRunningWithOnlyGlobalTopology() STARTED
[2022-09-01T00:21:28.005Z]
[2022-09-01T00:21:28.005Z] GlobalKTableIntegrationTest > shouldGetToRunningWithOnlyGlobalTopology() PASSED
[2022-09-01T00:21:28.005Z]
[2022-09-01T00:21:28.005Z] GlobalKTableIntegrationTest > shouldKStreamGlobalKTableLeftJoin() STARTED
[2022-09-01T00:21:29.758Z]
[2022-09-01T00:21:29.758Z] GlobalKTableIntegrationTest > shouldKStreamGlobalKTableLeftJoin() PASSED
[2022-09-01T00:21:29.758Z]
[2022-09-01T00:21:29.758Z] GlobalKTableIntegrationTest > shouldRestoreGlobalInMemoryKTableOnRestart() STARTED
[2022-09-01T00:21:31.515Z]
[2022-09-01T00:21:31.515Z] GlobalKTableIntegrationTest > shouldRestoreGlobalInMemoryKTableOnRestart() PASSED
[2022-09-01T00:21:31.515Z]
[2022-09-01T00:21:31.515Z] GlobalKTableIntegrationTest > shouldKStreamGlobalKTableJoin() STARTED
[2022-09-01T00:21:34.159Z]
[2022-09-01T00:21:34.159Z] GlobalKTableIntegrationTest > shouldKStreamGlobalKTableJoin() PASSED
[2022-09-01T00:21:35.102Z]
[2022-09-01T00:21:35.102Z] GlobalThreadShutDownOrderTest > shouldFinishGlobalStoreOperationOnShutDown() STARTED
[2022-09-01T00:21:40.888Z]
[2022-09-01T00:21:40.888Z] GlobalThreadShutDownOrderTest > shouldFinishGlobalStoreOperationOnShutDown() PASSED
[2022-09-01T00:21:41.930Z]
[2022-09-01T00:21:41.930Z] IQv2IntegrationTest > shouldFailStopped() STARTED
[2022-09-01T00:21:41.930Z]
[2022-09-01T00:21:41.930Z] IQv2IntegrationTest > shouldFailStopped() PASSED
[2022-09-01T00:21:41.930Z]
[2022-09-01T00:21:41.930Z] IQv2IntegrationTest > shouldNotRequireQueryHandler(TestInfo) STARTED
[2022-09-01T00:21:42.871Z]
[2022-09-01T00:21:42.871Z] IQv2IntegrationTest > shouldNotRequireQueryHandler(TestInfo) PASSED
[2022-09-01T00:21:42.871Z]
[2022-09-01T00:21:42.871Z] IQv2IntegrationTest > shouldFailNotStarted() STARTED
[2022-09-01T00:21:42.871Z]
[2022-09-01T00:21:42.871Z] IQv2IntegrationTest > shouldFailNotStarted() PASSED
[2022-09-01T00:21:42.871Z]
[2022-09-01T00:21:42.871Z] IQv2IntegrationTest > shouldFetchFromPartition() STARTED
[2022-09-01T00:21:43.813Z]
[2022-09-01T00:21:43.813Z] IQv2IntegrationTest > shouldFetchFromPartition() PASSED
[2022-09-01T00:21:43.813Z]
[2022-09-01T00:21:43.813Z] IQv2IntegrationTest > shouldFetchExplicitlyFromAllPartitions() STARTED
[2022-09-01T00:21:45.574Z]
[2022-09-01T00:21:45.575Z] IQv2IntegrationTest > shouldFetchExplicitlyFromAllPartitions() PASSED
[2022-09-01T00:21:45.575Z]
[2022-09-01T00:21:45.575Z] IQv2IntegrationTest > shouldFailUnknownStore() STARTED
[2022-09-01T00:21:45.575Z]
[2022-09-01T00:21:45.575Z] IQv2IntegrationTest > shouldFailUnknownStore() PASSED
[2022-09-01T00:21:45.575Z]
[2022-09-01T00:21:45.575Z] IQv2IntegrationTest > shouldRejectNonRunningActive() STARTED
[2022-09-01T00:21:47.338Z]
[2022-09-01T00:21:47.338Z] IQv2IntegrationTest > shouldRejectNonRunningActive() PASSED
[2022-09-01T00:21:49.101Z]
[2022-09-01T00:21:49.101Z] InternalTopicIntegrationTest > shouldCompactTopicsForKeyValueStoreChangelogs() STARTED
[2022-09-01T00:21:50.044Z]
[2022-09-01T00:21:50.044Z] InternalTopicIntegrationTest > shouldCompactTopicsForKeyValueStoreChangelogs() PASSED
[2022-09-01T00:21:50.044Z]
[2022-09-01T00:21:50.044Z] InternalTopicIntegrationTest > shouldGetToRunningWithWindowedTableInFKJ() STARTED
[2022-09-01T00:21:52.857Z]
[2022-09-01T00:21:52.857Z] InternalTopicIntegrationTest > shouldGetToRunningWithWindowedTableInFKJ() PASSED
[2022-09-01T00:21:52.857Z]
[2022-09-01T00:21:52.857Z] InternalTopicIntegrationTest > shouldCompactAndDeleteTopicsForWindowStoreChangelogs() STARTED
[2022-09-01T00:21:52.857Z]
[2022-09-01T00:21:52.857Z] InternalTopicIntegrationTest > shouldCompactAndDeleteTopicsForWindowStoreChangelogs() PASSED
[2022-09-01T00:21:54.534Z]
[2022-09-01T00:21:54.534Z] KStreamAggregationIntegrationTest > shouldAggregateSlidingWindows(TestInfo) STARTED
[2022-09-01T00:21:57.175Z]
[2022-09-01T00:21:57.175Z] KStreamAggregationIntegrationTest > shouldAggregateSlidingWindows(TestInfo) PASSED
[2022-09-01T00:21:57.175Z]
[2022-09-01T00:21:57.175Z] KStreamAggregationIntegrationTest > shouldReduceSessionWindows() STARTED
[2022-09-01T00:21:58.937Z]
[2022-09-01T00:21:58.937Z] KStreamAggregationIntegrationTest > shouldReduceSessionWindows() PASSED
[2022-09-01T00:21:58.937Z]
[2022-09-01T00:21:58.937Z] KStreamAggregationIntegrationTest > shouldReduceSlidingWindows(TestInfo) STARTED
[2022-09-01T00:22:01.580Z]
[2022-09-01T00:22:01.580Z] KStreamAggregationIntegrationTest > shouldReduceSlidingWindows(TestInfo) PASSED
[2022-09-01T00:22:01.580Z]
[2022-09-01T00:22:01.580Z] KStreamAggregationIntegrationTest > shouldReduce(TestInfo) STARTED
[2022-09-01T00:22:06.738Z]
[2022-09-01T00:22:06.738Z] KStreamAggregationIntegrationTest > shouldReduce(TestInfo) PASSED
[2022-09-01T00:22:06.738Z]
[2022-09-01T00:22:06.738Z] KStreamAggregationIntegrationTest > shouldAggregate(TestInfo) STARTED
[2022-09-01T00:22:10.376Z]
[2022-09-01T00:22:10.376Z] KStreamAggregationIntegrationTest > shouldAggregate(TestInfo) PASSED
[2022-09-01T00:22:10.376Z]
[2022-09-01T00:22:10.376Z] KStreamAggregationIntegrationTest > shouldCount(TestInfo) STARTED
[2022-09-01T00:22:13.972Z]
[2022-09-01T00:22:13.972Z] KStreamAggregationIntegrationTest > shouldCount(TestInfo) PASSED
[2022-09-01T00:22:13.972Z]
[2022-09-01T00:22:13.972Z] KStreamAggregationIntegrationTest > shouldGroupByKey(TestInfo) STARTED
[2022-09-01T00:22:17.568Z]
[2022-09-01T00:22:17.568Z] KStreamAggregationIntegrationTest > shouldGroupByKey(TestInfo) PASSED
[2022-09-01T00:22:17.568Z]
[2022-09-01T00:22:17.568Z] KStreamAggregationIntegrationTest > shouldCountWithInternalStore(TestInfo) STARTED
[2022-09-01T00:22:21.304Z]
[2022-09-01T00:22:21.304Z] KStreamAggregationIntegrationTest > shouldCountWithInternalStore(TestInfo) PASSED
[2022-09-01T00:22:21.304Z]
[2022-09-01T00:22:21.304Z] KStreamAggregationIntegrationTest > shouldCountUnlimitedWindows() STARTED
[2022-09-01T00:22:22.246Z]
[2022-09-01T00:22:22.246Z] KStreamAggregationIntegrationTest > shouldCountUnlimitedWindows() PASSED
[2022-09-01T00:22:22.246Z]
[2022-09-01T00:22:22.246Z] KStreamAggregationIntegrationTest > shouldReduceWindowed(TestInfo) STARTED
[2022-09-01T00:22:25.836Z]
[2022-09-01T00:22:25.836Z] KStreamAggregationIntegrationTest > shouldReduceWindowed(TestInfo) PASSED
[2022-09-01T00:22:25.836Z]
[2022-09-01T00:22:25.837Z] KStreamAggregationIntegrationTest > shouldCountSessionWindows() STARTED
[2022-09-01T00:22:27.597Z]
[2022-09-01T00:22:27.597Z] KStreamAggregationIntegrationTest > shouldCountSessionWindows() PASSED
[2022-09-01T00:22:27.597Z]
[2022-09-01T00:22:27.597Z] KStreamAggregationIntegrationTest > shouldAggregateWindowed(TestInfo) STARTED
[2022-09-01T00:22:31.192Z]
[2022-09-01T00:22:31.192Z] KStreamAggregationIntegrationTest > shouldAggregateWindowed(TestInfo) PASSED
[2022-09-01T00:22:36.960Z] streams-1: SMOKE-TEST-CLIENT-CLOSED
[2022-09-01T00:22:36.960Z] streams-3: SMOKE-TEST-CLIENT-CLOSED
[2022-09-01T00:22:36.960Z] streams-0: SMOKE-TEST-CLIENT-CLOSED
[2022-09-01T00:22:36.960Z] streams-2: SMOKE-TEST-CLIENT-CLOSED
[2022-09-01T00:22:36.960Z] streams-5: SMOKE-TEST-CLIENT-CLOSED
[2022-09-01T00:22:36.960Z] streams-4: SMOKE-TEST-CLIENT-CLOSED
[2022-09-01T00:22:36.960Z]
[2022-09-01T00:22:36.960Z] 643 tests completed, 1 failed
[2022-09-01T00:22:38.720Z] There were failing tests. See the report at: file:///home/jenkins/jenkins-agent/workspace/Kafka_kafka_trunk@2/streams/build/reports/tests/integrationTest/index.html
[2022-09-01T00:22:41.359Z]
[2022-09-01T00:22:41.359Z] FAILURE: Build failed with an exception.
[2022-09-01T00:22:41.359Z]
[2022-09-01T00:22:41.359Z] * What went wrong:
[2022-09-01T00:22:41.359Z] Execution failed for task ':core:unitTest'.
[2022-09-01T00:22:41.359Z] > Process 'Gradle Test Executor 127' finished with non-zero exit value 1
[2022-09-01T00:22:41.359Z] This problem might be caused by incorrect test process configuration.
[2022-09-01T00:22:41.359Z] Please refer to the test execution section in the User Manual at https://docs.gradle.org/7.5.1/userguide/java_testing.html#sec:test_execution
[2022-09-01T00:22:41.359Z]
[2022-09-01T00:22:41.360Z] * Try:
[2022-09-01T00:22:41.360Z] > Run with --stacktrace option to get the stack trace.
[2022-09-01T00:22:41.360Z] > Run with --info or --debug option to get more log output.
[2022-09-01T00:22:41.360Z] > Run with --scan to get full insights.
[2022-09-01T00:22:41.360Z]
[2022-09-01T00:22:41.360Z] * Get more help at https://help.gradle.org
[2022-09-01T00:22:41.360Z]
[2022-09-01T00:22:42.301Z] BUILD FAILED in 2h 35m 59s
[2022-09-01T00:22:42.301Z] 212 actionable tasks: 115 executed, 97 up-to-date
[2022-09-01T00:22:42.301Z]
[2022-09-01T00:22:42.301Z] See the profiling report at: file:///home/jenkins/jenkins-agent/workspace/Kafka_kafka_trunk@2/build/reports/profile/profile-2022-08-31-21-46-48.html
[2022-09-01T00:22:42.301Z] A fine-grained performance profile is available: use the --scan option.
[Pipeline] }
[Pipeline] // withEnv
[Pipeline] }
[Pipeline] // withEnv
[Pipeline] }
[Pipeline] // withEnv
[Pipeline] }
[Pipeline] // node
[Pipeline] }
[Pipeline] // timestamps
[Pipeline] }
[Pipeline] // timeout
[Pipeline] }
[Pipeline] // stage
[Pipeline] }
Failed in branch JDK 11 and Scala 2.12
[Pipeline] // parallel
[Pipeline] }
[Pipeline] // stage
[Pipeline] stage
[Pipeline] { (Declarative: Post Actions)
[Pipeline] node
Running on builds35 in /home/jenkins/workspace/Kafka_kafka_trunk
[Pipeline] {
[Pipeline] script
[Pipeline] {
[Pipeline] step
Build failed in Jenkins: Kafka » Kafka Branch Builder » trunk #1191
Posted by Apache Jenkins Server <je...@builds.apache.org>.
See <https://ci-builds.apache.org/job/Kafka/job/kafka/job/trunk/1191/display/redirect>
Changes:
------------------------------------------
[...truncated 420946 lines...]
[2022-08-31T21:29:13.718Z]
[2022-08-31T21:29:13.718Z] StreamsAssignmentScaleTest > testFallbackPriorTaskAssignorManyThreadsPerClient PASSED
[2022-08-31T21:29:13.718Z]
[2022-08-31T21:29:13.718Z] StreamsAssignmentScaleTest > testFallbackPriorTaskAssignorLargePartitionCount STARTED
[2022-08-31T21:29:40.842Z]
[2022-08-31T21:29:40.842Z] StreamsAssignmentScaleTest > testFallbackPriorTaskAssignorLargePartitionCount PASSED
[2022-08-31T21:29:40.842Z]
[2022-08-31T21:29:40.842Z] StreamsAssignmentScaleTest > testStickyTaskAssignorLargePartitionCount STARTED
[2022-08-31T21:30:08.845Z]
[2022-08-31T21:30:08.845Z] StreamsAssignmentScaleTest > testStickyTaskAssignorLargePartitionCount PASSED
[2022-08-31T21:30:08.845Z]
[2022-08-31T21:30:08.845Z] StreamsAssignmentScaleTest > testFallbackPriorTaskAssignorManyStandbys STARTED
[2022-08-31T21:30:12.557Z]
[2022-08-31T21:30:12.557Z] StreamsAssignmentScaleTest > testFallbackPriorTaskAssignorManyStandbys PASSED
[2022-08-31T21:30:12.557Z]
[2022-08-31T21:30:12.557Z] StreamsAssignmentScaleTest > testHighAvailabilityTaskAssignorManyStandbys STARTED
[2022-08-31T21:30:39.630Z]
[2022-08-31T21:30:39.630Z] StreamsAssignmentScaleTest > testHighAvailabilityTaskAssignorManyStandbys PASSED
[2022-08-31T21:30:39.630Z]
[2022-08-31T21:30:39.630Z] StreamsAssignmentScaleTest > testFallbackPriorTaskAssignorLargeNumConsumers STARTED
[2022-08-31T21:30:40.644Z]
[2022-08-31T21:30:40.644Z] StreamsAssignmentScaleTest > testFallbackPriorTaskAssignorLargeNumConsumers PASSED
[2022-08-31T21:30:40.644Z]
[2022-08-31T21:30:40.644Z] StreamsAssignmentScaleTest > testStickyTaskAssignorLargeNumConsumers STARTED
[2022-08-31T21:30:42.669Z]
[2022-08-31T21:30:42.669Z] StreamsAssignmentScaleTest > testStickyTaskAssignorLargeNumConsumers PASSED
[2022-08-31T21:30:42.669Z]
[2022-08-31T21:30:42.669Z] AdjustStreamThreadCountTest > testConcurrentlyAccessThreads() STARTED
[2022-08-31T21:30:45.876Z]
[2022-08-31T21:30:45.876Z] AdjustStreamThreadCountTest > testConcurrentlyAccessThreads() PASSED
[2022-08-31T21:30:45.876Z]
[2022-08-31T21:30:45.876Z] AdjustStreamThreadCountTest > shouldResizeCacheAfterThreadReplacement() STARTED
[2022-08-31T21:30:50.098Z]
[2022-08-31T21:30:50.098Z] AdjustStreamThreadCountTest > shouldResizeCacheAfterThreadReplacement() PASSED
[2022-08-31T21:30:50.098Z]
[2022-08-31T21:30:50.098Z] AdjustStreamThreadCountTest > shouldAddAndRemoveThreadsMultipleTimes() STARTED
[2022-08-31T21:31:02.269Z]
[2022-08-31T21:31:02.269Z] AdjustStreamThreadCountTest > shouldAddAndRemoveThreadsMultipleTimes() PASSED
[2022-08-31T21:31:02.269Z]
[2022-08-31T21:31:02.269Z] AdjustStreamThreadCountTest > shouldnNotRemoveStreamThreadWithinTimeout() STARTED
[2022-08-31T21:31:04.220Z]
[2022-08-31T21:31:04.220Z] AdjustStreamThreadCountTest > shouldnNotRemoveStreamThreadWithinTimeout() PASSED
[2022-08-31T21:31:04.220Z]
[2022-08-31T21:31:04.220Z] AdjustStreamThreadCountTest > shouldAddAndRemoveStreamThreadsWhileKeepingNamesCorrect() STARTED
[2022-08-31T21:31:26.417Z]
[2022-08-31T21:31:26.417Z] AdjustStreamThreadCountTest > shouldAddAndRemoveStreamThreadsWhileKeepingNamesCorrect() PASSED
[2022-08-31T21:31:26.417Z]
[2022-08-31T21:31:26.417Z] AdjustStreamThreadCountTest > shouldAddStreamThread() STARTED
[2022-08-31T21:31:28.466Z]
[2022-08-31T21:31:28.466Z] AdjustStreamThreadCountTest > shouldAddStreamThread() PASSED
[2022-08-31T21:31:28.466Z]
[2022-08-31T21:31:28.466Z] AdjustStreamThreadCountTest > shouldRemoveStreamThreadWithStaticMembership() STARTED
[2022-08-31T21:31:32.555Z]
[2022-08-31T21:31:32.555Z] AdjustStreamThreadCountTest > shouldRemoveStreamThreadWithStaticMembership() PASSED
[2022-08-31T21:31:32.555Z]
[2022-08-31T21:31:32.555Z] AdjustStreamThreadCountTest > shouldRemoveStreamThread() STARTED
[2022-08-31T21:31:37.032Z]
[2022-08-31T21:31:37.032Z] AdjustStreamThreadCountTest > shouldRemoveStreamThread() PASSED
[2022-08-31T21:31:37.032Z]
[2022-08-31T21:31:37.032Z] AdjustStreamThreadCountTest > shouldResizeCacheAfterThreadRemovalTimesOut() STARTED
[2022-08-31T21:31:40.038Z]
[2022-08-31T21:31:40.038Z] AdjustStreamThreadCountTest > shouldResizeCacheAfterThreadRemovalTimesOut() PASSED
[2022-08-31T21:31:50.109Z]
[2022-08-31T21:31:50.110Z] FineGrainedAutoResetIntegrationTest > shouldOnlyReadRecordsWhereEarliestSpecifiedWithNoCommittedOffsetsWithGlobalAutoOffsetResetLatest() STARTED
[2022-08-31T21:31:50.110Z]
[2022-08-31T21:31:50.110Z] FineGrainedAutoResetIntegrationTest > shouldOnlyReadRecordsWhereEarliestSpecifiedWithNoCommittedOffsetsWithGlobalAutoOffsetResetLatest() PASSED
[2022-08-31T21:31:50.110Z]
[2022-08-31T21:31:50.110Z] FineGrainedAutoResetIntegrationTest > shouldThrowExceptionOverlappingPattern() STARTED
[2022-08-31T21:31:50.110Z]
[2022-08-31T21:31:50.110Z] FineGrainedAutoResetIntegrationTest > shouldThrowExceptionOverlappingPattern() PASSED
[2022-08-31T21:31:50.110Z]
[2022-08-31T21:31:50.110Z] FineGrainedAutoResetIntegrationTest > shouldThrowExceptionOverlappingTopic() STARTED
[2022-08-31T21:31:50.110Z]
[2022-08-31T21:31:50.110Z] FineGrainedAutoResetIntegrationTest > shouldThrowExceptionOverlappingTopic() PASSED
[2022-08-31T21:31:50.110Z]
[2022-08-31T21:31:50.110Z] FineGrainedAutoResetIntegrationTest > shouldOnlyReadRecordsWhereEarliestSpecifiedWithInvalidCommittedOffsets() STARTED
[2022-08-31T21:32:38.886Z]
[2022-08-31T21:32:38.886Z] FineGrainedAutoResetIntegrationTest > shouldOnlyReadRecordsWhereEarliestSpecifiedWithInvalidCommittedOffsets() PASSED
[2022-08-31T21:32:38.886Z]
[2022-08-31T21:32:38.886Z] FineGrainedAutoResetIntegrationTest > shouldOnlyReadRecordsWhereEarliestSpecifiedWithNoCommittedOffsetsWithDefaultGlobalAutoOffsetResetEarliest() STARTED
[2022-08-31T21:33:20.383Z]
[2022-08-31T21:33:20.383Z] FineGrainedAutoResetIntegrationTest > shouldOnlyReadRecordsWhereEarliestSpecifiedWithNoCommittedOffsetsWithDefaultGlobalAutoOffsetResetEarliest() PASSED
[2022-08-31T21:33:20.383Z]
[2022-08-31T21:33:20.383Z] FineGrainedAutoResetIntegrationTest > shouldThrowStreamsExceptionNoResetSpecified() STARTED
[2022-08-31T21:33:20.383Z]
[2022-08-31T21:33:20.383Z] FineGrainedAutoResetIntegrationTest > shouldThrowStreamsExceptionNoResetSpecified() PASSED
[2022-08-31T21:33:22.129Z]
[2022-08-31T21:33:22.129Z] GlobalKTableIntegrationTest > shouldGetToRunningWithOnlyGlobalTopology() STARTED
[2022-08-31T21:33:23.064Z]
[2022-08-31T21:33:23.064Z] GlobalKTableIntegrationTest > shouldGetToRunningWithOnlyGlobalTopology() PASSED
[2022-08-31T21:33:23.064Z]
[2022-08-31T21:33:23.064Z] GlobalKTableIntegrationTest > shouldKStreamGlobalKTableLeftJoin() STARTED
[2022-08-31T21:33:24.813Z]
[2022-08-31T21:33:24.813Z] GlobalKTableIntegrationTest > shouldKStreamGlobalKTableLeftJoin() PASSED
[2022-08-31T21:33:24.813Z]
[2022-08-31T21:33:24.813Z] GlobalKTableIntegrationTest > shouldRestoreGlobalInMemoryKTableOnRestart() STARTED
[2022-08-31T21:33:25.747Z]
[2022-08-31T21:33:25.747Z] GlobalKTableIntegrationTest > shouldRestoreGlobalInMemoryKTableOnRestart() PASSED
[2022-08-31T21:33:25.747Z]
[2022-08-31T21:33:25.747Z] GlobalKTableIntegrationTest > shouldKStreamGlobalKTableJoin() STARTED
[2022-08-31T21:33:28.372Z]
[2022-08-31T21:33:28.372Z] GlobalKTableIntegrationTest > shouldKStreamGlobalKTableJoin() PASSED
[2022-08-31T21:33:29.307Z]
[2022-08-31T21:33:29.307Z] GlobalThreadShutDownOrderTest > shouldFinishGlobalStoreOperationOnShutDown() STARTED
[2022-08-31T21:33:35.049Z]
[2022-08-31T21:33:35.049Z] GlobalThreadShutDownOrderTest > shouldFinishGlobalStoreOperationOnShutDown() PASSED
[2022-08-31T21:33:35.983Z]
[2022-08-31T21:33:35.983Z] IQv2IntegrationTest > shouldFailStopped() STARTED
[2022-08-31T21:33:35.983Z]
[2022-08-31T21:33:35.984Z] IQv2IntegrationTest > shouldFailStopped() PASSED
[2022-08-31T21:33:35.984Z]
[2022-08-31T21:33:35.984Z] IQv2IntegrationTest > shouldNotRequireQueryHandler(TestInfo) STARTED
[2022-08-31T21:33:36.918Z]
[2022-08-31T21:33:36.918Z] IQv2IntegrationTest > shouldNotRequireQueryHandler(TestInfo) PASSED
[2022-08-31T21:33:36.918Z]
[2022-08-31T21:33:36.918Z] IQv2IntegrationTest > shouldFailNotStarted() STARTED
[2022-08-31T21:33:36.918Z]
[2022-08-31T21:33:36.918Z] IQv2IntegrationTest > shouldFailNotStarted() PASSED
[2022-08-31T21:33:36.918Z]
[2022-08-31T21:33:36.918Z] IQv2IntegrationTest > shouldFetchFromPartition() STARTED
[2022-08-31T21:33:37.853Z]
[2022-08-31T21:33:37.853Z] IQv2IntegrationTest > shouldFetchFromPartition() PASSED
[2022-08-31T21:33:37.853Z]
[2022-08-31T21:33:37.853Z] IQv2IntegrationTest > shouldFetchExplicitlyFromAllPartitions() STARTED
[2022-08-31T21:33:39.604Z]
[2022-08-31T21:33:39.604Z] IQv2IntegrationTest > shouldFetchExplicitlyFromAllPartitions() PASSED
[2022-08-31T21:33:39.604Z]
[2022-08-31T21:33:39.604Z] IQv2IntegrationTest > shouldFailUnknownStore() STARTED
[2022-08-31T21:33:39.604Z]
[2022-08-31T21:33:39.604Z] IQv2IntegrationTest > shouldFailUnknownStore() PASSED
[2022-08-31T21:33:39.604Z]
[2022-08-31T21:33:39.604Z] IQv2IntegrationTest > shouldRejectNonRunningActive() STARTED
[2022-08-31T21:33:41.353Z]
[2022-08-31T21:33:41.353Z] IQv2IntegrationTest > shouldRejectNonRunningActive() PASSED
[2022-08-31T21:33:42.288Z]
[2022-08-31T21:33:42.288Z] InternalTopicIntegrationTest > shouldCompactTopicsForKeyValueStoreChangelogs() STARTED
[2022-08-31T21:33:44.038Z]
[2022-08-31T21:33:44.039Z] InternalTopicIntegrationTest > shouldCompactTopicsForKeyValueStoreChangelogs() PASSED
[2022-08-31T21:33:44.039Z]
[2022-08-31T21:33:44.039Z] InternalTopicIntegrationTest > shouldGetToRunningWithWindowedTableInFKJ() STARTED
[2022-08-31T21:33:45.788Z]
[2022-08-31T21:33:45.788Z] InternalTopicIntegrationTest > shouldGetToRunningWithWindowedTableInFKJ() PASSED
[2022-08-31T21:33:45.788Z]
[2022-08-31T21:33:45.788Z] InternalTopicIntegrationTest > shouldCompactAndDeleteTopicsForWindowStoreChangelogs() STARTED
[2022-08-31T21:33:46.723Z]
[2022-08-31T21:33:46.723Z] InternalTopicIntegrationTest > shouldCompactAndDeleteTopicsForWindowStoreChangelogs() PASSED
[2022-08-31T21:33:48.096Z]
[2022-08-31T21:33:48.096Z] KStreamAggregationIntegrationTest > shouldAggregateSlidingWindows(TestInfo) STARTED
[2022-08-31T21:33:50.719Z]
[2022-08-31T21:33:50.719Z] KStreamAggregationIntegrationTest > shouldAggregateSlidingWindows(TestInfo) PASSED
[2022-08-31T21:33:50.719Z]
[2022-08-31T21:33:50.719Z] KStreamAggregationIntegrationTest > shouldReduceSessionWindows() STARTED
[2022-08-31T21:33:52.468Z]
[2022-08-31T21:33:52.468Z] KStreamAggregationIntegrationTest > shouldReduceSessionWindows() PASSED
[2022-08-31T21:33:52.468Z]
[2022-08-31T21:33:52.468Z] KStreamAggregationIntegrationTest > shouldReduceSlidingWindows(TestInfo) STARTED
[2022-08-31T21:33:55.092Z]
[2022-08-31T21:33:55.092Z] KStreamAggregationIntegrationTest > shouldReduceSlidingWindows(TestInfo) PASSED
[2022-08-31T21:33:55.092Z]
[2022-08-31T21:33:55.092Z] KStreamAggregationIntegrationTest > shouldReduce(TestInfo) STARTED
[2022-08-31T21:33:58.832Z]
[2022-08-31T21:33:58.832Z] KStreamAggregationIntegrationTest > shouldReduce(TestInfo) PASSED
[2022-08-31T21:33:58.832Z]
[2022-08-31T21:33:58.832Z] KStreamAggregationIntegrationTest > shouldAggregate(TestInfo) STARTED
[2022-08-31T21:34:01.455Z]
[2022-08-31T21:34:01.455Z] KStreamAggregationIntegrationTest > shouldAggregate(TestInfo) PASSED
[2022-08-31T21:34:01.455Z]
[2022-08-31T21:34:01.455Z] KStreamAggregationIntegrationTest > shouldCount(TestInfo) STARTED
[2022-08-31T21:34:05.024Z]
[2022-08-31T21:34:05.024Z] KStreamAggregationIntegrationTest > shouldCount(TestInfo) PASSED
[2022-08-31T21:34:05.024Z]
[2022-08-31T21:34:05.024Z] KStreamAggregationIntegrationTest > shouldGroupByKey(TestInfo) STARTED
[2022-08-31T21:34:08.419Z]
[2022-08-31T21:34:08.419Z] KStreamAggregationIntegrationTest > shouldGroupByKey(TestInfo) PASSED
[2022-08-31T21:34:08.419Z]
[2022-08-31T21:34:08.419Z] KStreamAggregationIntegrationTest > shouldCountWithInternalStore(TestInfo) STARTED
[2022-08-31T21:34:11.890Z]
[2022-08-31T21:34:11.890Z] KStreamAggregationIntegrationTest > shouldCountWithInternalStore(TestInfo) PASSED
[2022-08-31T21:34:11.890Z]
[2022-08-31T21:34:11.890Z] KStreamAggregationIntegrationTest > shouldCountUnlimitedWindows() STARTED
[2022-08-31T21:34:13.085Z]
[2022-08-31T21:34:13.085Z] KStreamAggregationIntegrationTest > shouldCountUnlimitedWindows() PASSED
[2022-08-31T21:34:13.085Z]
[2022-08-31T21:34:13.085Z] KStreamAggregationIntegrationTest > shouldReduceWindowed(TestInfo) STARTED
[2022-08-31T21:34:16.507Z]
[2022-08-31T21:34:16.507Z] KStreamAggregationIntegrationTest > shouldReduceWindowed(TestInfo) PASSED
[2022-08-31T21:34:16.507Z]
[2022-08-31T21:34:16.507Z] KStreamAggregationIntegrationTest > shouldCountSessionWindows() STARTED
[2022-08-31T21:34:17.699Z]
[2022-08-31T21:34:17.700Z] KStreamAggregationIntegrationTest > shouldCountSessionWindows() PASSED
[2022-08-31T21:34:17.700Z]
[2022-08-31T21:34:17.700Z] KStreamAggregationIntegrationTest > shouldAggregateWindowed(TestInfo) STARTED
[2022-08-31T21:34:20.098Z]
[2022-08-31T21:34:20.098Z] KStreamAggregationIntegrationTest > shouldAggregateWindowed(TestInfo) PASSED
[2022-08-31T21:34:26.155Z] streams-6: SMOKE-TEST-CLIENT-CLOSED
[2022-08-31T21:34:26.155Z] streams-1: SMOKE-TEST-CLIENT-CLOSED
[2022-08-31T21:34:26.155Z] streams-0: SMOKE-TEST-CLIENT-CLOSED
[2022-08-31T21:34:26.155Z] streams-3: SMOKE-TEST-CLIENT-CLOSED
[2022-08-31T21:34:26.155Z] streams-5: SMOKE-TEST-CLIENT-CLOSED
[2022-08-31T21:34:26.155Z] streams-4: SMOKE-TEST-CLIENT-CLOSED
[2022-08-31T21:34:26.155Z] streams-2: SMOKE-TEST-CLIENT-CLOSED
[2022-08-31T21:34:31.277Z]
[2022-08-31T21:34:31.277Z] FAILURE: Build failed with an exception.
[2022-08-31T21:34:31.277Z]
[2022-08-31T21:34:31.277Z] * What went wrong:
[2022-08-31T21:34:31.277Z] Execution failed for task ':core:unitTest'.
[2022-08-31T21:34:31.277Z] > Process 'Gradle Test Executor 88' finished with non-zero exit value 1
[2022-08-31T21:34:31.277Z] This problem might be caused by incorrect test process configuration.
[2022-08-31T21:34:31.277Z] Please refer to the test execution section in the User Manual at https://docs.gradle.org/7.5.1/userguide/java_testing.html#sec:test_execution
[2022-08-31T21:34:31.277Z]
[2022-08-31T21:34:31.277Z] * Try:
[2022-08-31T21:34:31.277Z] > Run with --stacktrace option to get the stack trace.
[2022-08-31T21:34:31.277Z] > Run with --info or --debug option to get more log output.
[2022-08-31T21:34:31.277Z] > Run with --scan to get full insights.
[2022-08-31T21:34:31.278Z]
[2022-08-31T21:34:31.278Z] * Get more help at https://help.gradle.org
[2022-08-31T21:34:31.278Z]
[2022-08-31T21:34:31.278Z] BUILD FAILED in 2h 32m 7s
[2022-08-31T21:34:31.278Z] 212 actionable tasks: 115 executed, 97 up-to-date
[2022-08-31T21:34:31.278Z]
[2022-08-31T21:34:31.278Z] See the profiling report at: file:///home/jenkins/h49-shared/712657a4/workspace/Kafka_kafka_trunk/build/reports/profile/profile-2022-08-31-19-02-43.html
[2022-08-31T21:34:31.278Z] A fine-grained performance profile is available: use the --scan option.
[Pipeline] }
[Pipeline] // withEnv
[Pipeline] }
[Pipeline] // withEnv
[Pipeline] }
[Pipeline] // withEnv
[Pipeline] }
[Pipeline] // node
[Pipeline] }
[Pipeline] // timestamps
[Pipeline] }
[Pipeline] // timeout
[Pipeline] }
[Pipeline] // stage
[Pipeline] }
Failed in branch JDK 11 and Scala 2.13
[Pipeline] // parallel
[Pipeline] }
[Pipeline] // stage
[Pipeline] stage
[Pipeline] { (Declarative: Post Actions)
[Pipeline] node
Running on builds35 in /home/jenkins/workspace/Kafka_kafka_trunk
[Pipeline] {
[Pipeline] script
[Pipeline] {
[Pipeline] step
Jenkins build is unstable: Kafka » Kafka Branch Builder » trunk #1190
Posted by Apache Jenkins Server <je...@builds.apache.org>.
See <https://ci-builds.apache.org/job/Kafka/job/kafka/job/trunk/1190/display/redirect>
Build failed in Jenkins: Kafka » Kafka Branch Builder » trunk #1189
Posted by Apache Jenkins Server <je...@builds.apache.org>.
See <https://ci-builds.apache.org/job/Kafka/job/kafka/job/trunk/1189/display/redirect>
Changes:
------------------------------------------
[...truncated 505021 lines...]
[2022-08-31T02:29:51.040Z]
[2022-08-31T02:29:51.040Z] StreamsAssignmentScaleTest > testHighAvailabilityTaskAssignorManyThreadsPerClient PASSED
[2022-08-31T02:29:51.040Z]
[2022-08-31T02:29:51.040Z] StreamsAssignmentScaleTest > testStickyTaskAssignorManyStandbys STARTED
[2022-08-31T02:29:57.201Z]
[2022-08-31T02:29:57.201Z] StreamsAssignmentScaleTest > testStickyTaskAssignorManyStandbys PASSED
[2022-08-31T02:29:57.201Z]
[2022-08-31T02:29:57.201Z] StreamsAssignmentScaleTest > testStickyTaskAssignorManyThreadsPerClient STARTED
[2022-08-31T02:29:57.201Z]
[2022-08-31T02:29:57.201Z] StreamsAssignmentScaleTest > testStickyTaskAssignorManyThreadsPerClient PASSED
[2022-08-31T02:29:57.201Z]
[2022-08-31T02:29:57.201Z] StreamsAssignmentScaleTest > testFallbackPriorTaskAssignorManyThreadsPerClient STARTED
[2022-08-31T02:29:58.122Z]
[2022-08-31T02:29:58.122Z] StreamsAssignmentScaleTest > testFallbackPriorTaskAssignorManyThreadsPerClient PASSED
[2022-08-31T02:29:58.122Z]
[2022-08-31T02:29:58.123Z] StreamsAssignmentScaleTest > testFallbackPriorTaskAssignorLargePartitionCount STARTED
[2022-08-31T02:30:22.804Z]
[2022-08-31T02:30:22.804Z] StreamsAssignmentScaleTest > testFallbackPriorTaskAssignorLargePartitionCount PASSED
[2022-08-31T02:30:22.804Z]
[2022-08-31T02:30:22.804Z] StreamsAssignmentScaleTest > testStickyTaskAssignorLargePartitionCount STARTED
[2022-08-31T02:30:45.600Z]
[2022-08-31T02:30:45.600Z] StreamsAssignmentScaleTest > testStickyTaskAssignorLargePartitionCount PASSED
[2022-08-31T02:30:45.600Z]
[2022-08-31T02:30:45.600Z] StreamsAssignmentScaleTest > testFallbackPriorTaskAssignorManyStandbys STARTED
[2022-08-31T02:30:53.335Z]
[2022-08-31T02:30:53.335Z] StreamsAssignmentScaleTest > testFallbackPriorTaskAssignorManyStandbys PASSED
[2022-08-31T02:30:53.335Z]
[2022-08-31T02:30:53.335Z] StreamsAssignmentScaleTest > testHighAvailabilityTaskAssignorManyStandbys STARTED
[2022-08-31T02:31:13.246Z]
[2022-08-31T02:31:13.246Z] StreamsAssignmentScaleTest > testHighAvailabilityTaskAssignorManyStandbys PASSED
[2022-08-31T02:31:13.246Z]
[2022-08-31T02:31:13.246Z] StreamsAssignmentScaleTest > testFallbackPriorTaskAssignorLargeNumConsumers STARTED
[2022-08-31T02:31:14.168Z]
[2022-08-31T02:31:14.168Z] StreamsAssignmentScaleTest > testFallbackPriorTaskAssignorLargeNumConsumers PASSED
[2022-08-31T02:31:14.168Z]
[2022-08-31T02:31:14.168Z] StreamsAssignmentScaleTest > testStickyTaskAssignorLargeNumConsumers STARTED
[2022-08-31T02:31:16.177Z]
[2022-08-31T02:31:16.177Z] StreamsAssignmentScaleTest > testStickyTaskAssignorLargeNumConsumers PASSED
[2022-08-31T02:31:16.177Z]
[2022-08-31T02:31:16.177Z] AdjustStreamThreadCountTest > testConcurrentlyAccessThreads() STARTED
[2022-08-31T02:31:18.489Z]
[2022-08-31T02:31:18.489Z] AdjustStreamThreadCountTest > testConcurrentlyAccessThreads() PASSED
[2022-08-31T02:31:18.489Z]
[2022-08-31T02:31:18.489Z] AdjustStreamThreadCountTest > shouldResizeCacheAfterThreadReplacement() STARTED
[2022-08-31T02:31:25.975Z]
[2022-08-31T02:31:25.975Z] AdjustStreamThreadCountTest > shouldResizeCacheAfterThreadReplacement() PASSED
[2022-08-31T02:31:25.975Z]
[2022-08-31T02:31:25.975Z] AdjustStreamThreadCountTest > shouldAddAndRemoveThreadsMultipleTimes() STARTED
[2022-08-31T02:31:31.312Z]
[2022-08-31T02:31:31.312Z] AdjustStreamThreadCountTest > shouldAddAndRemoveThreadsMultipleTimes() PASSED
[2022-08-31T02:31:31.312Z]
[2022-08-31T02:31:31.312Z] AdjustStreamThreadCountTest > shouldnNotRemoveStreamThreadWithinTimeout() STARTED
[2022-08-31T02:31:32.227Z]
[2022-08-31T02:31:32.227Z] AdjustStreamThreadCountTest > shouldnNotRemoveStreamThreadWithinTimeout() PASSED
[2022-08-31T02:31:32.227Z]
[2022-08-31T02:31:32.227Z] AdjustStreamThreadCountTest > shouldAddAndRemoveStreamThreadsWhileKeepingNamesCorrect() STARTED
[2022-08-31T02:31:52.517Z]
[2022-08-31T02:31:52.517Z] AdjustStreamThreadCountTest > shouldAddAndRemoveStreamThreadsWhileKeepingNamesCorrect() PASSED
[2022-08-31T02:31:52.517Z]
[2022-08-31T02:31:52.517Z] AdjustStreamThreadCountTest > shouldAddStreamThread() STARTED
[2022-08-31T02:31:56.604Z]
[2022-08-31T02:31:56.604Z] AdjustStreamThreadCountTest > shouldAddStreamThread() PASSED
[2022-08-31T02:31:56.604Z]
[2022-08-31T02:31:56.604Z] AdjustStreamThreadCountTest > shouldRemoveStreamThreadWithStaticMembership() STARTED
[2022-08-31T02:32:00.896Z]
[2022-08-31T02:32:00.896Z] AdjustStreamThreadCountTest > shouldRemoveStreamThreadWithStaticMembership() PASSED
[2022-08-31T02:32:00.896Z]
[2022-08-31T02:32:00.896Z] AdjustStreamThreadCountTest > shouldRemoveStreamThread() STARTED
[2022-08-31T02:32:04.924Z]
[2022-08-31T02:32:04.924Z] AdjustStreamThreadCountTest > shouldRemoveStreamThread() PASSED
[2022-08-31T02:32:04.924Z]
[2022-08-31T02:32:04.924Z] AdjustStreamThreadCountTest > shouldResizeCacheAfterThreadRemovalTimesOut() STARTED
[2022-08-31T02:32:06.061Z]
[2022-08-31T02:32:06.061Z] AdjustStreamThreadCountTest > shouldResizeCacheAfterThreadRemovalTimesOut() PASSED
[2022-08-31T02:32:08.388Z]
[2022-08-31T02:32:08.388Z] FineGrainedAutoResetIntegrationTest > shouldOnlyReadRecordsWhereEarliestSpecifiedWithNoCommittedOffsetsWithGlobalAutoOffsetResetLatest() STARTED
[2022-08-31T02:32:09.385Z]
[2022-08-31T02:32:09.385Z] FineGrainedAutoResetIntegrationTest > shouldOnlyReadRecordsWhereEarliestSpecifiedWithNoCommittedOffsetsWithGlobalAutoOffsetResetLatest() PASSED
[2022-08-31T02:32:09.385Z]
[2022-08-31T02:32:09.385Z] FineGrainedAutoResetIntegrationTest > shouldThrowExceptionOverlappingPattern() STARTED
[2022-08-31T02:32:09.385Z]
[2022-08-31T02:32:09.385Z] FineGrainedAutoResetIntegrationTest > shouldThrowExceptionOverlappingPattern() PASSED
[2022-08-31T02:32:09.385Z]
[2022-08-31T02:32:09.385Z] FineGrainedAutoResetIntegrationTest > shouldThrowExceptionOverlappingTopic() STARTED
[2022-08-31T02:32:09.385Z]
[2022-08-31T02:32:09.385Z] FineGrainedAutoResetIntegrationTest > shouldThrowExceptionOverlappingTopic() PASSED
[2022-08-31T02:32:09.385Z]
[2022-08-31T02:32:09.385Z] FineGrainedAutoResetIntegrationTest > shouldOnlyReadRecordsWhereEarliestSpecifiedWithInvalidCommittedOffsets() STARTED
[2022-08-31T02:32:54.488Z]
[2022-08-31T02:32:54.488Z] FineGrainedAutoResetIntegrationTest > shouldOnlyReadRecordsWhereEarliestSpecifiedWithInvalidCommittedOffsets() PASSED
[2022-08-31T02:32:54.488Z]
[2022-08-31T02:32:54.488Z] FineGrainedAutoResetIntegrationTest > shouldOnlyReadRecordsWhereEarliestSpecifiedWithNoCommittedOffsetsWithDefaultGlobalAutoOffsetResetEarliest() STARTED
[2022-08-31T02:33:44.429Z]
[2022-08-31T02:33:44.429Z] FineGrainedAutoResetIntegrationTest > shouldOnlyReadRecordsWhereEarliestSpecifiedWithNoCommittedOffsetsWithDefaultGlobalAutoOffsetResetEarliest() PASSED
[2022-08-31T02:33:44.429Z]
[2022-08-31T02:33:44.429Z] FineGrainedAutoResetIntegrationTest > shouldThrowStreamsExceptionNoResetSpecified() STARTED
[2022-08-31T02:33:44.429Z]
[2022-08-31T02:33:44.429Z] FineGrainedAutoResetIntegrationTest > shouldThrowStreamsExceptionNoResetSpecified() PASSED
[2022-08-31T02:33:44.429Z]
[2022-08-31T02:33:44.429Z] GlobalKTableIntegrationTest > shouldGetToRunningWithOnlyGlobalTopology() STARTED
[2022-08-31T02:33:44.429Z]
[2022-08-31T02:33:44.429Z] GlobalKTableIntegrationTest > shouldGetToRunningWithOnlyGlobalTopology() PASSED
[2022-08-31T02:33:44.429Z]
[2022-08-31T02:33:44.429Z] GlobalKTableIntegrationTest > shouldKStreamGlobalKTableLeftJoin() STARTED
[2022-08-31T02:33:44.429Z]
[2022-08-31T02:33:44.429Z] GlobalKTableIntegrationTest > shouldKStreamGlobalKTableLeftJoin() PASSED
[2022-08-31T02:33:44.429Z]
[2022-08-31T02:33:44.429Z] GlobalKTableIntegrationTest > shouldRestoreGlobalInMemoryKTableOnRestart() STARTED
[2022-08-31T02:33:45.438Z]
[2022-08-31T02:33:45.438Z] GlobalKTableIntegrationTest > shouldRestoreGlobalInMemoryKTableOnRestart() PASSED
[2022-08-31T02:33:45.438Z]
[2022-08-31T02:33:45.438Z] GlobalKTableIntegrationTest > shouldKStreamGlobalKTableJoin() STARTED
[2022-08-31T02:33:47.495Z]
[2022-08-31T02:33:47.495Z] GlobalKTableIntegrationTest > shouldKStreamGlobalKTableJoin() PASSED
[2022-08-31T02:33:48.504Z]
[2022-08-31T02:33:48.504Z] GlobalThreadShutDownOrderTest > shouldFinishGlobalStoreOperationOnShutDown() STARTED
[2022-08-31T02:33:54.707Z]
[2022-08-31T02:33:54.707Z] GlobalThreadShutDownOrderTest > shouldFinishGlobalStoreOperationOnShutDown() PASSED
[2022-08-31T02:33:55.632Z]
[2022-08-31T02:33:55.632Z] IQv2IntegrationTest > shouldFailStopped() STARTED
[2022-08-31T02:33:55.632Z]
[2022-08-31T02:33:55.632Z] IQv2IntegrationTest > shouldFailStopped() PASSED
[2022-08-31T02:33:55.632Z]
[2022-08-31T02:33:55.632Z] IQv2IntegrationTest > shouldNotRequireQueryHandler(TestInfo) STARTED
[2022-08-31T02:33:56.765Z]
[2022-08-31T02:33:56.765Z] IQv2IntegrationTest > shouldNotRequireQueryHandler(TestInfo) PASSED
[2022-08-31T02:33:56.765Z]
[2022-08-31T02:33:56.765Z] IQv2IntegrationTest > shouldFailNotStarted() STARTED
[2022-08-31T02:33:56.765Z]
[2022-08-31T02:33:56.765Z] IQv2IntegrationTest > shouldFailNotStarted() PASSED
[2022-08-31T02:33:56.765Z]
[2022-08-31T02:33:56.765Z] IQv2IntegrationTest > shouldFetchFromPartition() STARTED
[2022-08-31T02:33:57.689Z]
[2022-08-31T02:33:57.689Z] IQv2IntegrationTest > shouldFetchFromPartition() PASSED
[2022-08-31T02:33:57.689Z]
[2022-08-31T02:33:57.689Z] IQv2IntegrationTest > shouldFetchExplicitlyFromAllPartitions() STARTED
[2022-08-31T02:33:58.780Z]
[2022-08-31T02:33:58.780Z] IQv2IntegrationTest > shouldFetchExplicitlyFromAllPartitions() PASSED
[2022-08-31T02:33:58.780Z]
[2022-08-31T02:33:58.780Z] IQv2IntegrationTest > shouldFailUnknownStore() STARTED
[2022-08-31T02:33:59.995Z]
[2022-08-31T02:33:59.995Z] IQv2IntegrationTest > shouldFailUnknownStore() PASSED
[2022-08-31T02:33:59.995Z]
[2022-08-31T02:33:59.995Z] IQv2IntegrationTest > shouldRejectNonRunningActive() STARTED
[2022-08-31T02:34:00.919Z]
[2022-08-31T02:34:00.919Z] IQv2IntegrationTest > shouldRejectNonRunningActive() PASSED
[2022-08-31T02:34:01.844Z]
[2022-08-31T02:34:01.844Z] InternalTopicIntegrationTest > shouldCompactTopicsForKeyValueStoreChangelogs() STARTED
[2022-08-31T02:34:03.908Z]
[2022-08-31T02:34:03.908Z] InternalTopicIntegrationTest > shouldCompactTopicsForKeyValueStoreChangelogs() PASSED
[2022-08-31T02:34:03.908Z]
[2022-08-31T02:34:03.908Z] InternalTopicIntegrationTest > shouldGetToRunningWithWindowedTableInFKJ() STARTED
[2022-08-31T02:34:05.642Z]
[2022-08-31T02:34:05.642Z] InternalTopicIntegrationTest > shouldGetToRunningWithWindowedTableInFKJ() PASSED
[2022-08-31T02:34:05.642Z]
[2022-08-31T02:34:05.642Z] InternalTopicIntegrationTest > shouldCompactAndDeleteTopicsForWindowStoreChangelogs() STARTED
[2022-08-31T02:34:05.642Z]
[2022-08-31T02:34:05.642Z] InternalTopicIntegrationTest > shouldCompactAndDeleteTopicsForWindowStoreChangelogs() PASSED
[2022-08-31T02:34:06.805Z]
[2022-08-31T02:34:06.805Z] KStreamAggregationIntegrationTest > shouldAggregateSlidingWindows(TestInfo) STARTED
[2022-08-31T02:34:10.354Z]
[2022-08-31T02:34:10.354Z] KStreamAggregationIntegrationTest > shouldAggregateSlidingWindows(TestInfo) PASSED
[2022-08-31T02:34:10.354Z]
[2022-08-31T02:34:10.354Z] KStreamAggregationIntegrationTest > shouldReduceSessionWindows() STARTED
[2022-08-31T02:34:11.278Z]
[2022-08-31T02:34:11.278Z] KStreamAggregationIntegrationTest > shouldReduceSessionWindows() PASSED
[2022-08-31T02:34:11.278Z]
[2022-08-31T02:34:11.278Z] KStreamAggregationIntegrationTest > shouldReduceSlidingWindows(TestInfo) STARTED
[2022-08-31T02:34:13.960Z]
[2022-08-31T02:34:13.960Z] KStreamAggregationIntegrationTest > shouldReduceSlidingWindows(TestInfo) PASSED
[2022-08-31T02:34:13.960Z]
[2022-08-31T02:34:13.960Z] KStreamAggregationIntegrationTest > shouldReduce(TestInfo) STARTED
[2022-08-31T02:34:17.733Z]
[2022-08-31T02:34:17.733Z] KStreamAggregationIntegrationTest > shouldReduce(TestInfo) PASSED
[2022-08-31T02:34:17.733Z]
[2022-08-31T02:34:17.733Z] KStreamAggregationIntegrationTest > shouldAggregate(TestInfo) STARTED
[2022-08-31T02:34:22.296Z]
[2022-08-31T02:34:22.296Z] KStreamAggregationIntegrationTest > shouldAggregate(TestInfo) PASSED
[2022-08-31T02:34:22.296Z]
[2022-08-31T02:34:22.296Z] KStreamAggregationIntegrationTest > shouldCount(TestInfo) STARTED
[2022-08-31T02:34:25.728Z]
[2022-08-31T02:34:25.728Z] KStreamAggregationIntegrationTest > shouldCount(TestInfo) PASSED
[2022-08-31T02:34:25.728Z]
[2022-08-31T02:34:25.728Z] KStreamAggregationIntegrationTest > shouldGroupByKey(TestInfo) STARTED
[2022-08-31T02:34:30.438Z]
[2022-08-31T02:34:30.438Z] KStreamAggregationIntegrationTest > shouldGroupByKey(TestInfo) PASSED
[2022-08-31T02:34:30.438Z]
[2022-08-31T02:34:30.438Z] KStreamAggregationIntegrationTest > shouldCountWithInternalStore(TestInfo) STARTED
[2022-08-31T02:34:33.484Z]
[2022-08-31T02:34:33.484Z] KStreamAggregationIntegrationTest > shouldCountWithInternalStore(TestInfo) PASSED
[2022-08-31T02:34:33.484Z]
[2022-08-31T02:34:33.484Z] KStreamAggregationIntegrationTest > shouldCountUnlimitedWindows() STARTED
[2022-08-31T02:34:35.391Z]
[2022-08-31T02:34:35.391Z] KStreamAggregationIntegrationTest > shouldCountUnlimitedWindows() PASSED
[2022-08-31T02:34:35.391Z]
[2022-08-31T02:34:35.391Z] KStreamAggregationIntegrationTest > shouldReduceWindowed(TestInfo) STARTED
[2022-08-31T02:34:39.525Z]
[2022-08-31T02:34:39.525Z] KStreamAggregationIntegrationTest > shouldReduceWindowed(TestInfo) PASSED
[2022-08-31T02:34:39.525Z]
[2022-08-31T02:34:39.525Z] KStreamAggregationIntegrationTest > shouldCountSessionWindows() STARTED
[2022-08-31T02:34:40.534Z]
[2022-08-31T02:34:40.534Z] KStreamAggregationIntegrationTest > shouldCountSessionWindows() PASSED
[2022-08-31T02:34:40.534Z]
[2022-08-31T02:34:40.534Z] KStreamAggregationIntegrationTest > shouldAggregateWindowed(TestInfo) STARTED
[2022-08-31T02:34:43.564Z]
[2022-08-31T02:34:43.564Z] KStreamAggregationIntegrationTest > shouldAggregateWindowed(TestInfo) PASSED
[2022-08-31T02:34:52.137Z] streams-0: SMOKE-TEST-CLIENT-CLOSED
[2022-08-31T02:34:52.138Z] streams-1: SMOKE-TEST-CLIENT-CLOSED
[2022-08-31T02:34:52.138Z] streams-4: SMOKE-TEST-CLIENT-CLOSED
[2022-08-31T02:34:52.138Z] streams-2: SMOKE-TEST-CLIENT-CLOSED
[2022-08-31T02:34:52.138Z] streams-3: SMOKE-TEST-CLIENT-CLOSED
[2022-08-31T02:34:52.138Z] streams-5: SMOKE-TEST-CLIENT-CLOSED
[2022-08-31T02:34:58.261Z]
[2022-08-31T02:34:58.261Z] BUILD SUCCESSFUL in 2h 23m 39s
[2022-08-31T02:34:58.261Z] 212 actionable tasks: 115 executed, 97 up-to-date
[2022-08-31T02:34:59.267Z]
[2022-08-31T02:34:59.267Z] See the profiling report at: file:///home/jenkins/workspace/Kafka_kafka_trunk/build/reports/profile/profile-2022-08-31-00-11-49.html
[2022-08-31T02:34:59.267Z] A fine-grained performance profile is available: use the --scan option.
[Pipeline] junit
[2022-08-31T02:35:00.108Z] Recording test results
[2022-08-31T02:35:22.273Z] [Checks API] No suitable checks publisher found.
[Pipeline] echo
[2022-08-31T02:35:22.275Z] Skipping Kafka Streams archetype test for Java 17
[Pipeline] }
[Pipeline] // withEnv
[Pipeline] }
[Pipeline] // withEnv
[Pipeline] }
[Pipeline] // withEnv
[Pipeline] }
[Pipeline] // node
[Pipeline] }
[Pipeline] // timestamps
[Pipeline] }
[Pipeline] // timeout
[Pipeline] }
[Pipeline] // stage
[Pipeline] }
[Pipeline] // parallel
[Pipeline] }
[Pipeline] // stage
[Pipeline] stage
[Pipeline] { (Declarative: Post Actions)
[Pipeline] node
Running on builds47 in /home/jenkins/jenkins-agent/workspace/Kafka_kafka_trunk
[Pipeline] {
[Pipeline] script
[Pipeline] {
[Pipeline] step
Build failed in Jenkins: Kafka » Kafka Branch Builder » trunk #1188
Posted by Apache Jenkins Server <je...@builds.apache.org>.
See <https://ci-builds.apache.org/job/Kafka/job/kafka/job/trunk/1188/display/redirect>
Changes:
------------------------------------------
[...truncated 504599 lines...]
[2022-08-30T20:14:55.068Z]
[2022-08-30T20:14:55.068Z] StreamsAssignmentScaleTest > testFallbackPriorTaskAssignorManyThreadsPerClient STARTED
[2022-08-30T20:14:56.010Z]
[2022-08-30T20:14:56.010Z] StreamsAssignmentScaleTest > testFallbackPriorTaskAssignorManyThreadsPerClient PASSED
[2022-08-30T20:14:56.010Z]
[2022-08-30T20:14:56.010Z] StreamsAssignmentScaleTest > testFallbackPriorTaskAssignorLargePartitionCount STARTED
[2022-08-30T20:15:25.453Z]
[2022-08-30T20:15:25.453Z] StreamsAssignmentScaleTest > testFallbackPriorTaskAssignorLargePartitionCount PASSED
[2022-08-30T20:15:25.453Z]
[2022-08-30T20:15:25.453Z] StreamsAssignmentScaleTest > testStickyTaskAssignorLargePartitionCount STARTED
[2022-08-30T20:15:50.037Z]
[2022-08-30T20:15:50.037Z] StreamsAssignmentScaleTest > testStickyTaskAssignorLargePartitionCount PASSED
[2022-08-30T20:15:50.037Z]
[2022-08-30T20:15:50.037Z] StreamsAssignmentScaleTest > testFallbackPriorTaskAssignorManyStandbys STARTED
[2022-08-30T20:15:53.936Z]
[2022-08-30T20:15:53.936Z] StreamsAssignmentScaleTest > testFallbackPriorTaskAssignorManyStandbys PASSED
[2022-08-30T20:15:53.936Z]
[2022-08-30T20:15:53.936Z] StreamsAssignmentScaleTest > testHighAvailabilityTaskAssignorManyStandbys STARTED
[2022-08-30T20:16:21.984Z]
[2022-08-30T20:16:21.984Z] StreamsAssignmentScaleTest > testHighAvailabilityTaskAssignorManyStandbys PASSED
[2022-08-30T20:16:21.984Z]
[2022-08-30T20:16:21.984Z] StreamsAssignmentScaleTest > testFallbackPriorTaskAssignorLargeNumConsumers STARTED
[2022-08-30T20:16:23.023Z]
[2022-08-30T20:16:23.023Z] StreamsAssignmentScaleTest > testFallbackPriorTaskAssignorLargeNumConsumers PASSED
[2022-08-30T20:16:23.023Z]
[2022-08-30T20:16:23.023Z] StreamsAssignmentScaleTest > testStickyTaskAssignorLargeNumConsumers STARTED
[2022-08-30T20:16:24.236Z]
[2022-08-30T20:16:24.236Z] StreamsAssignmentScaleTest > testStickyTaskAssignorLargeNumConsumers PASSED
[2022-08-30T20:16:24.236Z]
[2022-08-30T20:16:24.236Z] AdjustStreamThreadCountTest > testConcurrentlyAccessThreads() STARTED
[2022-08-30T20:16:28.574Z]
[2022-08-30T20:16:28.574Z] AdjustStreamThreadCountTest > testConcurrentlyAccessThreads() PASSED
[2022-08-30T20:16:28.574Z]
[2022-08-30T20:16:28.574Z] AdjustStreamThreadCountTest > shouldResizeCacheAfterThreadReplacement() STARTED
[2022-08-30T20:16:34.050Z]
[2022-08-30T20:16:34.050Z] AdjustStreamThreadCountTest > shouldResizeCacheAfterThreadReplacement() PASSED
[2022-08-30T20:16:34.050Z]
[2022-08-30T20:16:34.050Z] AdjustStreamThreadCountTest > shouldAddAndRemoveThreadsMultipleTimes() STARTED
[2022-08-30T20:16:45.025Z]
[2022-08-30T20:16:45.025Z] AdjustStreamThreadCountTest > shouldAddAndRemoveThreadsMultipleTimes() PASSED
[2022-08-30T20:16:45.025Z]
[2022-08-30T20:16:45.025Z] AdjustStreamThreadCountTest > shouldnNotRemoveStreamThreadWithinTimeout() STARTED
[2022-08-30T20:16:48.315Z]
[2022-08-30T20:16:48.315Z] AdjustStreamThreadCountTest > shouldnNotRemoveStreamThreadWithinTimeout() PASSED
[2022-08-30T20:16:48.315Z]
[2022-08-30T20:16:48.315Z] AdjustStreamThreadCountTest > shouldAddAndRemoveStreamThreadsWhileKeepingNamesCorrect() STARTED
[2022-08-30T20:17:10.601Z]
[2022-08-30T20:17:10.601Z] AdjustStreamThreadCountTest > shouldAddAndRemoveStreamThreadsWhileKeepingNamesCorrect() PASSED
[2022-08-30T20:17:10.601Z]
[2022-08-30T20:17:10.601Z] AdjustStreamThreadCountTest > shouldAddStreamThread() STARTED
[2022-08-30T20:17:20.301Z]
[2022-08-30T20:17:20.301Z] AdjustStreamThreadCountTest > shouldAddStreamThread() PASSED
[2022-08-30T20:17:20.301Z]
[2022-08-30T20:17:20.301Z] AdjustStreamThreadCountTest > shouldRemoveStreamThreadWithStaticMembership() STARTED
[2022-08-30T20:17:26.730Z]
[2022-08-30T20:17:26.730Z] AdjustStreamThreadCountTest > shouldRemoveStreamThreadWithStaticMembership() PASSED
[2022-08-30T20:17:26.730Z]
[2022-08-30T20:17:26.730Z] AdjustStreamThreadCountTest > shouldRemoveStreamThread() STARTED
[2022-08-30T20:17:33.517Z]
[2022-08-30T20:17:33.517Z] AdjustStreamThreadCountTest > shouldRemoveStreamThread() PASSED
[2022-08-30T20:17:33.517Z]
[2022-08-30T20:17:33.517Z] AdjustStreamThreadCountTest > shouldResizeCacheAfterThreadRemovalTimesOut() STARTED
[2022-08-30T20:17:36.817Z]
[2022-08-30T20:17:36.817Z] AdjustStreamThreadCountTest > shouldResizeCacheAfterThreadRemovalTimesOut() PASSED
[2022-08-30T20:17:43.008Z]
[2022-08-30T20:17:43.008Z] FineGrainedAutoResetIntegrationTest > shouldOnlyReadRecordsWhereEarliestSpecifiedWithNoCommittedOffsetsWithGlobalAutoOffsetResetLatest() STARTED
[2022-08-30T20:17:44.993Z]
[2022-08-30T20:17:44.993Z] FineGrainedAutoResetIntegrationTest > shouldOnlyReadRecordsWhereEarliestSpecifiedWithNoCommittedOffsetsWithGlobalAutoOffsetResetLatest() PASSED
[2022-08-30T20:17:44.993Z]
[2022-08-30T20:17:44.993Z] FineGrainedAutoResetIntegrationTest > shouldThrowExceptionOverlappingPattern() STARTED
[2022-08-30T20:17:44.993Z]
[2022-08-30T20:17:44.993Z] FineGrainedAutoResetIntegrationTest > shouldThrowExceptionOverlappingPattern() PASSED
[2022-08-30T20:17:44.993Z]
[2022-08-30T20:17:44.993Z] FineGrainedAutoResetIntegrationTest > shouldThrowExceptionOverlappingTopic() STARTED
[2022-08-30T20:17:44.993Z]
[2022-08-30T20:17:44.993Z] FineGrainedAutoResetIntegrationTest > shouldThrowExceptionOverlappingTopic() PASSED
[2022-08-30T20:17:44.993Z]
[2022-08-30T20:17:44.993Z] FineGrainedAutoResetIntegrationTest > shouldOnlyReadRecordsWhereEarliestSpecifiedWithInvalidCommittedOffsets() STARTED
[2022-08-30T20:18:30.652Z]
[2022-08-30T20:18:30.652Z] FineGrainedAutoResetIntegrationTest > shouldOnlyReadRecordsWhereEarliestSpecifiedWithInvalidCommittedOffsets() PASSED
[2022-08-30T20:18:30.652Z]
[2022-08-30T20:18:30.652Z] FineGrainedAutoResetIntegrationTest > shouldOnlyReadRecordsWhereEarliestSpecifiedWithNoCommittedOffsetsWithDefaultGlobalAutoOffsetResetEarliest() STARTED
[2022-08-30T20:19:21.360Z]
[2022-08-30T20:19:21.360Z] FineGrainedAutoResetIntegrationTest > shouldOnlyReadRecordsWhereEarliestSpecifiedWithNoCommittedOffsetsWithDefaultGlobalAutoOffsetResetEarliest() PASSED
[2022-08-30T20:19:21.360Z]
[2022-08-30T20:19:21.360Z] FineGrainedAutoResetIntegrationTest > shouldThrowStreamsExceptionNoResetSpecified() STARTED
[2022-08-30T20:19:21.360Z]
[2022-08-30T20:19:21.360Z] FineGrainedAutoResetIntegrationTest > shouldThrowStreamsExceptionNoResetSpecified() PASSED
[2022-08-30T20:19:21.360Z]
[2022-08-30T20:19:21.360Z] GlobalKTableIntegrationTest > shouldGetToRunningWithOnlyGlobalTopology() STARTED
[2022-08-30T20:19:21.360Z]
[2022-08-30T20:19:21.360Z] GlobalKTableIntegrationTest > shouldGetToRunningWithOnlyGlobalTopology() PASSED
[2022-08-30T20:19:21.360Z]
[2022-08-30T20:19:21.360Z] GlobalKTableIntegrationTest > shouldKStreamGlobalKTableLeftJoin() STARTED
[2022-08-30T20:19:21.360Z]
[2022-08-30T20:19:21.360Z] GlobalKTableIntegrationTest > shouldKStreamGlobalKTableLeftJoin() PASSED
[2022-08-30T20:19:21.360Z]
[2022-08-30T20:19:21.360Z] GlobalKTableIntegrationTest > shouldRestoreGlobalInMemoryKTableOnRestart() STARTED
[2022-08-30T20:19:21.360Z]
[2022-08-30T20:19:21.360Z] GlobalKTableIntegrationTest > shouldRestoreGlobalInMemoryKTableOnRestart() PASSED
[2022-08-30T20:19:21.360Z]
[2022-08-30T20:19:21.360Z] GlobalKTableIntegrationTest > shouldKStreamGlobalKTableJoin() STARTED
[2022-08-30T20:19:24.484Z]
[2022-08-30T20:19:24.484Z] GlobalKTableIntegrationTest > shouldKStreamGlobalKTableJoin() PASSED
[2022-08-30T20:19:26.556Z]
[2022-08-30T20:19:26.556Z] GlobalThreadShutDownOrderTest > shouldFinishGlobalStoreOperationOnShutDown() STARTED
[2022-08-30T20:19:32.003Z]
[2022-08-30T20:19:32.003Z] GlobalThreadShutDownOrderTest > shouldFinishGlobalStoreOperationOnShutDown() PASSED
[2022-08-30T20:19:33.040Z]
[2022-08-30T20:19:33.040Z] IQv2IntegrationTest > shouldFailStopped() STARTED
[2022-08-30T20:19:33.040Z]
[2022-08-30T20:19:33.040Z] IQv2IntegrationTest > shouldFailStopped() PASSED
[2022-08-30T20:19:33.040Z]
[2022-08-30T20:19:33.040Z] IQv2IntegrationTest > shouldNotRequireQueryHandler(TestInfo) STARTED
[2022-08-30T20:19:34.075Z]
[2022-08-30T20:19:34.075Z] IQv2IntegrationTest > shouldNotRequireQueryHandler(TestInfo) PASSED
[2022-08-30T20:19:34.075Z]
[2022-08-30T20:19:34.075Z] IQv2IntegrationTest > shouldFailNotStarted() STARTED
[2022-08-30T20:19:34.075Z]
[2022-08-30T20:19:34.075Z] IQv2IntegrationTest > shouldFailNotStarted() PASSED
[2022-08-30T20:19:34.075Z]
[2022-08-30T20:19:34.075Z] IQv2IntegrationTest > shouldFetchFromPartition() STARTED
[2022-08-30T20:19:36.320Z]
[2022-08-30T20:19:36.320Z] IQv2IntegrationTest > shouldFetchFromPartition() PASSED
[2022-08-30T20:19:36.320Z]
[2022-08-30T20:19:36.320Z] IQv2IntegrationTest > shouldFetchExplicitlyFromAllPartitions() STARTED
[2022-08-30T20:19:38.393Z]
[2022-08-30T20:19:38.393Z] IQv2IntegrationTest > shouldFetchExplicitlyFromAllPartitions() PASSED
[2022-08-30T20:19:38.393Z]
[2022-08-30T20:19:38.393Z] IQv2IntegrationTest > shouldFailUnknownStore() STARTED
[2022-08-30T20:19:38.393Z]
[2022-08-30T20:19:38.393Z] IQv2IntegrationTest > shouldFailUnknownStore() PASSED
[2022-08-30T20:19:38.393Z]
[2022-08-30T20:19:38.393Z] IQv2IntegrationTest > shouldRejectNonRunningActive() STARTED
[2022-08-30T20:19:40.638Z]
[2022-08-30T20:19:40.638Z] IQv2IntegrationTest > shouldRejectNonRunningActive() PASSED
[2022-08-30T20:19:42.918Z]
[2022-08-30T20:19:42.918Z] InternalTopicIntegrationTest > shouldCompactTopicsForKeyValueStoreChangelogs() STARTED
[2022-08-30T20:19:44.033Z]
[2022-08-30T20:19:44.033Z] InternalTopicIntegrationTest > shouldCompactTopicsForKeyValueStoreChangelogs() PASSED
[2022-08-30T20:19:44.033Z]
[2022-08-30T20:19:44.033Z] InternalTopicIntegrationTest > shouldGetToRunningWithWindowedTableInFKJ() STARTED
[2022-08-30T20:19:47.520Z]
[2022-08-30T20:19:47.520Z] InternalTopicIntegrationTest > shouldGetToRunningWithWindowedTableInFKJ() PASSED
[2022-08-30T20:19:47.520Z]
[2022-08-30T20:19:47.520Z] InternalTopicIntegrationTest > shouldCompactAndDeleteTopicsForWindowStoreChangelogs() STARTED
[2022-08-30T20:19:47.520Z]
[2022-08-30T20:19:47.520Z] InternalTopicIntegrationTest > shouldCompactAndDeleteTopicsForWindowStoreChangelogs() PASSED
[2022-08-30T20:19:49.680Z]
[2022-08-30T20:19:49.680Z] KStreamAggregationIntegrationTest > shouldAggregateSlidingWindows(TestInfo) STARTED
[2022-08-30T20:19:53.929Z]
[2022-08-30T20:19:53.929Z] KStreamAggregationIntegrationTest > shouldAggregateSlidingWindows(TestInfo) PASSED
[2022-08-30T20:19:53.929Z]
[2022-08-30T20:19:53.929Z] KStreamAggregationIntegrationTest > shouldReduceSessionWindows() STARTED
[2022-08-30T20:19:56.175Z]
[2022-08-30T20:19:56.175Z] KStreamAggregationIntegrationTest > shouldReduceSessionWindows() PASSED
[2022-08-30T20:19:56.175Z]
[2022-08-30T20:19:56.175Z] KStreamAggregationIntegrationTest > shouldReduceSlidingWindows(TestInfo) STARTED
[2022-08-30T20:20:00.584Z]
[2022-08-30T20:20:00.584Z] KStreamAggregationIntegrationTest > shouldReduceSlidingWindows(TestInfo) PASSED
[2022-08-30T20:20:00.584Z]
[2022-08-30T20:20:00.584Z] KStreamAggregationIntegrationTest > shouldReduce(TestInfo) STARTED
[2022-08-30T20:20:12.245Z]
[2022-08-30T20:20:12.245Z] KStreamAggregationIntegrationTest > shouldReduce(TestInfo) PASSED
[2022-08-30T20:20:12.245Z]
[2022-08-30T20:20:12.245Z] KStreamAggregationIntegrationTest > shouldAggregate(TestInfo) STARTED
[2022-08-30T20:20:16.494Z]
[2022-08-30T20:20:16.494Z] KStreamAggregationIntegrationTest > shouldAggregate(TestInfo) PASSED
[2022-08-30T20:20:16.494Z]
[2022-08-30T20:20:16.494Z] KStreamAggregationIntegrationTest > shouldCount(TestInfo) STARTED
[2022-08-30T20:20:23.189Z]
[2022-08-30T20:20:23.189Z] KStreamAggregationIntegrationTest > shouldCount(TestInfo) PASSED
[2022-08-30T20:20:23.189Z]
[2022-08-30T20:20:23.189Z] KStreamAggregationIntegrationTest > shouldGroupByKey(TestInfo) STARTED
[2022-08-30T20:20:28.651Z]
[2022-08-30T20:20:28.651Z] KStreamAggregationIntegrationTest > shouldGroupByKey(TestInfo) PASSED
[2022-08-30T20:20:28.651Z]
[2022-08-30T20:20:28.651Z] KStreamAggregationIntegrationTest > shouldCountWithInternalStore(TestInfo) STARTED
[2022-08-30T20:20:32.998Z]
[2022-08-30T20:20:32.998Z] KStreamAggregationIntegrationTest > shouldCountWithInternalStore(TestInfo) PASSED
[2022-08-30T20:20:32.998Z]
[2022-08-30T20:20:32.998Z] KStreamAggregationIntegrationTest > shouldCountUnlimitedWindows() STARTED
[2022-08-30T20:20:35.076Z]
[2022-08-30T20:20:35.076Z] KStreamAggregationIntegrationTest > shouldCountUnlimitedWindows() PASSED
[2022-08-30T20:20:35.076Z]
[2022-08-30T20:20:35.076Z] KStreamAggregationIntegrationTest > shouldReduceWindowed(TestInfo) STARTED
[2022-08-30T20:20:40.643Z]
[2022-08-30T20:20:40.643Z] KStreamAggregationIntegrationTest > shouldReduceWindowed(TestInfo) PASSED
[2022-08-30T20:20:40.643Z]
[2022-08-30T20:20:40.643Z] KStreamAggregationIntegrationTest > shouldCountSessionWindows() STARTED
[2022-08-30T20:20:42.725Z]
[2022-08-30T20:20:42.725Z] KStreamAggregationIntegrationTest > shouldCountSessionWindows() PASSED
[2022-08-30T20:20:42.725Z]
[2022-08-30T20:20:42.725Z] KStreamAggregationIntegrationTest > shouldAggregateWindowed(TestInfo) STARTED
[2022-08-30T20:20:47.164Z]
[2022-08-30T20:20:47.164Z] KStreamAggregationIntegrationTest > shouldAggregateWindowed(TestInfo) PASSED
[2022-08-30T20:20:57.245Z] streams-0: SMOKE-TEST-CLIENT-CLOSED
[2022-08-30T20:20:57.245Z] streams-1: SMOKE-TEST-CLIENT-CLOSED
[2022-08-30T20:20:57.245Z] streams-4: SMOKE-TEST-CLIENT-CLOSED
[2022-08-30T20:20:57.245Z] streams-3: SMOKE-TEST-CLIENT-CLOSED
[2022-08-30T20:20:57.245Z] streams-2: SMOKE-TEST-CLIENT-CLOSED
[2022-08-30T20:21:02.450Z]
[2022-08-30T20:21:02.450Z] FAILURE: Build failed with an exception.
[2022-08-30T20:21:02.450Z]
[2022-08-30T20:21:02.450Z] * What went wrong:
[2022-08-30T20:21:02.450Z] Execution failed for task ':core:unitTest'.
[2022-08-30T20:21:02.450Z] > Process 'Gradle Test Executor 95' finished with non-zero exit value 1
[2022-08-30T20:21:02.450Z] This problem might be caused by incorrect test process configuration.
[2022-08-30T20:21:02.450Z] Please refer to the test execution section in the User Manual at https://docs.gradle.org/7.5.1/userguide/java_testing.html#sec:test_execution
[2022-08-30T20:21:02.450Z]
[2022-08-30T20:21:02.450Z] * Try:
[2022-08-30T20:21:02.450Z] > Run with --stacktrace option to get the stack trace.
[2022-08-30T20:21:02.450Z] > Run with --info or --debug option to get more log output.
[2022-08-30T20:21:02.450Z] > Run with --scan to get full insights.
[2022-08-30T20:21:02.450Z]
[2022-08-30T20:21:02.450Z] * Get more help at https://help.gradle.org
[2022-08-30T20:21:02.450Z]
[2022-08-30T20:21:02.450Z] BUILD FAILED in 2h 47m 19s
[2022-08-30T20:21:02.450Z] 212 actionable tasks: 115 executed, 97 up-to-date
[2022-08-30T20:21:02.450Z]
[2022-08-30T20:21:02.450Z] See the profiling report at: file:///home/jenkins/jenkins-agent/workspace/Kafka_kafka_trunk_2/build/reports/profile/profile-2022-08-30-17-33-47.html
[2022-08-30T20:21:02.450Z] A fine-grained performance profile is available: use the --scan option.
[Pipeline] }
[Pipeline] // withEnv
[Pipeline] }
[Pipeline] // withEnv
[Pipeline] }
[Pipeline] // withEnv
[Pipeline] }
[Pipeline] // node
[Pipeline] }
[Pipeline] // timestamps
[Pipeline] }
[Pipeline] // timeout
[Pipeline] }
[Pipeline] // stage
[Pipeline] }
Failed in branch JDK 8 and Scala 2.12
[Pipeline] // parallel
[Pipeline] }
[Pipeline] // stage
[Pipeline] stage
[Pipeline] { (Declarative: Post Actions)
[Pipeline] node
Running on builds35 in /home/jenkins/workspace/Kafka_kafka_trunk
[Pipeline] {
[Pipeline] script
[Pipeline] {
[Pipeline] step