You are viewing a plain text version of this content. The canonical link for it is here.
Posted to builds@beam.apache.org by Apache Jenkins Server <je...@builds.apache.org> on 2022/07/12 03:12:09 UTC
Build failed in Jenkins: beam_PostCommit_Go_VR_Samza #1441
See <https://ci-beam.apache.org/job/beam_PostCommit_Go_VR_Samza/1441/display/redirect?page=changes>
Changes:
[noreply] Try to fix playground workflow (#22226)
------------------------------------------
[...truncated 26.67 KB...]
> Task :release:go-licenses:java:dockerRun
+ rm -rf '/output/*'
+ go get github.com/apache/beam/sdks/v2/java/container
go: downloading github.com/apache/beam/sdks/v2 v2.40.0
go: downloading github.com/apache/beam v2.40.0+incompatible
> Task :model:pipeline:compileJava FROM-CACHE
> Task :model:pipeline:processResources
> Task :model:pipeline:classes
> Task :model:pipeline:jar
> Task :model:pipeline:shadowJar FROM-CACHE
> Task :model:fn-execution:extractIncludeProto
> Task :model:job-management:extractIncludeProto
> Task :model:job-management:generateProto FROM-CACHE
> Task :model:fn-execution:generateProto FROM-CACHE
> Task :model:fn-execution:compileJava FROM-CACHE
> Task :model:fn-execution:classes
> Task :model:job-management:compileJava FROM-CACHE
> Task :model:job-management:classes
> Task :model:fn-execution:shadowJar FROM-CACHE
> Task :model:job-management:shadowJar FROM-CACHE
> Task :sdks:java:core:compileJava FROM-CACHE
> Task :sdks:java:core:classes
> Task :sdks:java:core:shadowJar FROM-CACHE
> Task :sdks:java:io:hadoop-common:compileJava FROM-CACHE
> Task :sdks:java:io:hadoop-common:classes UP-TO-DATE
> Task :sdks:java:io:hadoop-common:jar
> Task :sdks:java:io:parquet:compileJava FAILED
> Task :sdks:java:fn-execution:compileJava FROM-CACHE
> Task :sdks:java:fn-execution:classes UP-TO-DATE
> Task :sdks:java:fn-execution:jar
> Task :runners:core-construction-java:compileJava FROM-CACHE
> Task :runners:core-construction-java:classes UP-TO-DATE
> Task :runners:core-construction-java:jar
> Task :runners:core-java:compileJava FROM-CACHE
> Task :runners:core-java:classes UP-TO-DATE
> Task :runners:core-java:jar
> Task :sdks:java:extensions:google-cloud-platform-core:compileJava FROM-CACHE
> Task :sdks:java:extensions:google-cloud-platform-core:classes UP-TO-DATE
> Task :sdks:java:extensions:google-cloud-platform-core:jar
> Task :sdks:java:harness:compileJava FROM-CACHE
> Task :sdks:java:harness:classes UP-TO-DATE
> Task :sdks:java:harness:jar
> Task :runners:java-fn-execution:compileJava FROM-CACHE
> Task :runners:java-fn-execution:classes UP-TO-DATE
> Task :runners:java-fn-execution:jar
> Task :sdks:java:expansion-service:compileJava FROM-CACHE
> Task :sdks:java:expansion-service:classes UP-TO-DATE
> Task :sdks:java:expansion-service:jar
> Task :runners:java-job-service:compileJava FROM-CACHE
> Task :runners:java-job-service:classes UP-TO-DATE
> Task :runners:java-job-service:jar
> Task :sdks:java:io:kafka:compileJava FROM-CACHE
> Task :sdks:java:io:kafka:classes UP-TO-DATE
> Task :sdks:java:io:kafka:jar
> Task :runners:samza:compileJava FROM-CACHE
> Task :runners:samza:classes
> Task :runners:samza:jar
> Task :runners:samza:job-server:compileJava NO-SOURCE
> Task :runners:samza:job-server:classes UP-TO-DATE
> Task :sdks:java:container:generateLicenseReport
> Task :sdks:java:container:pullLicenses
Copying already-fetched licenses from <https://ci-beam.apache.org/job/beam_PostCommit_Go_VR_Samza/ws/src/sdks/java/container/build/reports/dependency-license> to <https://ci-beam.apache.org/job/beam_PostCommit_Go_VR_Samza/ws/src/sdks/java/container/build/target/java_third_party_licenses>
> Task :sdks:java:harness:shadowJar FROM-CACHE
> Task :sdks:java:container:java11:copyDockerfileDependencies
> Task :sdks:java:container:java8:copyDockerfileDependencies
> Task :runners:samza:job-server:shadowJar FROM-CACHE
> Task :sdks:java:container:pullLicenses
Collecting pip
Using cached pip-22.1.2-py3-none-any.whl (2.1 MB)
Collecting setuptools
Using cached setuptools-63.1.0-py3-none-any.whl (1.2 MB)
Collecting wheel
Using cached wheel-0.37.1-py2.py3-none-any.whl (35 kB)
Installing collected packages: pip, setuptools, wheel
Attempting uninstall: pip
Found existing installation: pip 20.0.2
Uninstalling pip-20.0.2:
Successfully uninstalled pip-20.0.2
Attempting uninstall: setuptools
Found existing installation: setuptools 44.0.0
Uninstalling setuptools-44.0.0:
Successfully uninstalled setuptools-44.0.0
> Task :release:go-licenses:java:dockerRun
go: downloading github.com/golang/protobuf v1.5.2
go: downloading google.golang.org/grpc v1.47.0
go: downloading google.golang.org/protobuf v1.28.0
> Task :release:go-licenses:go:dockerRun
go: downloading github.com/golang/protobuf v1.5.2
go: downloading google.golang.org/grpc v1.47.0
go: downloading google.golang.org/protobuf v1.28.0
go: downloading google.golang.org/genproto v0.0.0-20220602131408-e326c6e8e9c8
go: downloading golang.org/x/sys v0.0.0-20220520151302-bc2c85ada10a
go: downloading golang.org/x/net v0.0.0-20220607020251-c690dde0001d
go: downloading golang.org/x/text v0.3.7
go: added github.com/apache/beam/sdks/v2 v2.40.0
go: added github.com/golang/protobuf v1.5.2
go: added golang.org/x/net v0.0.0-20220607020251-c690dde0001d
go: added golang.org/x/sys v0.0.0-20220520151302-bc2c85ada10a
go: added golang.org/x/text v0.3.7
go: added google.golang.org/genproto v0.0.0-20220602131408-e326c6e8e9c8
go: added google.golang.org/grpc v1.47.0
go: added google.golang.org/protobuf v1.28.0
+ go-licenses save github.com/apache/beam/sdks/v2/go/container --save_path=/output/licenses
W0712 03:10:54.170893 22 library.go:94] "golang.org/x/sys/unix" contains non-Go code that can't be inspected for further dependencies:
/go/pkg/mod/golang.org/x/sys@v0.0.0-20220520151302-bc2c85ada10a/unix/asm_linux_amd64.s
+ go-licenses csv github.com/apache/beam/sdks/v2/go/container
+ tee /output/licenses/list.csv
> Task :sdks:java:container:pullLicenses
Successfully installed pip-22.1.2 setuptools-63.1.0 wheel-0.37.1
Collecting beautifulsoup4<5.0,>=4.9.0
Using cached beautifulsoup4-4.11.1-py3-none-any.whl (128 kB)
Collecting pyyaml<6.0.0,>=3.12
Using cached PyYAML-5.4.1-cp38-cp38-manylinux1_x86_64.whl (662 kB)
Collecting tenacity<6.0,>=5.0.2
Using cached tenacity-5.1.5-py2.py3-none-any.whl (34 kB)
Collecting soupsieve>1.2
Using cached soupsieve-2.3.2.post1-py3-none-any.whl (37 kB)
Collecting six>=1.9.0
Using cached six-1.16.0-py2.py3-none-any.whl (11 kB)
Installing collected packages: soupsieve, six, pyyaml, tenacity, beautifulsoup4
Successfully installed beautifulsoup4-4.11.1 pyyaml-5.4.1 six-1.16.0 soupsieve-2.3.2.post1 tenacity-5.1.5
Executing python <https://ci-beam.apache.org/job/beam_PostCommit_Go_VR_Samza/ws/src/sdks/java/container/license_scripts/pull_licenses_java.py> --license_index=<https://ci-beam.apache.org/job/beam_PostCommit_Go_VR_Samza/ws/src/sdks/java/container/build/reports/dependency-license/index.json> --output_dir=<https://ci-beam.apache.org/job/beam_PostCommit_Go_VR_Samza/ws/src/sdks/java/container/build/target/java_third_party_licenses> --dep_url_yaml=<https://ci-beam.apache.org/job/beam_PostCommit_Go_VR_Samza/ws/src/sdks/java/container/license_scripts/dep_urls_java.yaml> --manual_license_path=<https://ci-beam.apache.org/job/beam_PostCommit_Go_VR_Samza/ws/src/sdks/java/container/license_scripts/manual_licenses>
INFO:root:Pulling license for 242 dependencies using 16 threads.
INFO:root:Replaced local file URL with file://<https://ci-beam.apache.org/job/beam_PostCommit_Go_VR_Samza/ws/src/sdks/java/container/license_scripts/manual_licenses/xz/COPYING> for xz-1.5
INFO:root:pull_licenses_java.py succeed. It took 9.162877 seconds with 16 threads.
Copying licenses from <https://ci-beam.apache.org/job/beam_PostCommit_Go_VR_Samza/ws/src/sdks/java/container/build/target/java_third_party_licenses> to <https://ci-beam.apache.org/job/beam_PostCommit_Go_VR_Samza/ws/src/sdks/java/container/build/target/third_party_licenses.>
Finished license_scripts.sh
> Task :sdks:java:container:goPrepare UP-TO-DATE
> Task :release:go-licenses:java:dockerRun
go: downloading google.golang.org/genproto v0.0.0-20220602131408-e326c6e8e9c8
go: downloading golang.org/x/net v0.0.0-20220607020251-c690dde0001d
go: downloading golang.org/x/sys v0.0.0-20220520151302-bc2c85ada10a
go: downloading golang.org/x/text v0.3.7
go: added github.com/apache/beam/sdks/v2 v2.40.0
go: added github.com/golang/protobuf v1.5.2
go: added golang.org/x/net v0.0.0-20220607020251-c690dde0001d
go: added golang.org/x/sys v0.0.0-20220520151302-bc2c85ada10a
go: added golang.org/x/text v0.3.7
go: added google.golang.org/genproto v0.0.0-20220602131408-e326c6e8e9c8
go: added google.golang.org/grpc v1.47.0
go: added google.golang.org/protobuf v1.28.0
+ go-licenses save github.com/apache/beam/sdks/v2/java/container --save_path=/output/licenses
W0712 03:10:53.654985 24 library.go:94] "golang.org/x/sys/unix" contains non-Go code that can't be inspected for further dependencies:
/go/pkg/mod/golang.org/x/sys@v0.0.0-20220520151302-bc2c85ada10a/unix/asm_linux_amd64.s
+ go-licenses csv github.com/apache/beam/sdks/v2/java/container
+ tee /output/licenses/list.csv
> Task :sdks:java:container:java11:copyJavaThirdPartyLicenses
> Task :sdks:java:container:java8:copyJavaThirdPartyLicenses
> Task :release:go-licenses:go:dockerRun
W0712 03:11:03.519927 177 library.go:94] "golang.org/x/sys/unix" contains non-Go code that can't be inspected for further dependencies:
/go/pkg/mod/golang.org/x/sys@v0.0.0-20220520151302-bc2c85ada10a/unix/asm_linux_amd64.s
> Task :sdks:java:container:goBuild
/home/jenkins/go/bin/go1.18.1 build -o ./build/target/linux_amd64/boot boot.go boot_test.go
> Task :release:go-licenses:java:dockerRun
W0712 03:11:03.447183 174 library.go:94] "golang.org/x/sys/unix" contains non-Go code that can't be inspected for further dependencies:
/go/pkg/mod/golang.org/x/sys@v0.0.0-20220520151302-bc2c85ada10a/unix/asm_linux_amd64.s
github.com/apache/beam/sdks/v2/go/pkg/beam,https://github.com/apache/beam/blob/sdks/v2.40.0/sdks/go/README.md,Apache-2.0
github.com/apache/beam/sdks/v2/java/container,https://github.com/apache/beam/blob/sdks/v2.40.0/sdks/LICENSE,Apache-2.0
github.com/golang/protobuf,https://github.com/golang/protobuf/blob/v1.5.2/LICENSE,BSD-3-Clause
golang.org/x/net,https://cs.opensource.google/go/x/net/+/c690dde0:LICENSE,BSD-3-Clause
golang.org/x/sys,https://cs.opensource.google/go/x/sys/+/bc2c85ad:LICENSE,BSD-3-Clause
golang.org/x/text,https://cs.opensource.google/go/x/text/+/v0.3.7:LICENSE,BSD-3-Clause
google.golang.org/genproto/googleapis/rpc/status,https://github.com/googleapis/go-genproto/blob/e326c6e8e9c8/LICENSE,Apache-2.0
google.golang.org/grpc,https://github.com/grpc/grpc-go/blob/v1.47.0/LICENSE,Apache-2.0
google.golang.org/protobuf,https://github.com/protocolbuffers/protobuf-go/blob/v1.28.0/LICENSE,BSD-3-Clause
+ chmod -R a+w /output/licenses
> Task :sdks:java:container:java8:copySdkHarnessLauncher
Execution optimizations have been disabled for task ':sdks:java:container:java8:copySdkHarnessLauncher' to ensure correctness due to the following reasons:
- Gradle detected a problem with the following location: '<https://ci-beam.apache.org/job/beam_PostCommit_Go_VR_Samza/ws/src/sdks/java/container/build/target'.> Reason: Task ':sdks:java:container:java8:copySdkHarnessLauncher' uses this output of task ':sdks:java:container:downloadCloudProfilerAgent' without declaring an explicit or implicit dependency. This can lead to incorrect results being produced, depending on what order the tasks are executed. Please refer to https://docs.gradle.org/7.4/userguide/validation_problems.html#implicit_dependency for more details about this problem.
- Gradle detected a problem with the following location: '<https://ci-beam.apache.org/job/beam_PostCommit_Go_VR_Samza/ws/src/sdks/java/container/build/target'.> Reason: Task ':sdks:java:container:java8:copySdkHarnessLauncher' uses this output of task ':sdks:java:container:pullLicenses' without declaring an explicit or implicit dependency. This can lead to incorrect results being produced, depending on what order the tasks are executed. Please refer to https://docs.gradle.org/7.4/userguide/validation_problems.html#implicit_dependency for more details about this problem.
> Task :release:go-licenses:go:dockerRun
github.com/apache/beam/sdks/v2/go,https://github.com/apache/beam/blob/sdks/v2.40.0/sdks/go/README.md,Apache-2.0
github.com/golang/protobuf,https://github.com/golang/protobuf/blob/v1.5.2/LICENSE,BSD-3-Clause
golang.org/x/net,https://cs.opensource.google/go/x/net/+/c690dde0:LICENSE,BSD-3-Clause
golang.org/x/sys,https://cs.opensource.google/go/x/sys/+/bc2c85ad:LICENSE,BSD-3-Clause
golang.org/x/text,https://cs.opensource.google/go/x/text/+/v0.3.7:LICENSE,BSD-3-Clause
google.golang.org/genproto/googleapis/rpc/status,https://github.com/googleapis/go-genproto/blob/e326c6e8e9c8/LICENSE,Apache-2.0
google.golang.org/grpc,https://github.com/grpc/grpc-go/blob/v1.47.0/LICENSE,Apache-2.0
google.golang.org/protobuf,https://github.com/protocolbuffers/protobuf-go/blob/v1.28.0/LICENSE,BSD-3-Clause
+ chmod -R a+w /output/licenses
> Task :sdks:java:container:java11:copySdkHarnessLauncher
Execution optimizations have been disabled for task ':sdks:java:container:java11:copySdkHarnessLauncher' to ensure correctness due to the following reasons:
- Gradle detected a problem with the following location: '<https://ci-beam.apache.org/job/beam_PostCommit_Go_VR_Samza/ws/src/sdks/java/container/build/target'.> Reason: Task ':sdks:java:container:java11:copySdkHarnessLauncher' uses this output of task ':sdks:java:container:downloadCloudProfilerAgent' without declaring an explicit or implicit dependency. This can lead to incorrect results being produced, depending on what order the tasks are executed. Please refer to https://docs.gradle.org/7.4/userguide/validation_problems.html#implicit_dependency for more details about this problem.
- Gradle detected a problem with the following location: '<https://ci-beam.apache.org/job/beam_PostCommit_Go_VR_Samza/ws/src/sdks/java/container/build/target'.> Reason: Task ':sdks:java:container:java11:copySdkHarnessLauncher' uses this output of task ':sdks:java:container:pullLicenses' without declaring an explicit or implicit dependency. This can lead to incorrect results being produced, depending on what order the tasks are executed. Please refer to https://docs.gradle.org/7.4/userguide/validation_problems.html#implicit_dependency for more details about this problem.
> Task :release:go-licenses:java:createLicenses
> Task :sdks:java:container:java11:copyGolangLicenses
> Task :sdks:java:container:java8:copyGolangLicenses
> Task :release:go-licenses:go:createLicenses
> Task :sdks:go:container:copyGolangLicenses
> Task :sdks:go:container:dockerPrepare
> Task :sdks:go:container:docker
Sending build context to Docker daemon 14.39MB
Step 1/11 : FROM debian:bullseye
---> d2780094a226
Step 2/11 : MAINTAINER "Apache Beam <de...@beam.apache.org>"
> Task :sdks:java:container:java8:dockerPrepare
> Task :sdks:java:container:java11:dockerPrepare
> Task :sdks:java:container:java8:docker
> Task :sdks:java:container:java11:docker
FAILURE: Build failed with an exception.
* What went wrong:
Execution failed for task ':sdks:java:io:parquet:compileJava'.
> java.util.ConcurrentModificationException (no error message)
* Try:
> Run with --stacktrace option to get the stack trace.
> Run with --info or --debug option to get more log output.
> Run with --scan to get full insights.
* Get more help at https://help.gradle.org
Deprecated Gradle features were used in this build, making it incompatible with Gradle 8.0.
You can use '--warning-mode all' to show the individual deprecation warnings and determine if they come from your own scripts or plugins.
See https://docs.gradle.org/7.4/userguide/command_line_interface.html#sec:command_line_warnings
Execution optimizations have been disabled for 2 invalid unit(s) of work during this build to ensure correctness.
Please consult deprecation warnings for more details.
BUILD FAILED in 3m 5s
116 actionable tasks: 80 executed, 29 from cache, 7 up-to-date
Publishing build scan...
https://gradle.com/s/ujb6ygrlqxhzg
Build step 'Invoke Gradle script' changed build result to FAILURE
Build step 'Invoke Gradle script' marked build as failure
---------------------------------------------------------------------
To unsubscribe, e-mail: builds-unsubscribe@beam.apache.org
For additional commands, e-mail: builds-help@beam.apache.org
Jenkins build is back to normal : beam_PostCommit_Go_VR_Samza #1442
Posted by Apache Jenkins Server <je...@builds.apache.org>.
See <https://ci-beam.apache.org/job/beam_PostCommit_Go_VR_Samza/1442/display/redirect>
---------------------------------------------------------------------
To unsubscribe, e-mail: builds-unsubscribe@beam.apache.org
For additional commands, e-mail: builds-help@beam.apache.org