You are viewing a plain text version of this content. The canonical link for it is here.
Posted to builds@beam.apache.org by Apache Jenkins Server <je...@builds.apache.org> on 2023/05/11 22:23:33 UTC
Build failed in Jenkins: beam_LoadTests_Java_ParDo_Dataflow_V2_Streaming_Java17 #505
See <https://ci-beam.apache.org/job/beam_LoadTests_Java_ParDo_Dataflow_V2_Streaming_Java17/505/display/redirect>
Changes:
------------------------------------------
[...truncated 46.77 KB...]
Using cached tenacity-8.2.2-py3-none-any.whl (24 kB)
Collecting soupsieve>1.2 (from beautifulsoup4<5.0,>=4.9.0->-r <https://ci-beam.apache.org/job/beam_LoadTests_Java_ParDo_Dataflow_V2_Streaming_Java17/ws/src/sdks/java/container/license_scripts/requirement.txt> (line 19))
Using cached soupsieve-2.4.1-py3-none-any.whl (36 kB)
Installing collected packages: tenacity, soupsieve, pyyaml, beautifulsoup4
Successfully installed beautifulsoup4-4.12.2 pyyaml-5.4.1 soupsieve-2.4.1 tenacity-8.2.2
Executing python <https://ci-beam.apache.org/job/beam_LoadTests_Java_ParDo_Dataflow_V2_Streaming_Java17/ws/src/sdks/java/container/license_scripts/pull_licenses_java.py> --license_index=<https://ci-beam.apache.org/job/beam_LoadTests_Java_ParDo_Dataflow_V2_Streaming_Java17/ws/src/sdks/java/container/build/reports/dependency-license/index.json> --output_dir=<https://ci-beam.apache.org/job/beam_LoadTests_Java_ParDo_Dataflow_V2_Streaming_Java17/ws/src/sdks/java/container/build/target/java_third_party_licenses> --dep_url_yaml=<https://ci-beam.apache.org/job/beam_LoadTests_Java_ParDo_Dataflow_V2_Streaming_Java17/ws/src/sdks/java/container/license_scripts/dep_urls_java.yaml> --manual_license_path=<https://ci-beam.apache.org/job/beam_LoadTests_Java_ParDo_Dataflow_V2_Streaming_Java17/ws/src/sdks/java/container/license_scripts/manual_licenses>
INFO:root:Pulling license for 124 dependencies using 16 threads.
INFO:root:Replaced local file URL with file://<https://ci-beam.apache.org/job/beam_LoadTests_Java_ParDo_Dataflow_V2_Streaming_Java17/ws/src/sdks/java/container/license_scripts/manual_licenses/xz/COPYING> for xz-1.5
INFO:root:pull_licenses_java.py succeed. It took 1.382082 seconds with 16 threads.
Copying licenses from <https://ci-beam.apache.org/job/beam_LoadTests_Java_ParDo_Dataflow_V2_Streaming_Java17/ws/src/sdks/java/container/build/target/java_third_party_licenses> to <https://ci-beam.apache.org/job/beam_LoadTests_Java_ParDo_Dataflow_V2_Streaming_Java17/ws/src/sdks/java/container/build/target/third_party_licenses.>
Finished license_scripts.sh
> Task :sdks:java:container:goPrepare UP-TO-DATE
> Task :release:go-licenses:java:dockerRun
go: downloading google.golang.org/genproto v0.0.0-20230330154414-c0448cd141ea
go: downloading golang.org/x/net v0.8.0
go: downloading golang.org/x/text v0.8.0
go: added github.com/apache/beam/sdks/v2 v2.47.0
go: added github.com/golang/protobuf v1.5.3
go: added golang.org/x/net v0.8.0
go: added golang.org/x/sys v0.7.0
go: added golang.org/x/text v0.8.0
go: added google.golang.org/genproto v0.0.0-20230330154414-c0448cd141ea
go: added google.golang.org/grpc v1.54.0
go: added google.golang.org/protobuf v1.30.0
+ go-licenses save github.com/apache/beam/sdks/v2/java/container --save_path=/output/licenses
W0511 22:23:00.374069 36 library.go:101] "golang.org/x/sys/unix" contains non-Go code that can't be inspected for further dependencies:
/go/pkg/mod/golang.org/x/sys@v0.7.0/unix/asm_linux_amd64.s
+ go-licenses csv github.com/apache/beam/sdks/v2/java/container
+ tee /output/licenses/list.csv
W0511 22:23:04.579141 80 library.go:101] "golang.org/x/sys/unix" contains non-Go code that can't be inspected for further dependencies:
/go/pkg/mod/golang.org/x/sys@v0.7.0/unix/asm_linux_amd64.s
> Task :sdks:java:container:java17:copyJavaThirdPartyLicenses
> Task :sdks:java:container:goBuild
/home/jenkins/go/bin/go1.20.2 build -o ./build/target/linux_amd64/boot boot.go boot_test.go pathingjar.go pathingjar_test.go
> Task :release:go-licenses:java:dockerRun
github.com/apache/beam/sdks/v2/go,https://github.com/apache/beam/blob/sdks/v2.47.0/sdks/go/README.md,Apache-2.0
github.com/apache/beam/sdks/v2/java/container,https://github.com/apache/beam/blob/sdks/v2.47.0/sdks/LICENSE,Apache-2.0
github.com/golang/protobuf,https://github.com/golang/protobuf/blob/v1.5.3/LICENSE,BSD-3-Clause
golang.org/x/net,https://cs.opensource.google/go/x/net/+/v0.8.0:LICENSE,BSD-3-Clause
golang.org/x/sys/unix,https://cs.opensource.google/go/x/sys/+/v0.7.0:LICENSE,BSD-3-Clause
golang.org/x/text,https://cs.opensource.google/go/x/text/+/v0.8.0:LICENSE,BSD-3-Clause
google.golang.org/genproto/googleapis/rpc/status,https://github.com/googleapis/go-genproto/blob/c0448cd141ea/LICENSE,Apache-2.0
google.golang.org/grpc,https://github.com/grpc/grpc-go/blob/v1.54.0/LICENSE,Apache-2.0
google.golang.org/protobuf,https://github.com/protocolbuffers/protobuf-go/blob/v1.30.0/LICENSE,BSD-3-Clause
+ chmod -R a+w /output/licenses
> Task :sdks:java:container:java17:copySdkHarnessLauncher
Execution optimizations have been disabled for task ':sdks:java:container:java17:copySdkHarnessLauncher' to ensure correctness due to the following reasons:
- Gradle detected a problem with the following location: '<https://ci-beam.apache.org/job/beam_LoadTests_Java_ParDo_Dataflow_V2_Streaming_Java17/ws/src/sdks/java/container/build/target'.> Reason: Task ':sdks:java:container:java17:copySdkHarnessLauncher' uses this output of task ':sdks:java:container:downloadCloudProfilerAgent' without declaring an explicit or implicit dependency. This can lead to incorrect results being produced, depending on what order the tasks are executed. Please refer to https://docs.gradle.org/7.5.1/userguide/validation_problems.html#implicit_dependency for more details about this problem.
- Gradle detected a problem with the following location: '<https://ci-beam.apache.org/job/beam_LoadTests_Java_ParDo_Dataflow_V2_Streaming_Java17/ws/src/sdks/java/container/build/target'.> Reason: Task ':sdks:java:container:java17:copySdkHarnessLauncher' uses this output of task ':sdks:java:container:pullLicenses' without declaring an explicit or implicit dependency. This can lead to incorrect results being produced, depending on what order the tasks are executed. Please refer to https://docs.gradle.org/7.5.1/userguide/validation_problems.html#implicit_dependency for more details about this problem.
> Task :release:go-licenses:java:createLicenses
> Task :sdks:java:container:java17:copyGolangLicenses
> Task :sdks:java:container:java17:dockerPrepare
> Task :sdks:java:container:java17:docker
#1 [internal] load build definition from Dockerfile
#1 transferring dockerfile: 30B
#1 transferring dockerfile: 2.58kB done
#1 DONE 0.0s
#2 [internal] load .dockerignore
#2 transferring context: 2B done
#2 DONE 0.0s
#3 [internal] load metadata for docker.io/library/eclipse-temurin:17
#3 DONE 0.5s
#4 [ 1/16] FROM docker.io/library/eclipse-temurin:17@sha256:3722a7717ea57715bb4c0b259397a6ed6f7656dca778ad3c570c82581e5a319b
#4 resolve docker.io/library/eclipse-temurin:17@sha256:3722a7717ea57715bb4c0b259397a6ed6f7656dca778ad3c570c82581e5a319b 0.0s done
#4 CACHED
#5 [internal] load build context
#5 transferring context: 46.85MB 0.4s done
#5 DONE 0.4s
#6 [ 2/16] ADD target/slf4j-api.jar /opt/apache/beam/jars/
#6 DONE 1.3s
#7 [ 3/16] ADD target/slf4j-jdk14.jar /opt/apache/beam/jars/
#7 DONE 0.1s
#8 [ 4/16] ADD target/jcl-over-slf4j.jar /opt/apache/beam/jars/
#8 DONE 0.1s
#9 [ 5/16] ADD target/log4j-over-slf4j.jar /opt/apache/beam/jars/
#9 DONE 0.1s
#10 [ 6/16] ADD target/log4j-to-slf4j.jar /opt/apache/beam/jars/
#10 DONE 0.1s
#11 [ 7/16] ADD target/beam-sdks-java-harness.jar /opt/apache/beam/jars/
#11 DONE 0.1s
#12 [ 8/16] COPY target/jamm.jar target/open-module-agent*.jar /opt/apache/beam/jars/
#12 DONE 0.1s
#13 [ 9/16] COPY target/linux_amd64/boot /opt/apache/beam/
#13 DONE 0.2s
#14 [10/16] COPY target/LICENSE /opt/apache/beam/
#14 DONE 0.1s
#15 [11/16] COPY target/NOTICE /opt/apache/beam/
#15 DONE 0.1s
#16 [12/16] ADD target/third_party_licenses /opt/apache/beam/third_party_licenses/
#16 DONE 0.2s
#17 [13/16] COPY target/LICENSE target/options/* /opt/apache/beam/options/
#17 DONE 0.1s
#18 [14/16] COPY target/go-licenses/* /opt/apache/beam/third_party_licenses/golang/
#18 DONE 0.1s
#19 [15/16] RUN if [ "true" = "false" ] ; then rm -rf /opt/apache/beam/third_party_licenses ; fi
#19 DONE 0.4s
#20 [16/16] COPY target/profiler/* /opt/google_cloud_profiler/
#20 DONE 0.1s
#21 exporting to image
#21 exporting layers
#21 exporting layers 0.3s done
#21 writing image sha256:2f49e751c91252f1683bc42ec36b848ac7d43cd4c45e8214851e54caa1ba0e78 done
#21 naming to docker.io/apache/beam_java17_sdk:2.48.0.dev done
#21 DONE 0.4s
> Task :runners:google-cloud-dataflow-java:buildAndPushDockerJavaContainer
WARNING: `gcloud docker` will not be supported for Docker client versions above 18.03.
As an alternative, use `gcloud auth configure-docker` to configure `docker` to
use `gcloud` as a credential helper, then use `docker` as you would for non-GCR
registries, e.g. `docker pull gcr.io/project-id/my-image`. Add
`--verbosity=error` to silence this warning: `gcloud docker
--verbosity=error -- pull gcr.io/project-id/my-image`.
See: https://cloud.google.com/container-registry/docs/support/deprecation-notices#gcloud-docker
The push refers to repository [us.gcr.io/apache-beam-testing/java-postcommit-it/java]
d6fb1b176a8c: Preparing
5f70bf18a086: Preparing
2f655ace998a: Preparing
19d6f2daf9e9: Preparing
a914e4c8a89c: Preparing
78a45874f68c: Preparing
368a95d0d1f9: Preparing
1e9d336dfe15: Preparing
268c7838e137: Preparing
dd4dfe5b1b13: Preparing
497158dc0eb6: Preparing
8ad7d13165d9: Preparing
85e8c565e4e7: Preparing
114e2f06ff6b: Preparing
862efffb539b: Preparing
57b27cfbd6e6: Preparing
b421f864ecf0: Preparing
b09de1b6a666: Preparing
b8a36d10656a: Preparing
368a95d0d1f9: Waiting
1e9d336dfe15: Waiting
268c7838e137: Waiting
57b27cfbd6e6: Waiting
dd4dfe5b1b13: Waiting
497158dc0eb6: Waiting
b421f864ecf0: Waiting
8ad7d13165d9: Waiting
b09de1b6a666: Waiting
85e8c565e4e7: Waiting
114e2f06ff6b: Waiting
862efffb539b: Waiting
b8a36d10656a: Waiting
78a45874f68c: Waiting
5f70bf18a086: Layer already exists
19d6f2daf9e9: Pushed
2f655ace998a: Pushed
78a45874f68c: Pushed
a914e4c8a89c: Pushed
d6fb1b176a8c: Pushed
368a95d0d1f9: Pushed
268c7838e137: Pushed
8ad7d13165d9: Pushed
dd4dfe5b1b13: Pushed
497158dc0eb6: Pushed
57b27cfbd6e6: Layer already exists
1e9d336dfe15: Pushed
b421f864ecf0: Layer already exists
b09de1b6a666: Layer already exists
b8a36d10656a: Layer already exists
85e8c565e4e7: Pushed
114e2f06ff6b: Pushed
862efffb539b: Pushed
unknown blob
> Task :runners:google-cloud-dataflow-java:buildAndPushDockerJavaContainer FAILED
FAILURE: Build failed with an exception.
* Where:
Build file '<https://ci-beam.apache.org/job/beam_LoadTests_Java_ParDo_Dataflow_V2_Streaming_Java17/ws/src/runners/google-cloud-dataflow-java/build.gradle'> line: 290
* What went wrong:
Execution failed for task ':runners:google-cloud-dataflow-java:buildAndPushDockerJavaContainer'.
> Process 'command 'gcloud'' finished with non-zero exit value 1
* Try:
> Run with --stacktrace option to get the stack trace.
> Run with --info or --debug option to get more log output.
* Get more help at https://help.gradle.org
Deprecated Gradle features were used in this build, making it incompatible with Gradle 8.0.
You can use '--warning-mode all' to show the individual deprecation warnings and determine if they come from your own scripts or plugins.
See https://docs.gradle.org/7.5.1/userguide/command_line_interface.html#sec:command_line_warnings
Execution optimizations have been disabled for 1 invalid unit(s) of work during this build to ensure correctness.
Please consult deprecation warnings for more details.
BUILD FAILED in 1m 6s
114 actionable tasks: 75 executed, 35 from cache, 4 up-to-date
Build scan background action failed.
java.lang.IllegalArgumentException: com.gradle.enterprise.gradleplugin.internal.extension.a is not an interface
at java.lang.reflect.Proxy$ProxyClassFactory.apply(Proxy.java:590)
at java.lang.reflect.Proxy$ProxyClassFactory.apply(Proxy.java:557)
at java.lang.reflect.WeakCache$Factory.get(WeakCache.java:230)
at java.lang.reflect.WeakCache.get(WeakCache.java:127)
at java.lang.reflect.Proxy.getProxyClass0(Proxy.java:419)
at java.lang.reflect.Proxy.newProxyInstance(Proxy.java:719)
at com.gradle.ProxyFactory$ProxyingInvocationHandler.createLocalProxy(ProxyFactory.java:66)
at com.gradle.ProxyFactory$ProxyingInvocationHandler.lambda$adaptActionArg$1(ProxyFactory.java:61)
at com.gradle.enterprise.gradleplugin.internal.extension.b$3.run(SourceFile:100)
at java.util.concurrent.Executors$RunnableAdapter.call(Executors.java:511)
at java.util.concurrent.FutureTask.run(FutureTask.java:266)
at java.util.concurrent.ThreadPoolExecutor.runWorker(ThreadPoolExecutor.java:1149)
at java.util.concurrent.ThreadPoolExecutor$Worker.run(ThreadPoolExecutor.java:624)
at java.lang.Thread.run(Thread.java:750)
Publishing build scan...
https://ge.apache.org/s/eeoxuvo4j3kxy
Build step 'Invoke Gradle script' changed build result to FAILURE
Build step 'Invoke Gradle script' marked build as failure
---------------------------------------------------------------------
To unsubscribe, e-mail: builds-unsubscribe@beam.apache.org
For additional commands, e-mail: builds-help@beam.apache.org
Jenkins build is back to normal : beam_LoadTests_Java_ParDo_Dataflow_V2_Streaming_Java17 #506
Posted by Apache Jenkins Server <je...@builds.apache.org>.
See <https://ci-beam.apache.org/job/beam_LoadTests_Java_ParDo_Dataflow_V2_Streaming_Java17/506/display/redirect>
---------------------------------------------------------------------
To unsubscribe, e-mail: builds-unsubscribe@beam.apache.org
For additional commands, e-mail: builds-help@beam.apache.org