You are viewing a plain text version of this content. The canonical link for it is here.
Posted to builds@solr.apache.org by Apache Jenkins Server <je...@builds.apache.org> on 2026/05/09 02:25:15 UTC
[JENKINS] Solr » Solr-TestIntegration-main - Build # 545 - Still Failing!
Build: https://ci-builds.apache.org/job/Solr/job/Solr-TestIntegration-main/545/
No tests ran.
Build Log:
[...truncated 434 lines...]
# ERROR: Server refused connection at: http://localhost:34335/solr/test_args/update
#
# org.apache.solr.client.solrj.SolrServerException: Server refused connection at: http://localhost:34335/solr/test_args/update
# at org.apache.solr.client.solrj.jetty.HttpJettySolrClient.request(HttpJettySolrClient.java:506)
# at org.apache.solr.client.solrj.SolrRequest.process(SolrRequest.java:302)
# at org.apache.solr.client.solrj.SolrClient.commit(SolrClient.java:466)
# at org.apache.solr.client.solrj.SolrClient.commit(SolrClient.java:442)
# at org.apache.solr.cli.PostTool.commit(PostTool.java:778)
# at org.apache.solr.cli.PostTool.execute(PostTool.java:346)
# at org.apache.solr.cli.PostTool.runImpl(PostTool.java:320)
# at org.apache.solr.cli.ToolBase.runTool(ToolBase.java:92)
# at org.apache.solr.cli.SolrCLI.main(SolrCLI.java:117)
# Caused by: java.net.ConnectException: Connection refused
# at java.base/sun.nio.ch.Net.pollConnect(Native Method)
# at java.base/sun.nio.ch.Net.pollConnectNow(Net.java:682)
# at java.base/sun.nio.ch.SocketChannelImpl.finishTimedConnect(SocketChannelImpl.java:1191)
# at java.base/sun.nio.ch.SocketChannelImpl.blockingConnect(SocketChannelImpl.java:1233)
# at java.base/sun.nio.ch.SocketAdaptor.connect(SocketAdaptor.java:102)
# at org.eclipse.jetty.io.ClientConnector.connect(ClientConnector.java:467)
# at org.eclipse.jetty.io.Transport$Socket.connect(Transport.java:175)
# at org.eclipse.jetty.http2.client.HTTP2Client.connect(HTTP2Client.java:486)
# at org.eclipse.jetty.http2.client.transport.HttpClientTransportOverHTTP2.connect(HttpClientTransportOverHTTP2.java:140)
# at org.eclipse.jetty.http2.client.transport.HttpClientTransportOverHTTP2.connect(HttpClientTransportOverHTTP2.java:128)
# at org.eclipse.jetty.client.HttpClient$1.connect(HttpClient.java:579)
# at org.eclipse.jetty.client.HttpClient$1.succeeded(HttpClient.java:556)
# at org.eclipse.jetty.client.HttpClient$1.succeeded(HttpClient.java:552)
# at org.eclipse.jetty.util.SocketAddressResolver$Async.lambda$resolve$0(SocketAddressResolver.java:186)
# at org.apache.solr.common.util.ExecutorUtil$MDCAwareThreadPoolExecutor.lambda$execute$0(ExecutorUtil.java:381)
# at java.base/java.util.concurrent.ThreadPoolExecutor.runWorker(ThreadPoolExecutor.java:1144)
# at java.base/java.util.concurrent.ThreadPoolExecutor$Worker.run(ThreadPoolExecutor.java:642)
# at java.base/java.lang.Thread.run(Thread.java:1583)
# --
#
# Please find the SOLR_HOME snapshot for failed test #10 at: /home/jenkins/jenkins-agent/workspace/Solr/Solr-TestIntegration-main/solr/packaging/build/test-output/failure-snapshots/79-10
# Last output:
# POSTing args to http://localhost:34335/solr/test_args/update...
# PostTool: WARNING: IOException while reading response: java.net.SocketException: Connection reset
# COMMITting Solr index changes to http://localhost:34335/solr/test_args/update...
#
# ERROR: Server refused connection at: http://localhost:34335/solr/test_args/update
#
# org.apache.solr.client.solrj.SolrServerException: Server refused connection at: http://localhost:34335/solr/test_args/update
# at org.apache.solr.client.solrj.jetty.HttpJettySolrClient.request(HttpJettySolrClient.java:506)
# at org.apache.solr.client.solrj.SolrRequest.process(SolrRequest.java:302)
# at org.apache.solr.client.solrj.SolrClient.commit(SolrClient.java:466)
# at org.apache.solr.client.solrj.SolrClient.commit(SolrClient.java:442)
# at org.apache.solr.cli.PostTool.commit(PostTool.java:778)
# at org.apache.solr.cli.PostTool.execute(PostTool.java:346)
# at org.apache.solr.cli.PostTool.runImpl(PostTool.java:320)
# at org.apache.solr.cli.ToolBase.runTool(ToolBase.java:92)
# at org.apache.solr.cli.SolrCLI.main(SolrCLI.java:117)
# Caused by: java.net.ConnectException: Connection refused
# at java.base/sun.nio.ch.Net.pollConnect(Native Method)
# at java.base/sun.nio.ch.Net.pollConnectNow(Net.java:682)
# at java.base/sun.nio.ch.SocketChannelImpl.finishTimedConnect(SocketChannelImpl.java:1191)
# at java.base/sun.nio.ch.SocketChannelImpl.blockingConnect(SocketChannelImpl.java:1233)
# at java.base/sun.nio.ch.SocketAdaptor.connect(SocketAdaptor.java:102)
# at org.eclipse.jetty.io.ClientConnector.connect(ClientConnector.java:467)
# at org.eclipse.jetty.io.Transport$Socket.connect(Transport.java:175)
# at org.eclipse.jetty.http2.client.HTTP2Client.connect(HTTP2Client.java:486)
# at org.eclipse.jetty.http2.client.transport.HttpClientTransportOverHTTP2.connect(HttpClientTransportOverHTTP2.java:140)
# at org.eclipse.jetty.http2.client.transport.HttpClientTransportOverHTTP2.connect(HttpClientTransportOverHTTP2.java:128)
# at org.eclipse.jetty.client.HttpClient$1.connect(HttpClient.java:579)
# at org.eclipse.jetty.client.HttpClient$1.succeeded(HttpClient.java:556)
# at org.eclipse.jetty.client.HttpClient$1.succeeded(HttpClient.java:552)
# at org.eclipse.jetty.util.SocketAddressResolver$Async.lambda$resolve$0(SocketAddressResolver.java:186)
# at org.apache.solr.common.util.ExecutorUtil$MDCAwareThreadPoolExecutor.lambda$execute$0(ExecutorUtil.java:381)
# at java.base/java.util.concurrent.ThreadPoolExecutor.runWorker(ThreadPoolExecutor.java:1144)
# at java.base/java.util.concurrent.ThreadPoolExecutor$Worker.run(ThreadPoolExecutor.java:642)
# at java.base/java.lang.Thread.run(Thread.java:1583)
not ok 80 stdin mode # in 1055 ms
# (from function `assert_output' in file .gradle/node/node_modules/bats-assert/src/assert.bash, line 247,
# in test file test/test_post.bats, line 201)
# `assert_output --partial "Created collection 'test_stdin'"' failed
#
# -- output does not contain substring --
# substring (1 lines):
# Created collection 'test_stdin'
# output (3 lines):
# Neither --zk-host or --solr-url parameters, nor ZK_HOST env var provided, so assuming solr url is http://localhost:34335.
#
# ERROR: Server refused connection at: http://localhost:34335/solr/admin/info/system
# --
#
# Please find the SOLR_HOME snapshot for failed test #11 at: /home/jenkins/jenkins-agent/workspace/Solr/Solr-TestIntegration-main/solr/packaging/build/test-output/failure-snapshots/80-11
# Last output:
# Neither --zk-host or --solr-url parameters, nor ZK_HOST env var provided, so assuming solr url is http://localhost:34335.
#
# ERROR: Server refused connection at: http://localhost:34335/solr/admin/info/system
not ok 81 verbose echo the Solr response # in 1048 ms
# (from function `assert_output' in file .gradle/node/node_modules/bats-assert/src/assert.bash, line 247,
# in test file test/test_post.bats, line 210)
# `assert_output --partial "Created collection 'monitors_verbose'"' failed
#
# -- output does not contain substring --
# substring (1 lines):
# Created collection 'monitors_verbose'
# output (3 lines):
# Neither --zk-host or --solr-url parameters, nor ZK_HOST env var provided, so assuming solr url is http://localhost:34335.
#
# ERROR: Server refused connection at: http://localhost:34335/solr/admin/info/system
# --
#
# Please find the SOLR_HOME snapshot for failed test #12 at: /home/jenkins/jenkins-agent/workspace/Solr/Solr-TestIntegration-main/solr/packaging/build/test-output/failure-snapshots/81-12
# Last output:
# Neither --zk-host or --solr-url parameters, nor ZK_HOST env var provided, so assuming solr url is http://localhost:34335.
#
# ERROR: Server refused connection at: http://localhost:34335/solr/admin/info/system
ok 82 post solr log into solr via cli # in 8721 ms
# Docker artifacts saved to: /home/jenkins/jenkins-agent/workspace/Solr/Solr-TestIntegration-main/solr/packaging/build/test-output/docker
ok 83 Docker SolrCloud rolling upgrade # in 88157 ms
ok 84 allowPaths - backup # in 14602 ms
ok 85 snapshot lifecycle # in 4505 ms
ok 86 snapshot list # in 3158 ms
ok 87 snapshot describe # in 3163 ms
ok 88 start solr with ssl # in 15742 ms
ok 89 use different hostname when not checking peer-name # in 23458 ms
ok 90 start solr with ssl and auth # in 14046 ms
ok 91 start solr with client truststore and security manager # in 16013 ms
ok 92 start solr with mTLS needed # in 46297 ms
ok 93 start solr with mTLS wanted # in 32595 ms
ok 94 test keystore reload # in 55950 ms
ok 95 SOLR-11740 check 'solr stop' connection # in 15478 ms
ok 96 stop command for single port # in 17877 ms
ok 97 check stop command doesn't hang # skip timeout utility is not available
ok 98 SOLR-16976 solr starts with remote JMX enabled # in 7935 ms
ok 99 deprecated system properties converted to modern properties # in 195125 ms
ok 100 start with custom jetty options # in 7921 ms
ok 101 bootstrapping a configset # in 9002 ms
ok 102 status detects locally running solr # in 9100 ms
ok 103 status with --solr-url from user # in 7849 ms
ok 104 status with --port from user # in 7889 ms
ok 105 multiple connection options are prevented # in 820 ms
ok 106 status with invalid --solr-url from user # in 1273 ms
ok 107 status with --short format # in 195822 ms
ok 108 searching solr via locally executed streaming expression # in 1624 ms
ok 109 searching solr via remotely executed streaming expression # in 1178 ms
ok 110 variable interpolation # in 1588 ms
ok 111 searching solr without credentials fails with error # in 1084 ms
ok 112 --version returns Solr version # in 685 ms
ok 113 version as direct tool call still runs # in 689 ms
ok 114 short help # in 717 ms
ok 115 short help is inferred # in 720 ms
ok 116 long help # in 720 ms
ok 117 running subcommands with zk is prevented # in 680 ms
ok 118 listing out files # in 2067 ms
ok 119 connecting to solr via various solr urls and zk hosts # in 7585 ms
ok 120 copying files around # in 10589 ms
ok 121 upconfig # in 2415 ms
ok 122 SOLR-12429 test upconfig fails with symlink # in 1039 ms
ok 123 downconfig # in 1099 ms
ok 124 bin/solr zk cp gets 'solrhome' from '--solr-home' command line option # in 1346 ms
ok 125 env var ZK_HOST is honored # in 3047 ms
ok 126 Cleanup # in 1807 ms
> Task :solr:packaging:integrationTests FAILED
FAILURE: Build failed with an exception.
* Where:
Build file '/home/jenkins/jenkins-agent/workspace/Solr/Solr-TestIntegration-main/solr/packaging/build.gradle' line: 342
* What went wrong:
Execution failed for task ':solr:packaging:integrationTests'.
> Process 'command '/home/jenkins/jenkins-agent/workspace/Solr/Solr-TestIntegration-main/solr/packaging/.gradle/node/node_modules/bats/bin/bats'' finished with non-zero exit value 1
* Try:
> Run with --stacktrace option to get the stack trace.
> Run with --info or --debug option to get more log output.
> Get more help at https://help.gradle.org.
Deprecated Gradle features were used in this build, making it incompatible with Gradle 9.0.
You can use '--warning-mode all' to show the individual deprecation warnings and determine if they come from your own scripts or plugins.
For more on this, please refer to https://docs.gradle.org/8.10/userguide/command_line_interface.html#sec:command_line_warnings in the Gradle documentation.
BUILD FAILED in 30m 59s
130 actionable tasks: 130 executed
Publishing Build Scan to Develocity...
https://develocity.apache.org/s/aszft5ea57a3o
Build step 'Invoke Gradle script' changed build result to FAILURE
Build step 'Invoke Gradle script' marked build as failure
Archiving artifacts
Email was triggered for: Failure - Any
Sending email for trigger: Failure - Any
[JENKINS] Solr » Solr-TestIntegration-main - Build # 552 - Still Failing!
Posted by Apache Jenkins Server <je...@builds.apache.org>.
Build: https://ci-builds.apache.org/job/Solr/job/Solr-TestIntegration-main/552/
No tests ran.
Build Log:
[...truncated 435 lines...]
# ERROR: Server refused connection at: http://localhost:43305/solr/test_args/update
#
# org.apache.solr.client.solrj.SolrServerException: Server refused connection at: http://localhost:43305/solr/test_args/update
# at org.apache.solr.client.solrj.jetty.HttpJettySolrClient.request(HttpJettySolrClient.java:506)
# at org.apache.solr.client.solrj.SolrRequest.process(SolrRequest.java:302)
# at org.apache.solr.client.solrj.SolrClient.commit(SolrClient.java:466)
# at org.apache.solr.client.solrj.SolrClient.commit(SolrClient.java:442)
# at org.apache.solr.cli.PostTool.commit(PostTool.java:778)
# at org.apache.solr.cli.PostTool.execute(PostTool.java:346)
# at org.apache.solr.cli.PostTool.runImpl(PostTool.java:320)
# at org.apache.solr.cli.ToolBase.runTool(ToolBase.java:92)
# at org.apache.solr.cli.SolrCLI.main(SolrCLI.java:117)
# Caused by: java.net.ConnectException: Connection refused
# at java.base/sun.nio.ch.Net.pollConnect(Native Method)
# at java.base/sun.nio.ch.Net.pollConnectNow(Net.java:682)
# at java.base/sun.nio.ch.SocketChannelImpl.finishTimedConnect(SocketChannelImpl.java:1191)
# at java.base/sun.nio.ch.SocketChannelImpl.blockingConnect(SocketChannelImpl.java:1233)
# at java.base/sun.nio.ch.SocketAdaptor.connect(SocketAdaptor.java:102)
# at org.eclipse.jetty.io.ClientConnector.connect(ClientConnector.java:467)
# at org.eclipse.jetty.io.Transport$Socket.connect(Transport.java:175)
# at org.eclipse.jetty.http2.client.HTTP2Client.connect(HTTP2Client.java:486)
# at org.eclipse.jetty.http2.client.transport.HttpClientTransportOverHTTP2.connect(HttpClientTransportOverHTTP2.java:140)
# at org.eclipse.jetty.http2.client.transport.HttpClientTransportOverHTTP2.connect(HttpClientTransportOverHTTP2.java:128)
# at org.eclipse.jetty.client.HttpClient$1.connect(HttpClient.java:579)
# at org.eclipse.jetty.client.HttpClient$1.succeeded(HttpClient.java:556)
# at org.eclipse.jetty.client.HttpClient$1.succeeded(HttpClient.java:552)
# at org.eclipse.jetty.util.SocketAddressResolver$Async.lambda$resolve$0(SocketAddressResolver.java:186)
# at org.apache.solr.common.util.ExecutorUtil$MDCAwareThreadPoolExecutor.lambda$execute$0(ExecutorUtil.java:408)
# at java.base/java.util.concurrent.ThreadPoolExecutor.runWorker(ThreadPoolExecutor.java:1144)
# at java.base/java.util.concurrent.ThreadPoolExecutor$Worker.run(ThreadPoolExecutor.java:642)
# at java.base/java.lang.Thread.run(Thread.java:1583)
# --
#
# Please find the SOLR_HOME snapshot for failed test #10 at: /home/jenkins/jenkins-agent/workspace/Solr/Solr-TestIntegration-main/solr/packaging/build/test-output/failure-snapshots/79-10
# Last output:
# POSTing args to http://localhost:43305/solr/test_args/update...
# PostTool: WARNING: IOException while reading response: java.net.SocketException: Unexpected end of file from server
# COMMITting Solr index changes to http://localhost:43305/solr/test_args/update...
#
# ERROR: Server refused connection at: http://localhost:43305/solr/test_args/update
#
# org.apache.solr.client.solrj.SolrServerException: Server refused connection at: http://localhost:43305/solr/test_args/update
# at org.apache.solr.client.solrj.jetty.HttpJettySolrClient.request(HttpJettySolrClient.java:506)
# at org.apache.solr.client.solrj.SolrRequest.process(SolrRequest.java:302)
# at org.apache.solr.client.solrj.SolrClient.commit(SolrClient.java:466)
# at org.apache.solr.client.solrj.SolrClient.commit(SolrClient.java:442)
# at org.apache.solr.cli.PostTool.commit(PostTool.java:778)
# at org.apache.solr.cli.PostTool.execute(PostTool.java:346)
# at org.apache.solr.cli.PostTool.runImpl(PostTool.java:320)
# at org.apache.solr.cli.ToolBase.runTool(ToolBase.java:92)
# at org.apache.solr.cli.SolrCLI.main(SolrCLI.java:117)
# Caused by: java.net.ConnectException: Connection refused
# at java.base/sun.nio.ch.Net.pollConnect(Native Method)
# at java.base/sun.nio.ch.Net.pollConnectNow(Net.java:682)
# at java.base/sun.nio.ch.SocketChannelImpl.finishTimedConnect(SocketChannelImpl.java:1191)
# at java.base/sun.nio.ch.SocketChannelImpl.blockingConnect(SocketChannelImpl.java:1233)
# at java.base/sun.nio.ch.SocketAdaptor.connect(SocketAdaptor.java:102)
# at org.eclipse.jetty.io.ClientConnector.connect(ClientConnector.java:467)
# at org.eclipse.jetty.io.Transport$Socket.connect(Transport.java:175)
# at org.eclipse.jetty.http2.client.HTTP2Client.connect(HTTP2Client.java:486)
# at org.eclipse.jetty.http2.client.transport.HttpClientTransportOverHTTP2.connect(HttpClientTransportOverHTTP2.java:140)
# at org.eclipse.jetty.http2.client.transport.HttpClientTransportOverHTTP2.connect(HttpClientTransportOverHTTP2.java:128)
# at org.eclipse.jetty.client.HttpClient$1.connect(HttpClient.java:579)
# at org.eclipse.jetty.client.HttpClient$1.succeeded(HttpClient.java:556)
# at org.eclipse.jetty.client.HttpClient$1.succeeded(HttpClient.java:552)
# at org.eclipse.jetty.util.SocketAddressResolver$Async.lambda$resolve$0(SocketAddressResolver.java:186)
# at org.apache.solr.common.util.ExecutorUtil$MDCAwareThreadPoolExecutor.lambda$execute$0(ExecutorUtil.java:408)
# at java.base/java.util.concurrent.ThreadPoolExecutor.runWorker(ThreadPoolExecutor.java:1144)
# at java.base/java.util.concurrent.ThreadPoolExecutor$Worker.run(ThreadPoolExecutor.java:642)
# at java.base/java.lang.Thread.run(Thread.java:1583)
not ok 80 stdin mode # in 1141 ms
# (from function `assert_output' in file .gradle/node/node_modules/bats-assert/src/assert.bash, line 247,
# in test file test/test_post.bats, line 201)
# `assert_output --partial "Created collection 'test_stdin'"' failed
#
# -- output does not contain substring --
# substring (1 lines):
# Created collection 'test_stdin'
# output (3 lines):
# Neither --zk-host or --solr-url parameters, nor ZK_HOST env var provided, so assuming solr url is http://localhost:43305.
#
# ERROR: Server refused connection at: http://localhost:43305/solr/admin/info/system
# --
#
# Please find the SOLR_HOME snapshot for failed test #11 at: /home/jenkins/jenkins-agent/workspace/Solr/Solr-TestIntegration-main/solr/packaging/build/test-output/failure-snapshots/80-11
# Last output:
# Neither --zk-host or --solr-url parameters, nor ZK_HOST env var provided, so assuming solr url is http://localhost:43305.
#
# ERROR: Server refused connection at: http://localhost:43305/solr/admin/info/system
not ok 81 verbose echo the Solr response # in 1128 ms
# (from function `assert_output' in file .gradle/node/node_modules/bats-assert/src/assert.bash, line 247,
# in test file test/test_post.bats, line 210)
# `assert_output --partial "Created collection 'monitors_verbose'"' failed
#
# -- output does not contain substring --
# substring (1 lines):
# Created collection 'monitors_verbose'
# output (3 lines):
# Neither --zk-host or --solr-url parameters, nor ZK_HOST env var provided, so assuming solr url is http://localhost:43305.
#
# ERROR: Server refused connection at: http://localhost:43305/solr/admin/info/system
# --
#
# Please find the SOLR_HOME snapshot for failed test #12 at: /home/jenkins/jenkins-agent/workspace/Solr/Solr-TestIntegration-main/solr/packaging/build/test-output/failure-snapshots/81-12
# Last output:
# Neither --zk-host or --solr-url parameters, nor ZK_HOST env var provided, so assuming solr url is http://localhost:43305.
#
# ERROR: Server refused connection at: http://localhost:43305/solr/admin/info/system
ok 82 post solr log into solr via cli # in 9582 ms
# Docker artifacts saved to: /home/jenkins/jenkins-agent/workspace/Solr/Solr-TestIntegration-main/solr/packaging/build/test-output/docker
ok 83 Docker SolrCloud rolling upgrade # in 60685 ms
ok 84 allowPaths - backup # in 17271 ms
ok 85 snapshot lifecycle # in 5300 ms
ok 86 snapshot list # in 3428 ms
ok 87 snapshot describe # in 3434 ms
ok 88 start solr with ssl # in 16594 ms
ok 89 use different hostname when not checking peer-name # in 24925 ms
ok 90 start solr with ssl and auth # in 14839 ms
ok 91 start solr with client truststore and security manager # in 16791 ms
ok 92 start solr with mTLS needed # in 46788 ms
ok 93 start solr with mTLS wanted # in 35127 ms
ok 94 test keystore reload # in 60010 ms
ok 95 SOLR-11740 check 'solr stop' connection # in 16239 ms
ok 96 stop command for single port # in 18680 ms
ok 97 check stop command doesn't hang # skip timeout utility is not available
ok 98 SOLR-16976 solr starts with remote JMX enabled # in 8263 ms
ok 99 deprecated system properties converted to modern properties # in 195085 ms
ok 100 start with custom jetty options # in 8333 ms
ok 101 bootstrapping a configset # in 9348 ms
ok 102 status detects locally running solr # in 9819 ms
ok 103 status with --solr-url from user # in 8348 ms
ok 104 status with --port from user # in 8241 ms
ok 105 multiple connection options are prevented # in 885 ms
ok 106 status with invalid --solr-url from user # in 1251 ms
ok 107 status with --short format # in 195963 ms
ok 108 searching solr via locally executed streaming expression # in 1761 ms
ok 109 searching solr via remotely executed streaming expression # in 1257 ms
ok 110 variable interpolation # in 1701 ms
ok 111 searching solr without credentials fails with error # in 1135 ms
ok 112 --version returns Solr version # in 769 ms
ok 113 version as direct tool call still runs # in 744 ms
ok 114 short help # in 822 ms
ok 115 short help is inferred # in 768 ms
ok 116 long help # in 799 ms
ok 117 running subcommands with zk is prevented # in 736 ms
ok 118 listing out files # in 2148 ms
ok 119 connecting to solr via various solr urls and zk hosts # in 8196 ms
ok 120 copying files around # in 10998 ms
ok 121 upconfig # in 2500 ms
ok 122 SOLR-12429 test upconfig fails with symlink # in 1124 ms
ok 123 downconfig # in 1180 ms
ok 124 bin/solr zk cp gets 'solrhome' from '--solr-home' command line option # in 1448 ms
ok 125 env var ZK_HOST is honored # in 3179 ms
ok 126 Cleanup # in 1845 ms
> Task :solr:packaging:integrationTests FAILED
FAILURE: Build failed with an exception.
* Where:
Build file '/home/jenkins/jenkins-agent/workspace/Solr/Solr-TestIntegration-main/solr/packaging/build.gradle' line: 342
* What went wrong:
Execution failed for task ':solr:packaging:integrationTests'.
> Process 'command '/home/jenkins/jenkins-agent/workspace/Solr/Solr-TestIntegration-main/solr/packaging/.gradle/node/node_modules/bats/bin/bats'' finished with non-zero exit value 1
* Try:
> Run with --stacktrace option to get the stack trace.
> Run with --info or --debug option to get more log output.
> Get more help at https://help.gradle.org.
Deprecated Gradle features were used in this build, making it incompatible with Gradle 9.0.
You can use '--warning-mode all' to show the individual deprecation warnings and determine if they come from your own scripts or plugins.
For more on this, please refer to https://docs.gradle.org/8.10/userguide/command_line_interface.html#sec:command_line_warnings in the Gradle documentation.
BUILD FAILED in 32m 11s
130 actionable tasks: 130 executed
Publishing Build Scan to Develocity...
https://develocity.apache.org/s/avqzjoh3pr2f4
Build step 'Invoke Gradle script' changed build result to FAILURE
Build step 'Invoke Gradle script' marked build as failure
Archiving artifacts
Email was triggered for: Failure - Any
Sending email for trigger: Failure - Any
[JENKINS] Solr » Solr-TestIntegration-main - Build # 551 - Still Failing!
Posted by Apache Jenkins Server <je...@builds.apache.org>.
Build: https://ci-builds.apache.org/job/Solr/job/Solr-TestIntegration-main/551/
No tests ran.
Build Log:
[...truncated 454 lines...]
# ERROR: Server refused connection at: http://localhost:39431/solr/admin/info/system
# --
#
# Please find the SOLR_HOME snapshot for failed test #11 at: /home/jenkins/jenkins-agent/workspace/Solr/Solr-TestIntegration-main/solr/packaging/build/test-output/failure-snapshots/80-11
# Last output:
# Neither --zk-host or --solr-url parameters, nor ZK_HOST env var provided, so assuming solr url is http://localhost:39431.
#
# ERROR: Server refused connection at: http://localhost:39431/solr/admin/info/system
not ok 81 verbose echo the Solr response # in 1150 ms
# (from function `assert_output' in file .gradle/node/node_modules/bats-assert/src/assert.bash, line 247,
# in test file test/test_post.bats, line 210)
# `assert_output --partial "Created collection 'monitors_verbose'"' failed
#
# -- output does not contain substring --
# substring (1 lines):
# Created collection 'monitors_verbose'
# output (3 lines):
# Neither --zk-host or --solr-url parameters, nor ZK_HOST env var provided, so assuming solr url is http://localhost:39431.
#
# ERROR: Server refused connection at: http://localhost:39431/solr/admin/info/system
# --
#
# Please find the SOLR_HOME snapshot for failed test #12 at: /home/jenkins/jenkins-agent/workspace/Solr/Solr-TestIntegration-main/solr/packaging/build/test-output/failure-snapshots/81-12
# Last output:
# Neither --zk-host or --solr-url parameters, nor ZK_HOST env var provided, so assuming solr url is http://localhost:39431.
#
# ERROR: Server refused connection at: http://localhost:39431/solr/admin/info/system
ok 82 post solr log into solr via cli # in 9703 ms
# Docker artifacts saved to: /home/jenkins/jenkins-agent/workspace/Solr/Solr-TestIntegration-main/solr/packaging/build/test-output/docker
ok 83 Docker SolrCloud rolling upgrade # in 97800 ms
ok 84 allowPaths - backup # in 16433 ms
ok 85 snapshot lifecycle # in 5206 ms
ok 86 snapshot list # in 3751 ms
ok 87 snapshot describe # in 3597 ms
ok 88 start solr with ssl # in 17720 ms
ok 89 use different hostname when not checking peer-name # in 26202 ms
ok 90 start solr with ssl and auth # in 15697 ms
ok 91 start solr with client truststore and security manager # in 17895 ms
ok 92 start solr with mTLS needed # in 48605 ms
ok 93 start solr with mTLS wanted # in 37372 ms
ok 94 test keystore reload # in 62307 ms
ok 95 SOLR-11740 check 'solr stop' connection # in 16795 ms
ok 96 stop command for single port # in 19472 ms
ok 97 check stop command doesn't hang # skip timeout utility is not available
ok 98 SOLR-16976 solr starts with remote JMX enabled # in 9075 ms
ok 99 deprecated system properties converted to modern properties # in 195161 ms
ok 100 start with custom jetty options # in 9158 ms
ok 101 bootstrapping a configset # in 9954 ms
ok 102 status detects locally running solr # in 10403 ms
ok 103 status with --solr-url from user # in 8823 ms
ok 104 status with --port from user # in 8654 ms
ok 105 multiple connection options are prevented # in 926 ms
ok 106 status with invalid --solr-url from user # in 1284 ms
ok 107 status with --short format # in 196581 ms
ok 108 searching solr via locally executed streaming expression # in 1882 ms
ok 109 searching solr via remotely executed streaming expression # in 1349 ms
ok 110 variable interpolation # in 1815 ms
ok 111 searching solr without credentials fails with error # in 1260 ms
ok 112 --version returns Solr version # in 791 ms
ok 113 version as direct tool call still runs # in 777 ms
ok 114 short help # in 839 ms
ok 115 short help is inferred # in 829 ms
ok 116 long help # in 849 ms
ok 117 running subcommands with zk is prevented # in 778 ms
ok 118 listing out files # in 2200 ms
ok 119 connecting to solr via various solr urls and zk hosts # in 8436 ms
ok 120 copying files around # in 11423 ms
ok 121 upconfig # in 2618 ms
ok 122 SOLR-12429 test upconfig fails with symlink # in 1253 ms
ok 123 downconfig # in 1248 ms
ok 124 bin/solr zk cp gets 'solrhome' from '--solr-home' command line option # in 1532 ms
ok 125 env var ZK_HOST is honored # in 3324 ms
ok 126 Cleanup # in 1922 ms
> Task :solr:packaging:integrationTests FAILED
FAILURE: Build failed with an exception.
* Where:
Build file '/home/jenkins/jenkins-agent/workspace/Solr/Solr-TestIntegration-main/solr/packaging/build.gradle' line: 342
* What went wrong:
Execution failed for task ':solr:packaging:integrationTests'.
> Process 'command '/home/jenkins/jenkins-agent/workspace/Solr/Solr-TestIntegration-main/solr/packaging/.gradle/node/node_modules/bats/bin/bats'' finished with non-zero exit value 1
* Try:
> Run with --stacktrace option to get the stack trace.
> Run with --info or --debug option to get more log output.
> Get more help at https://help.gradle.org.
Deprecated Gradle features were used in this build, making it incompatible with Gradle 9.0.
You can use '--warning-mode all' to show the individual deprecation warnings and determine if they come from your own scripts or plugins.
For more on this, please refer to https://docs.gradle.org/8.10/userguide/command_line_interface.html#sec:command_line_warnings in the Gradle documentation.
BUILD FAILED in 31m 59s
130 actionable tasks: 130 executed
Publishing Build Scan to Develocity...
https://develocity.apache.org/s/2weyciryf3ymk
Build step 'Invoke Gradle script' changed build result to FAILURE
Build step 'Invoke Gradle script' marked build as failure
Archiving artifacts
Email was triggered for: Failure - Any
Sending email for trigger: Failure - Any
[JENKINS] Solr » Solr-TestIntegration-main - Build # 550 - Still Failing!
Posted by Apache Jenkins Server <je...@builds.apache.org>.
Build: https://ci-builds.apache.org/job/Solr/job/Solr-TestIntegration-main/550/
No tests ran.
Build Log:
[...truncated 443 lines...]
# ERROR: Server refused connection at: http://localhost:33847/solr/test_args/update
#
# org.apache.solr.client.solrj.SolrServerException: Server refused connection at: http://localhost:33847/solr/test_args/update
# at org.apache.solr.client.solrj.jetty.HttpJettySolrClient.request(HttpJettySolrClient.java:506)
# at org.apache.solr.client.solrj.SolrRequest.process(SolrRequest.java:302)
# at org.apache.solr.client.solrj.SolrClient.commit(SolrClient.java:466)
# at org.apache.solr.client.solrj.SolrClient.commit(SolrClient.java:442)
# at org.apache.solr.cli.PostTool.commit(PostTool.java:778)
# at org.apache.solr.cli.PostTool.execute(PostTool.java:346)
# at org.apache.solr.cli.PostTool.runImpl(PostTool.java:320)
# at org.apache.solr.cli.ToolBase.runTool(ToolBase.java:92)
# at org.apache.solr.cli.SolrCLI.main(SolrCLI.java:117)
# Caused by: java.net.ConnectException: Connection refused
# at java.base/sun.nio.ch.Net.pollConnect(Native Method)
# at java.base/sun.nio.ch.Net.pollConnectNow(Net.java:682)
# at java.base/sun.nio.ch.SocketChannelImpl.finishTimedConnect(SocketChannelImpl.java:1191)
# at java.base/sun.nio.ch.SocketChannelImpl.blockingConnect(SocketChannelImpl.java:1233)
# at java.base/sun.nio.ch.SocketAdaptor.connect(SocketAdaptor.java:102)
# at org.eclipse.jetty.io.ClientConnector.connect(ClientConnector.java:467)
# at org.eclipse.jetty.io.Transport$Socket.connect(Transport.java:175)
# at org.eclipse.jetty.http2.client.HTTP2Client.connect(HTTP2Client.java:486)
# at org.eclipse.jetty.http2.client.transport.HttpClientTransportOverHTTP2.connect(HttpClientTransportOverHTTP2.java:140)
# at org.eclipse.jetty.http2.client.transport.HttpClientTransportOverHTTP2.connect(HttpClientTransportOverHTTP2.java:128)
# at org.eclipse.jetty.client.HttpClient$1.connect(HttpClient.java:579)
# at org.eclipse.jetty.client.HttpClient$1.succeeded(HttpClient.java:556)
# at org.eclipse.jetty.client.HttpClient$1.succeeded(HttpClient.java:552)
# at org.eclipse.jetty.util.SocketAddressResolver$Async.lambda$resolve$0(SocketAddressResolver.java:186)
# at org.apache.solr.common.util.ExecutorUtil$MDCAwareThreadPoolExecutor.lambda$execute$0(ExecutorUtil.java:408)
# at java.base/java.util.concurrent.ThreadPoolExecutor.runWorker(ThreadPoolExecutor.java:1144)
# at java.base/java.util.concurrent.ThreadPoolExecutor$Worker.run(ThreadPoolExecutor.java:642)
# at java.base/java.lang.Thread.run(Thread.java:1583)
# --
#
# Please find the SOLR_HOME snapshot for failed test #10 at: /home/jenkins/jenkins-agent/workspace/Solr/Solr-TestIntegration-main/solr/packaging/build/test-output/failure-snapshots/79-10
# Last output:
# POSTing args to http://localhost:33847/solr/test_args/update...
# PostTool: WARNING: IOException while reading response: java.net.SocketException: Unexpected end of file from server
# COMMITting Solr index changes to http://localhost:33847/solr/test_args/update...
#
# ERROR: Server refused connection at: http://localhost:33847/solr/test_args/update
#
# org.apache.solr.client.solrj.SolrServerException: Server refused connection at: http://localhost:33847/solr/test_args/update
# at org.apache.solr.client.solrj.jetty.HttpJettySolrClient.request(HttpJettySolrClient.java:506)
# at org.apache.solr.client.solrj.SolrRequest.process(SolrRequest.java:302)
# at org.apache.solr.client.solrj.SolrClient.commit(SolrClient.java:466)
# at org.apache.solr.client.solrj.SolrClient.commit(SolrClient.java:442)
# at org.apache.solr.cli.PostTool.commit(PostTool.java:778)
# at org.apache.solr.cli.PostTool.execute(PostTool.java:346)
# at org.apache.solr.cli.PostTool.runImpl(PostTool.java:320)
# at org.apache.solr.cli.ToolBase.runTool(ToolBase.java:92)
# at org.apache.solr.cli.SolrCLI.main(SolrCLI.java:117)
# Caused by: java.net.ConnectException: Connection refused
# at java.base/sun.nio.ch.Net.pollConnect(Native Method)
# at java.base/sun.nio.ch.Net.pollConnectNow(Net.java:682)
# at java.base/sun.nio.ch.SocketChannelImpl.finishTimedConnect(SocketChannelImpl.java:1191)
# at java.base/sun.nio.ch.SocketChannelImpl.blockingConnect(SocketChannelImpl.java:1233)
# at java.base/sun.nio.ch.SocketAdaptor.connect(SocketAdaptor.java:102)
# at org.eclipse.jetty.io.ClientConnector.connect(ClientConnector.java:467)
# at org.eclipse.jetty.io.Transport$Socket.connect(Transport.java:175)
# at org.eclipse.jetty.http2.client.HTTP2Client.connect(HTTP2Client.java:486)
# at org.eclipse.jetty.http2.client.transport.HttpClientTransportOverHTTP2.connect(HttpClientTransportOverHTTP2.java:140)
# at org.eclipse.jetty.http2.client.transport.HttpClientTransportOverHTTP2.connect(HttpClientTransportOverHTTP2.java:128)
# at org.eclipse.jetty.client.HttpClient$1.connect(HttpClient.java:579)
# at org.eclipse.jetty.client.HttpClient$1.succeeded(HttpClient.java:556)
# at org.eclipse.jetty.client.HttpClient$1.succeeded(HttpClient.java:552)
# at org.eclipse.jetty.util.SocketAddressResolver$Async.lambda$resolve$0(SocketAddressResolver.java:186)
# at org.apache.solr.common.util.ExecutorUtil$MDCAwareThreadPoolExecutor.lambda$execute$0(ExecutorUtil.java:408)
# at java.base/java.util.concurrent.ThreadPoolExecutor.runWorker(ThreadPoolExecutor.java:1144)
# at java.base/java.util.concurrent.ThreadPoolExecutor$Worker.run(ThreadPoolExecutor.java:642)
# at java.base/java.lang.Thread.run(Thread.java:1583)
not ok 80 stdin mode # in 1065 ms
# (from function `assert_output' in file .gradle/node/node_modules/bats-assert/src/assert.bash, line 247,
# in test file test/test_post.bats, line 201)
# `assert_output --partial "Created collection 'test_stdin'"' failed
#
# -- output does not contain substring --
# substring (1 lines):
# Created collection 'test_stdin'
# output (3 lines):
# Neither --zk-host or --solr-url parameters, nor ZK_HOST env var provided, so assuming solr url is http://localhost:33847.
#
# ERROR: Server refused connection at: http://localhost:33847/solr/admin/info/system
# --
#
# Please find the SOLR_HOME snapshot for failed test #11 at: /home/jenkins/jenkins-agent/workspace/Solr/Solr-TestIntegration-main/solr/packaging/build/test-output/failure-snapshots/80-11
# Last output:
# Neither --zk-host or --solr-url parameters, nor ZK_HOST env var provided, so assuming solr url is http://localhost:33847.
#
# ERROR: Server refused connection at: http://localhost:33847/solr/admin/info/system
not ok 81 verbose echo the Solr response # in 1093 ms
# (from function `assert_output' in file .gradle/node/node_modules/bats-assert/src/assert.bash, line 247,
# in test file test/test_post.bats, line 210)
# `assert_output --partial "Created collection 'monitors_verbose'"' failed
#
# -- output does not contain substring --
# substring (1 lines):
# Created collection 'monitors_verbose'
# output (3 lines):
# Neither --zk-host or --solr-url parameters, nor ZK_HOST env var provided, so assuming solr url is http://localhost:33847.
#
# ERROR: Server refused connection at: http://localhost:33847/solr/admin/info/system
# --
#
# Please find the SOLR_HOME snapshot for failed test #12 at: /home/jenkins/jenkins-agent/workspace/Solr/Solr-TestIntegration-main/solr/packaging/build/test-output/failure-snapshots/81-12
# Last output:
# Neither --zk-host or --solr-url parameters, nor ZK_HOST env var provided, so assuming solr url is http://localhost:33847.
#
# ERROR: Server refused connection at: http://localhost:33847/solr/admin/info/system
ok 82 post solr log into solr via cli # in 8725 ms
# Docker artifacts saved to: /home/jenkins/jenkins-agent/workspace/Solr/Solr-TestIntegration-main/solr/packaging/build/test-output/docker
ok 83 Docker SolrCloud rolling upgrade # in 59920 ms
ok 84 allowPaths - backup # in 14417 ms
ok 85 snapshot lifecycle # in 4489 ms
ok 86 snapshot list # in 3135 ms
ok 87 snapshot describe # in 3094 ms
ok 88 start solr with ssl # in 15324 ms
ok 89 use different hostname when not checking peer-name # in 23358 ms
ok 90 start solr with ssl and auth # in 13929 ms
ok 91 start solr with client truststore and security manager # in 15759 ms
ok 92 start solr with mTLS needed # in 45198 ms
ok 93 start solr with mTLS wanted # in 36164 ms
ok 94 test keystore reload # in 58665 ms
ok 95 SOLR-11740 check 'solr stop' connection # in 15515 ms
ok 96 stop command for single port # in 17950 ms
ok 97 check stop command doesn't hang # skip timeout utility is not available
ok 98 SOLR-16976 solr starts with remote JMX enabled # in 7905 ms
ok 99 deprecated system properties converted to modern properties # in 195010 ms
ok 100 start with custom jetty options # in 8087 ms
ok 101 bootstrapping a configset # in 9156 ms
ok 102 status detects locally running solr # in 9435 ms
ok 103 status with --solr-url from user # in 8017 ms
ok 104 status with --port from user # in 8044 ms
ok 105 multiple connection options are prevented # in 805 ms
ok 106 status with invalid --solr-url from user # in 1194 ms
ok 107 status with --short format # in 195590 ms
ok 108 searching solr via locally executed streaming expression # in 1621 ms
ok 109 searching solr via remotely executed streaming expression # in 1164 ms
ok 110 variable interpolation # in 1603 ms
ok 111 searching solr without credentials fails with error # in 1055 ms
ok 112 --version returns Solr version # in 694 ms
ok 113 version as direct tool call still runs # in 692 ms
ok 114 short help # in 710 ms
ok 115 short help is inferred # in 743 ms
ok 116 long help # in 710 ms
ok 117 running subcommands with zk is prevented # in 682 ms
ok 118 listing out files # in 2079 ms
ok 119 connecting to solr via various solr urls and zk hosts # in 7553 ms
ok 120 copying files around # in 10565 ms
ok 121 upconfig # in 2421 ms
ok 122 SOLR-12429 test upconfig fails with symlink # in 1058 ms
ok 123 downconfig # in 1126 ms
ok 124 bin/solr zk cp gets 'solrhome' from '--solr-home' command line option # in 1359 ms
ok 125 env var ZK_HOST is honored # in 3053 ms
ok 126 Cleanup # in 1834 ms
> Task :solr:packaging:integrationTests FAILED
FAILURE: Build failed with an exception.
* Where:
Build file '/home/jenkins/jenkins-agent/workspace/Solr/Solr-TestIntegration-main/solr/packaging/build.gradle' line: 342
* What went wrong:
Execution failed for task ':solr:packaging:integrationTests'.
> Process 'command '/home/jenkins/jenkins-agent/workspace/Solr/Solr-TestIntegration-main/solr/packaging/.gradle/node/node_modules/bats/bin/bats'' finished with non-zero exit value 1
* Try:
> Run with --stacktrace option to get the stack trace.
> Run with --info or --debug option to get more log output.
> Get more help at https://help.gradle.org.
Deprecated Gradle features were used in this build, making it incompatible with Gradle 9.0.
You can use '--warning-mode all' to show the individual deprecation warnings and determine if they come from your own scripts or plugins.
For more on this, please refer to https://docs.gradle.org/8.10/userguide/command_line_interface.html#sec:command_line_warnings in the Gradle documentation.
BUILD FAILED in 34m 37s
130 actionable tasks: 130 executed
Publishing Build Scan to Develocity...
https://develocity.apache.org/s/6ci4tyayoubru
Build step 'Invoke Gradle script' changed build result to FAILURE
Build step 'Invoke Gradle script' marked build as failure
Archiving artifacts
Email was triggered for: Failure - Any
Sending email for trigger: Failure - Any
[JENKINS] Solr » Solr-TestIntegration-main - Build # 549 - Still Failing!
Posted by Apache Jenkins Server <je...@builds.apache.org>.
Build: https://ci-builds.apache.org/job/Solr/job/Solr-TestIntegration-main/549/
No tests ran.
Build Log:
[...truncated 443 lines...]
# ERROR: Failed to create collection 'test_stdin' due to: IOException occurred when talking to server at: http://localhost:32883/api/collections
# --
#
# Please find the SOLR_HOME snapshot for failed test #11 at: /home/jenkins/jenkins-agent/workspace/Solr/Solr-TestIntegration-main/solr/packaging/build/test-output/failure-snapshots/80-11
# Last output:
# Neither --zk-host or --solr-url parameters, nor ZK_HOST env var provided, so assuming solr url is http://localhost:32883.
# Neither --zk-host or --solr-url parameters, nor ZK_HOST env var provided, so assuming solr url is http://localhost:32883.
# WARNING: Using _default configset. Data driven schema functionality is enabled by default, which is
# NOT RECOMMENDED for production use.
#
# To turn it off:
# curl http://localhost:32883/solr/test_stdin/config -d '{"set-user-property": {"update.autoCreateFields":"false"}}'
# Or:
# bin/solr config -c test_stdin -s http://localhost:32883 --action set-user-property --property update.autoCreateFields --value false
# WARN - 2026-05-13 02:06:38.078; org.apache.solr.common.cloud.SolrZkClient; Using default ZkCredentialsInjector. ZkCredentialsInjector is not secure, it creates an empty list of credentials which leads to 'OPEN_ACL_UNSAFE' ACLs to Zookeeper nodes
# WARN - 2026-05-13 02:06:38.081; org.apache.solr.common.cloud.SolrZkClient; Using default ZkACLProvider. DefaultZkACLProvider is not secure, it creates 'OPEN_ACL_UNSAFE' ACLs to Zookeeper nodes
#
# ERROR: Failed to create collection 'test_stdin' due to: IOException occurred when talking to server at: http://localhost:32883/api/collections
not ok 81 verbose echo the Solr response # in 1150 ms
# (from function `assert_output' in file .gradle/node/node_modules/bats-assert/src/assert.bash, line 247,
# in test file test/test_post.bats, line 210)
# `assert_output --partial "Created collection 'monitors_verbose'"' failed
#
# -- output does not contain substring --
# substring (1 lines):
# Created collection 'monitors_verbose'
# output (3 lines):
# Neither --zk-host or --solr-url parameters, nor ZK_HOST env var provided, so assuming solr url is http://localhost:32883.
#
# ERROR: Server refused connection at: http://localhost:32883/solr/admin/info/system
# --
#
# Please find the SOLR_HOME snapshot for failed test #12 at: /home/jenkins/jenkins-agent/workspace/Solr/Solr-TestIntegration-main/solr/packaging/build/test-output/failure-snapshots/81-12
# Last output:
# Neither --zk-host or --solr-url parameters, nor ZK_HOST env var provided, so assuming solr url is http://localhost:32883.
#
# ERROR: Server refused connection at: http://localhost:32883/solr/admin/info/system
ok 82 post solr log into solr via cli # in 9681 ms
# Docker artifacts saved to: /home/jenkins/jenkins-agent/workspace/Solr/Solr-TestIntegration-main/solr/packaging/build/test-output/docker
ok 83 Docker SolrCloud rolling upgrade # in 75222 ms
ok 84 allowPaths - backup # in 16451 ms
ok 85 snapshot lifecycle # in 4815 ms
ok 86 snapshot list # in 3356 ms
ok 87 snapshot describe # in 3313 ms
ok 88 start solr with ssl # in 16189 ms
ok 89 use different hostname when not checking peer-name # in 25106 ms
ok 90 start solr with ssl and auth # in 14613 ms
ok 91 start solr with client truststore and security manager # in 16717 ms
ok 92 start solr with mTLS needed # in 47141 ms
ok 93 start solr with mTLS wanted # in 34070 ms
ok 94 test keystore reload # in 58891 ms
ok 95 SOLR-11740 check 'solr stop' connection # in 16093 ms
ok 96 stop command for single port # in 18696 ms
ok 97 check stop command doesn't hang # skip timeout utility is not available
ok 98 SOLR-16976 solr starts with remote JMX enabled # in 8340 ms
ok 99 deprecated system properties converted to modern properties # in 195154 ms
ok 100 start with custom jetty options # in 8263 ms
ok 101 bootstrapping a configset # in 9298 ms
ok 102 status detects locally running solr # in 9823 ms
ok 103 status with --solr-url from user # in 8089 ms
ok 104 status with --port from user # in 8240 ms
ok 105 multiple connection options are prevented # in 861 ms
ok 106 status with invalid --solr-url from user # in 1245 ms
ok 107 status with --short format # in 196029 ms
ok 108 searching solr via locally executed streaming expression # in 1723 ms
ok 109 searching solr via remotely executed streaming expression # in 1258 ms
ok 110 variable interpolation # in 1696 ms
ok 111 searching solr without credentials fails with error # in 1135 ms
ok 112 --version returns Solr version # in 720 ms
ok 113 version as direct tool call still runs # in 725 ms
ok 114 short help # in 788 ms
ok 115 short help is inferred # in 815 ms
ok 116 long help # in 805 ms
ok 117 running subcommands with zk is prevented # in 767 ms
ok 118 listing out files # in 2168 ms
ok 119 connecting to solr via various solr urls and zk hosts # in 8123 ms
ok 120 copying files around # in 11137 ms
ok 121 upconfig # in 2491 ms
ok 122 SOLR-12429 test upconfig fails with symlink # in 1103 ms
ok 123 downconfig # in 1198 ms
ok 124 bin/solr zk cp gets 'solrhome' from '--solr-home' command line option # in 1438 ms
ok 125 env var ZK_HOST is honored # in 3201 ms
ok 126 Cleanup # in 1855 ms
> Task :solr:packaging:integrationTests FAILED
FAILURE: Build failed with an exception.
* Where:
Build file '/home/jenkins/jenkins-agent/workspace/Solr/Solr-TestIntegration-main/solr/packaging/build.gradle' line: 342
* What went wrong:
Execution failed for task ':solr:packaging:integrationTests'.
> Process 'command '/home/jenkins/jenkins-agent/workspace/Solr/Solr-TestIntegration-main/solr/packaging/.gradle/node/node_modules/bats/bin/bats'' finished with non-zero exit value 1
* Try:
> Run with --stacktrace option to get the stack trace.
> Run with --info or --debug option to get more log output.
> Get more help at https://help.gradle.org.
Deprecated Gradle features were used in this build, making it incompatible with Gradle 9.0.
You can use '--warning-mode all' to show the individual deprecation warnings and determine if they come from your own scripts or plugins.
For more on this, please refer to https://docs.gradle.org/8.10/userguide/command_line_interface.html#sec:command_line_warnings in the Gradle documentation.
BUILD FAILED in 31m 34s
130 actionable tasks: 130 executed
Publishing Build Scan to Develocity...
https://develocity.apache.org/s/fuzi22kx7r67y
Build step 'Invoke Gradle script' changed build result to FAILURE
Build step 'Invoke Gradle script' marked build as failure
Archiving artifacts
Email was triggered for: Failure - Any
Sending email for trigger: Failure - Any
[JENKINS] Solr » Solr-TestIntegration-main - Build # 548 - Still Failing!
Posted by Apache Jenkins Server <je...@builds.apache.org>.
Build: https://ci-builds.apache.org/job/Solr/job/Solr-TestIntegration-main/548/
No tests ran.
Build Log:
[...truncated 443 lines...]
# ERROR: Failed to create collection 'test_stdin' due to: IOException occurred when talking to server at: http://localhost:40481/api/collections
# --
#
# Please find the SOLR_HOME snapshot for failed test #11 at: /home/jenkins/jenkins-agent/workspace/Solr/Solr-TestIntegration-main/solr/packaging/build/test-output/failure-snapshots/80-11
# Last output:
# Neither --zk-host or --solr-url parameters, nor ZK_HOST env var provided, so assuming solr url is http://localhost:40481.
# Neither --zk-host or --solr-url parameters, nor ZK_HOST env var provided, so assuming solr url is http://localhost:40481.
# WARNING: Using _default configset. Data driven schema functionality is enabled by default, which is
# NOT RECOMMENDED for production use.
#
# To turn it off:
# curl http://localhost:40481/solr/test_stdin/config -d '{"set-user-property": {"update.autoCreateFields":"false"}}'
# Or:
# bin/solr config -c test_stdin -s http://localhost:40481 --action set-user-property --property update.autoCreateFields --value false
# WARN - 2026-05-12 01:12:22.872; org.apache.solr.common.cloud.SolrZkClient; Using default ZkCredentialsInjector. ZkCredentialsInjector is not secure, it creates an empty list of credentials which leads to 'OPEN_ACL_UNSAFE' ACLs to Zookeeper nodes
# WARN - 2026-05-12 01:12:22.876; org.apache.solr.common.cloud.SolrZkClient; Using default ZkACLProvider. DefaultZkACLProvider is not secure, it creates 'OPEN_ACL_UNSAFE' ACLs to Zookeeper nodes
#
# ERROR: Failed to create collection 'test_stdin' due to: IOException occurred when talking to server at: http://localhost:40481/api/collections
not ok 81 verbose echo the Solr response # in 1150 ms
# (from function `assert_output' in file .gradle/node/node_modules/bats-assert/src/assert.bash, line 247,
# in test file test/test_post.bats, line 210)
# `assert_output --partial "Created collection 'monitors_verbose'"' failed
#
# -- output does not contain substring --
# substring (1 lines):
# Created collection 'monitors_verbose'
# output (3 lines):
# Neither --zk-host or --solr-url parameters, nor ZK_HOST env var provided, so assuming solr url is http://localhost:40481.
#
# ERROR: Server refused connection at: http://localhost:40481/solr/admin/info/system
# --
#
# Please find the SOLR_HOME snapshot for failed test #12 at: /home/jenkins/jenkins-agent/workspace/Solr/Solr-TestIntegration-main/solr/packaging/build/test-output/failure-snapshots/81-12
# Last output:
# Neither --zk-host or --solr-url parameters, nor ZK_HOST env var provided, so assuming solr url is http://localhost:40481.
#
# ERROR: Server refused connection at: http://localhost:40481/solr/admin/info/system
ok 82 post solr log into solr via cli # in 9569 ms
# Docker artifacts saved to: /home/jenkins/jenkins-agent/workspace/Solr/Solr-TestIntegration-main/solr/packaging/build/test-output/docker
ok 83 Docker SolrCloud rolling upgrade # in 67571 ms
ok 84 allowPaths - backup # in 17015 ms
ok 85 snapshot lifecycle # in 5295 ms
ok 86 snapshot list # in 3503 ms
ok 87 snapshot describe # in 3452 ms
ok 88 start solr with ssl # in 16483 ms
ok 89 use different hostname when not checking peer-name # in 25436 ms
ok 90 start solr with ssl and auth # in 14763 ms
ok 91 start solr with client truststore and security manager # in 16475 ms
ok 92 start solr with mTLS needed # in 47099 ms
ok 93 start solr with mTLS wanted # in 35435 ms
ok 94 test keystore reload # in 62069 ms
ok 95 SOLR-11740 check 'solr stop' connection # in 16524 ms
ok 96 stop command for single port # in 18732 ms
ok 97 check stop command doesn't hang # skip timeout utility is not available
ok 98 SOLR-16976 solr starts with remote JMX enabled # in 8423 ms
ok 99 deprecated system properties converted to modern properties # in 195259 ms
ok 100 start with custom jetty options # in 8791 ms
ok 101 bootstrapping a configset # in 9236 ms
ok 102 status detects locally running solr # in 9682 ms
ok 103 status with --solr-url from user # in 8252 ms
ok 104 status with --port from user # in 8180 ms
ok 105 multiple connection options are prevented # in 910 ms
ok 106 status with invalid --solr-url from user # in 1349 ms
ok 107 status with --short format # in 196089 ms
ok 108 searching solr via locally executed streaming expression # in 1768 ms
ok 109 searching solr via remotely executed streaming expression # in 1253 ms
ok 110 variable interpolation # in 1784 ms
ok 111 searching solr without credentials fails with error # in 1174 ms
ok 112 --version returns Solr version # in 785 ms
ok 113 version as direct tool call still runs # in 761 ms
ok 114 short help # in 986 ms
ok 115 short help is inferred # in 789 ms
ok 116 long help # in 829 ms
ok 117 running subcommands with zk is prevented # in 748 ms
ok 118 listing out files # in 2145 ms
ok 119 connecting to solr via various solr urls and zk hosts # in 8183 ms
ok 120 copying files around # in 11237 ms
ok 121 upconfig # in 2534 ms
ok 122 SOLR-12429 test upconfig fails with symlink # in 1290 ms
ok 123 downconfig # in 1278 ms
ok 124 bin/solr zk cp gets 'solrhome' from '--solr-home' command line option # in 1548 ms
ok 125 env var ZK_HOST is honored # in 3232 ms
ok 126 Cleanup # in 1885 ms
> Task :solr:packaging:integrationTests FAILED
FAILURE: Build failed with an exception.
* Where:
Build file '/home/jenkins/jenkins-agent/workspace/Solr/Solr-TestIntegration-main/solr/packaging/build.gradle' line: 342
* What went wrong:
Execution failed for task ':solr:packaging:integrationTests'.
> Process 'command '/home/jenkins/jenkins-agent/workspace/Solr/Solr-TestIntegration-main/solr/packaging/.gradle/node/node_modules/bats/bin/bats'' finished with non-zero exit value 1
* Try:
> Run with --stacktrace option to get the stack trace.
> Run with --info or --debug option to get more log output.
> Get more help at https://help.gradle.org.
Deprecated Gradle features were used in this build, making it incompatible with Gradle 9.0.
You can use '--warning-mode all' to show the individual deprecation warnings and determine if they come from your own scripts or plugins.
For more on this, please refer to https://docs.gradle.org/8.10/userguide/command_line_interface.html#sec:command_line_warnings in the Gradle documentation.
BUILD FAILED in 32m 5s
130 actionable tasks: 130 executed
Publishing Build Scan to Develocity...
https://develocity.apache.org/s/huuaaw7xsz3ws
Build step 'Invoke Gradle script' changed build result to FAILURE
Build step 'Invoke Gradle script' marked build as failure
Archiving artifacts
Email was triggered for: Failure - Any
Sending email for trigger: Failure - Any
[JENKINS] Solr » Solr-TestIntegration-main - Build # 547 - Still Failing!
Posted by Apache Jenkins Server <je...@builds.apache.org>.
Build: https://ci-builds.apache.org/job/Solr/job/Solr-TestIntegration-main/547/
No tests ran.
Build Log:
[...truncated 443 lines...]
# ERROR: Failed to create collection 'test_stdin' due to: IOException occurred when talking to server at: http://localhost:37607/api/collections
# --
#
# Please find the SOLR_HOME snapshot for failed test #11 at: /home/jenkins/jenkins-agent/workspace/Solr/Solr-TestIntegration-main/solr/packaging/build/test-output/failure-snapshots/80-11
# Last output:
# Neither --zk-host or --solr-url parameters, nor ZK_HOST env var provided, so assuming solr url is http://localhost:37607.
# Neither --zk-host or --solr-url parameters, nor ZK_HOST env var provided, so assuming solr url is http://localhost:37607.
# WARNING: Using _default configset. Data driven schema functionality is enabled by default, which is
# NOT RECOMMENDED for production use.
#
# To turn it off:
# curl http://localhost:37607/solr/test_stdin/config -d '{"set-user-property": {"update.autoCreateFields":"false"}}'
# Or:
# bin/solr config -c test_stdin -s http://localhost:37607 --action set-user-property --property update.autoCreateFields --value false
# WARN - 2026-05-11 01:30:37.111; org.apache.solr.common.cloud.SolrZkClient; Using default ZkCredentialsInjector. ZkCredentialsInjector is not secure, it creates an empty list of credentials which leads to 'OPEN_ACL_UNSAFE' ACLs to Zookeeper nodes
# WARN - 2026-05-11 01:30:37.115; org.apache.solr.common.cloud.SolrZkClient; Using default ZkACLProvider. DefaultZkACLProvider is not secure, it creates 'OPEN_ACL_UNSAFE' ACLs to Zookeeper nodes
#
# ERROR: Failed to create collection 'test_stdin' due to: IOException occurred when talking to server at: http://localhost:37607/api/collections
not ok 81 verbose echo the Solr response # in 1083 ms
# (from function `assert_output' in file .gradle/node/node_modules/bats-assert/src/assert.bash, line 247,
# in test file test/test_post.bats, line 210)
# `assert_output --partial "Created collection 'monitors_verbose'"' failed
#
# -- output does not contain substring --
# substring (1 lines):
# Created collection 'monitors_verbose'
# output (3 lines):
# Neither --zk-host or --solr-url parameters, nor ZK_HOST env var provided, so assuming solr url is http://localhost:37607.
#
# ERROR: Server refused connection at: http://localhost:37607/solr/admin/info/system
# --
#
# Please find the SOLR_HOME snapshot for failed test #12 at: /home/jenkins/jenkins-agent/workspace/Solr/Solr-TestIntegration-main/solr/packaging/build/test-output/failure-snapshots/81-12
# Last output:
# Neither --zk-host or --solr-url parameters, nor ZK_HOST env var provided, so assuming solr url is http://localhost:37607.
#
# ERROR: Server refused connection at: http://localhost:37607/solr/admin/info/system
ok 82 post solr log into solr via cli # in 8610 ms
# Docker artifacts saved to: /home/jenkins/jenkins-agent/workspace/Solr/Solr-TestIntegration-main/solr/packaging/build/test-output/docker
ok 83 Docker SolrCloud rolling upgrade # in 61593 ms
ok 84 allowPaths - backup # in 14851 ms
ok 85 snapshot lifecycle # in 4576 ms
ok 86 snapshot list # in 3125 ms
ok 87 snapshot describe # in 3194 ms
ok 88 start solr with ssl # in 15507 ms
ok 89 use different hostname when not checking peer-name # in 23611 ms
ok 90 start solr with ssl and auth # in 13993 ms
ok 91 start solr with client truststore and security manager # in 15635 ms
ok 92 start solr with mTLS needed # in 45446 ms
ok 93 start solr with mTLS wanted # in 34169 ms
ok 94 test keystore reload # in 56477 ms
ok 95 SOLR-11740 check 'solr stop' connection # in 15637 ms
ok 96 stop command for single port # in 17949 ms
ok 97 check stop command doesn't hang # skip timeout utility is not available
ok 98 SOLR-16976 solr starts with remote JMX enabled # in 7754 ms
ok 99 deprecated system properties converted to modern properties # in 195218 ms
ok 100 start with custom jetty options # in 7896 ms
ok 101 bootstrapping a configset # in 8914 ms
ok 102 status detects locally running solr # in 9291 ms
ok 103 status with --solr-url from user # in 7822 ms
ok 104 status with --port from user # in 7764 ms
ok 105 multiple connection options are prevented # in 808 ms
ok 106 status with invalid --solr-url from user # in 1263 ms
ok 107 status with --short format # in 195978 ms
ok 108 searching solr via locally executed streaming expression # in 1730 ms
ok 109 searching solr via remotely executed streaming expression # in 1214 ms
ok 110 variable interpolation # in 1633 ms
ok 111 searching solr without credentials fails with error # in 1068 ms
ok 112 --version returns Solr version # in 685 ms
ok 113 version as direct tool call still runs # in 711 ms
ok 114 short help # in 724 ms
ok 115 short help is inferred # in 737 ms
ok 116 long help # in 723 ms
ok 117 running subcommands with zk is prevented # in 690 ms
ok 118 listing out files # in 2083 ms
ok 119 connecting to solr via various solr urls and zk hosts # in 7625 ms
ok 120 copying files around # in 10557 ms
ok 121 upconfig # in 2377 ms
ok 122 SOLR-12429 test upconfig fails with symlink # in 1069 ms
ok 123 downconfig # in 1121 ms
ok 124 bin/solr zk cp gets 'solrhome' from '--solr-home' command line option # in 1380 ms
ok 125 env var ZK_HOST is honored # in 3079 ms
ok 126 Cleanup # in 1817 ms
> Task :solr:packaging:integrationTests FAILED
FAILURE: Build failed with an exception.
* Where:
Build file '/home/jenkins/jenkins-agent/workspace/Solr/Solr-TestIntegration-main/solr/packaging/build.gradle' line: 342
* What went wrong:
Execution failed for task ':solr:packaging:integrationTests'.
> Process 'command '/home/jenkins/jenkins-agent/workspace/Solr/Solr-TestIntegration-main/solr/packaging/.gradle/node/node_modules/bats/bin/bats'' finished with non-zero exit value 1
* Try:
> Run with --stacktrace option to get the stack trace.
> Run with --info or --debug option to get more log output.
> Get more help at https://help.gradle.org.
Deprecated Gradle features were used in this build, making it incompatible with Gradle 9.0.
You can use '--warning-mode all' to show the individual deprecation warnings and determine if they come from your own scripts or plugins.
For more on this, please refer to https://docs.gradle.org/8.10/userguide/command_line_interface.html#sec:command_line_warnings in the Gradle documentation.
BUILD FAILED in 29m 54s
130 actionable tasks: 130 executed
Publishing Build Scan to Develocity...
https://develocity.apache.org/s/cpqhimms4x43m
Build step 'Invoke Gradle script' changed build result to FAILURE
Build step 'Invoke Gradle script' marked build as failure
Archiving artifacts
Email was triggered for: Failure - Any
Sending email for trigger: Failure - Any
[JENKINS] Solr » Solr-TestIntegration-main - Build # 546 - Still Failing!
Posted by Apache Jenkins Server <je...@builds.apache.org>.
Build: https://ci-builds.apache.org/job/Solr/job/Solr-TestIntegration-main/546/
No tests ran.
Build Log:
[...truncated 442 lines...]
# ERROR: Failed to create collection 'test_args' due to: IOException occurred when talking to server at: http://localhost:35547/api/collections
# --
#
# Please find the SOLR_HOME snapshot for failed test #10 at: /home/jenkins/jenkins-agent/workspace/Solr/Solr-TestIntegration-main/solr/packaging/build/test-output/failure-snapshots/79-10
# Last output:
# Neither --zk-host or --solr-url parameters, nor ZK_HOST env var provided, so assuming solr url is http://localhost:35547.
# Neither --zk-host or --solr-url parameters, nor ZK_HOST env var provided, so assuming solr url is http://localhost:35547.
# WARNING: Using _default configset. Data driven schema functionality is enabled by default, which is
# NOT RECOMMENDED for production use.
#
# To turn it off:
# curl http://localhost:35547/solr/test_args/config -d '{"set-user-property": {"update.autoCreateFields":"false"}}'
# Or:
# bin/solr config -c test_args -s http://localhost:35547 --action set-user-property --property update.autoCreateFields --value false
# WARN - 2026-05-10 01:58:14.077; org.apache.solr.common.cloud.SolrZkClient; Using default ZkCredentialsInjector. ZkCredentialsInjector is not secure, it creates an empty list of credentials which leads to 'OPEN_ACL_UNSAFE' ACLs to Zookeeper nodes
# WARN - 2026-05-10 01:58:14.080; org.apache.solr.common.cloud.SolrZkClient; Using default ZkACLProvider. DefaultZkACLProvider is not secure, it creates 'OPEN_ACL_UNSAFE' ACLs to Zookeeper nodes
#
# ERROR: Failed to create collection 'test_args' due to: IOException occurred when talking to server at: http://localhost:35547/api/collections
not ok 80 stdin mode # in 1085 ms
# (from function `assert_output' in file .gradle/node/node_modules/bats-assert/src/assert.bash, line 247,
# in test file test/test_post.bats, line 201)
# `assert_output --partial "Created collection 'test_stdin'"' failed
#
# -- output does not contain substring --
# substring (1 lines):
# Created collection 'test_stdin'
# output (3 lines):
# Neither --zk-host or --solr-url parameters, nor ZK_HOST env var provided, so assuming solr url is http://localhost:35547.
#
# ERROR: Server refused connection at: http://localhost:35547/solr/admin/info/system
# --
#
# Please find the SOLR_HOME snapshot for failed test #11 at: /home/jenkins/jenkins-agent/workspace/Solr/Solr-TestIntegration-main/solr/packaging/build/test-output/failure-snapshots/80-11
# Last output:
# Neither --zk-host or --solr-url parameters, nor ZK_HOST env var provided, so assuming solr url is http://localhost:35547.
#
# ERROR: Server refused connection at: http://localhost:35547/solr/admin/info/system
not ok 81 verbose echo the Solr response # in 1070 ms
# (from function `assert_output' in file .gradle/node/node_modules/bats-assert/src/assert.bash, line 247,
# in test file test/test_post.bats, line 210)
# `assert_output --partial "Created collection 'monitors_verbose'"' failed
#
# -- output does not contain substring --
# substring (1 lines):
# Created collection 'monitors_verbose'
# output (3 lines):
# Neither --zk-host or --solr-url parameters, nor ZK_HOST env var provided, so assuming solr url is http://localhost:35547.
#
# ERROR: Server refused connection at: http://localhost:35547/solr/admin/info/system
# --
#
# Please find the SOLR_HOME snapshot for failed test #12 at: /home/jenkins/jenkins-agent/workspace/Solr/Solr-TestIntegration-main/solr/packaging/build/test-output/failure-snapshots/81-12
# Last output:
# Neither --zk-host or --solr-url parameters, nor ZK_HOST env var provided, so assuming solr url is http://localhost:35547.
#
# ERROR: Server refused connection at: http://localhost:35547/solr/admin/info/system
ok 82 post solr log into solr via cli # in 8646 ms
# Docker artifacts saved to: /home/jenkins/jenkins-agent/workspace/Solr/Solr-TestIntegration-main/solr/packaging/build/test-output/docker
ok 83 Docker SolrCloud rolling upgrade # in 78665 ms
ok 84 allowPaths - backup # in 15002 ms
ok 85 snapshot lifecycle # in 4532 ms
ok 86 snapshot list # in 3109 ms
ok 87 snapshot describe # in 3109 ms
ok 88 start solr with ssl # in 15584 ms
ok 89 use different hostname when not checking peer-name # in 23810 ms
ok 90 start solr with ssl and auth # in 14594 ms
ok 91 start solr with client truststore and security manager # in 15873 ms
ok 92 start solr with mTLS needed # in 45926 ms
ok 93 start solr with mTLS wanted # in 33038 ms
ok 94 test keystore reload # in 56736 ms
ok 95 SOLR-11740 check 'solr stop' connection # in 15705 ms
ok 96 stop command for single port # in 18042 ms
ok 97 check stop command doesn't hang # skip timeout utility is not available
ok 98 SOLR-16976 solr starts with remote JMX enabled # in 7918 ms
ok 99 deprecated system properties converted to modern properties # in 195270 ms
ok 100 start with custom jetty options # in 8185 ms
ok 101 bootstrapping a configset # in 9088 ms
ok 102 status detects locally running solr # in 9327 ms
ok 103 status with --solr-url from user # in 7994 ms
ok 104 status with --port from user # in 8217 ms
ok 105 multiple connection options are prevented # in 838 ms
ok 106 status with invalid --solr-url from user # in 1198 ms
ok 107 status with --short format # in 195729 ms
ok 108 searching solr via locally executed streaming expression # in 1657 ms
ok 109 searching solr via remotely executed streaming expression # in 1203 ms
ok 110 variable interpolation # in 1636 ms
ok 111 searching solr without credentials fails with error # in 1082 ms
ok 112 --version returns Solr version # in 695 ms
ok 113 version as direct tool call still runs # in 713 ms
ok 114 short help # in 733 ms
ok 115 short help is inferred # in 732 ms
ok 116 long help # in 735 ms
ok 117 running subcommands with zk is prevented # in 701 ms
ok 118 listing out files # in 2079 ms
ok 119 connecting to solr via various solr urls and zk hosts # in 7630 ms
ok 120 copying files around # in 10571 ms
ok 121 upconfig # in 2478 ms
ok 122 SOLR-12429 test upconfig fails with symlink # in 1067 ms
ok 123 downconfig # in 1131 ms
ok 124 bin/solr zk cp gets 'solrhome' from '--solr-home' command line option # in 1382 ms
ok 125 env var ZK_HOST is honored # in 3101 ms
ok 126 Cleanup # in 1833 ms
> Task :solr:packaging:integrationTests FAILED
FAILURE: Build failed with an exception.
* Where:
Build file '/home/jenkins/jenkins-agent/workspace/Solr/Solr-TestIntegration-main/solr/packaging/build.gradle' line: 342
* What went wrong:
Execution failed for task ':solr:packaging:integrationTests'.
> Process 'command '/home/jenkins/jenkins-agent/workspace/Solr/Solr-TestIntegration-main/solr/packaging/.gradle/node/node_modules/bats/bin/bats'' finished with non-zero exit value 1
* Try:
> Run with --stacktrace option to get the stack trace.
> Run with --info or --debug option to get more log output.
> Get more help at https://help.gradle.org.
Deprecated Gradle features were used in this build, making it incompatible with Gradle 9.0.
You can use '--warning-mode all' to show the individual deprecation warnings and determine if they come from your own scripts or plugins.
For more on this, please refer to https://docs.gradle.org/8.10/userguide/command_line_interface.html#sec:command_line_warnings in the Gradle documentation.
BUILD FAILED in 30m 31s
130 actionable tasks: 130 executed
Publishing Build Scan to Develocity...
https://develocity.apache.org/s/njasmvd5rb4h2
Build step 'Invoke Gradle script' changed build result to FAILURE
Build step 'Invoke Gradle script' marked build as failure
Archiving artifacts
Email was triggered for: Failure - Any
Sending email for trigger: Failure - Any