You are viewing a plain text version of this content. The canonical link for it is here.
Posted to builds@solr.apache.org by Apache Jenkins Server <je...@builds.apache.org> on 2022/11/08 07:59:05 UTC

[JENKINS] Solr » Solr-Check-main-s390x - Build # 71 - Unstable!

Build: https://ci-builds.apache.org/job/Solr/job/Solr-Check-main-s390x/71/

9 tests failed.
FAILED:  org.apache.solr.cloud.HttpPartitionOnCommitTest.test

Error Message:
org.apache.solr.client.solrj.impl.BaseHttpSolrClient$RemoteSolrException: Error from server at http://127.0.0.1:35617/afcuz/xb: Underlying core creation failed while creating collection: c8n_1x3_commits

Stack Trace:
org.apache.solr.client.solrj.impl.BaseHttpSolrClient$RemoteSolrException: Error from server at http://127.0.0.1:35617/afcuz/xb: Underlying core creation failed while creating collection: c8n_1x3_commits
	at __randomizedtesting.SeedInfo.seed([58FB9D8FA5E3F023:D0AFA2550B1F9DDB]:0)
	at app//org.apache.solr.client.solrj.impl.HttpSolrClient.executeMethod(HttpSolrClient.java:720)
	at app//org.apache.solr.client.solrj.impl.HttpSolrClient.request(HttpSolrClient.java:234)
	at app//org.apache.solr.client.solrj.impl.HttpSolrClient.request(HttpSolrClient.java:215)
	at app//org.apache.solr.client.solrj.SolrClient.request(SolrClient.java:1193)
	at app//org.apache.solr.cloud.AbstractBasicDistributedZkTestBase.createCollection(AbstractBasicDistributedZkTestBase.java:1172)
	at app//org.apache.solr.cloud.AbstractFullDistribZkTestBase.createCollection(AbstractFullDistribZkTestBase.java:2013)
	at app//org.apache.solr.cloud.HttpPartitionOnCommitTest.oneShardTest(HttpPartitionOnCommitTest.java:131)
	at app//org.apache.solr.cloud.HttpPartitionOnCommitTest.test(HttpPartitionOnCommitTest.java:66)
	at java.base@11.0.16/jdk.internal.reflect.NativeMethodAccessorImpl.invoke0(Native Method)
	at java.base@11.0.16/jdk.internal.reflect.NativeMethodAccessorImpl.invoke(NativeMethodAccessorImpl.java:62)
	at java.base@11.0.16/jdk.internal.reflect.DelegatingMethodAccessorImpl.invoke(DelegatingMethodAccessorImpl.java:43)
	at java.base@11.0.16/java.lang.reflect.Method.invoke(Method.java:566)
	at app//com.carrotsearch.randomizedtesting.RandomizedRunner.invoke(RandomizedRunner.java:1758)
	at app//com.carrotsearch.randomizedtesting.RandomizedRunner$8.evaluate(RandomizedRunner.java:946)
	at app//com.carrotsearch.randomizedtesting.RandomizedRunner$9.evaluate(RandomizedRunner.java:982)
	at app//com.carrotsearch.randomizedtesting.RandomizedRunner$10.evaluate(RandomizedRunner.java:996)
	at app//org.apache.solr.BaseDistributedSearchTestCase$ShardsRepeatRule$ShardsFixedStatement.callStatement(BaseDistributedSearchTestCase.java:1166)
	at app//org.apache.solr.BaseDistributedSearchTestCase$ShardsRepeatRule$ShardsStatement.evaluate(BaseDistributedSearchTestCase.java:1137)
	at app//com.carrotsearch.randomizedtesting.rules.SystemPropertiesRestoreRule$1.evaluate(SystemPropertiesRestoreRule.java:80)
	at app//org.junit.rules.RunRules.evaluate(RunRules.java:20)
	at app//org.apache.lucene.tests.util.TestRuleSetupTeardownChained$1.evaluate(TestRuleSetupTeardownChained.java:44)
	at app//org.apache.lucene.tests.util.AbstractBeforeAfterRule$1.evaluate(AbstractBeforeAfterRule.java:43)
	at app//org.apache.lucene.tests.util.TestRuleThreadAndTestName$1.evaluate(TestRuleThreadAndTestName.java:45)
	at app//org.apache.lucene.tests.util.TestRuleIgnoreAfterMaxFailures$1.evaluate(TestRuleIgnoreAfterMaxFailures.java:60)
	at app//org.apache.lucene.tests.util.TestRuleMarkFailure$1.evaluate(TestRuleMarkFailure.java:44)
	at app//org.junit.rules.RunRules.evaluate(RunRules.java:20)
	at app//com.carrotsearch.randomizedtesting.rules.StatementAdapter.evaluate(StatementAdapter.java:36)
	at app//com.carrotsearch.randomizedtesting.ThreadLeakControl$StatementRunner.run(ThreadLeakControl.java:390)
	at app//com.carrotsearch.randomizedtesting.ThreadLeakControl.forkTimeoutingTask(ThreadLeakControl.java:843)
	at app//com.carrotsearch.randomizedtesting.ThreadLeakControl$3.evaluate(ThreadLeakControl.java:490)
	at app//com.carrotsearch.randomizedtesting.RandomizedRunner.runSingleTest(RandomizedRunner.java:955)
	at app//com.carrotsearch.randomizedtesting.RandomizedRunner$5.evaluate(RandomizedRunner.java:840)
	at app//com.carrotsearch.randomizedtesting.RandomizedRunner$6.evaluate(RandomizedRunner.java:891)
	at app//com.carrotsearch.randomizedtesting.RandomizedRunner$7.evaluate(RandomizedRunner.java:902)
	at app//com.carrotsearch.randomizedtesting.rules.StatementAdapter.evaluate(StatementAdapter.java:36)
	at app//org.apache.lucene.tests.util.AbstractBeforeAfterRule$1.evaluate(AbstractBeforeAfterRule.java:43)
	at app//org.apache.lucene.tests.util.AbstractBeforeAfterRule$1.evaluate(AbstractBeforeAfterRule.java:43)
	at app//com.carrotsearch.randomizedtesting.rules.SystemPropertiesRestoreRule$1.evaluate(SystemPropertiesRestoreRule.java:80)
	at app//org.junit.rules.RunRules.evaluate(RunRules.java:20)
	at app//org.apache.lucene.tests.util.AbstractBeforeAfterRule$1.evaluate(AbstractBeforeAfterRule.java:43)
	at app//com.carrotsearch.randomizedtesting.rules.StatementAdapter.evaluate(StatementAdapter.java:36)
	at app//org.apache.lucene.tests.util.TestRuleStoreClassName$1.evaluate(TestRuleStoreClassName.java:38)
	at app//com.carrotsearch.randomizedtesting.rules.NoShadowingOrOverridesOnMethodsRule$1.evaluate(NoShadowingOrOverridesOnMethodsRule.java:40)
	at app//com.carrotsearch.randomizedtesting.rules.NoShadowingOrOverridesOnMethodsRule$1.evaluate(NoShadowingOrOverridesOnMethodsRule.java:40)
	at app//com.carrotsearch.randomizedtesting.rules.StatementAdapter.evaluate(StatementAdapter.java:36)
	at app//com.carrotsearch.randomizedtesting.rules.StatementAdapter.evaluate(StatementAdapter.java:36)
	at app//org.apache.lucene.tests.util.TestRuleAssertionsRequired$1.evaluate(TestRuleAssertionsRequired.java:53)
	at app//org.apache.lucene.tests.util.AbstractBeforeAfterRule$1.evaluate(AbstractBeforeAfterRule.java:43)
	at app//org.apache.lucene.tests.util.TestRuleMarkFailure$1.evaluate(TestRuleMarkFailure.java:44)
	at app//org.apache.lucene.tests.util.TestRuleIgnoreAfterMaxFailures$1.evaluate(TestRuleIgnoreAfterMaxFailures.java:60)
	at app//org.apache.lucene.tests.util.TestRuleIgnoreTestSuites$1.evaluate(TestRuleIgnoreTestSuites.java:47)
	at app//org.junit.rules.RunRules.evaluate(RunRules.java:20)
	at app//com.carrotsearch.randomizedtesting.rules.StatementAdapter.evaluate(StatementAdapter.java:36)
	at app//com.carrotsearch.randomizedtesting.ThreadLeakControl$StatementRunner.run(ThreadLeakControl.java:390)
	at app//com.carrotsearch.randomizedtesting.ThreadLeakControl.lambda$forkTimeoutingTask$0(ThreadLeakControl.java:850)
	at java.base@11.0.16/java.lang.Thread.run(Thread.java:829)


FAILED:  org.apache.solr.cloud.ReindexCollectionTest.testAbort

Error Message:
java.lang.AssertionError: {responseHeader={status=0, QTime=44}, status={state=running, msg=found [01458808-f4d1-4e57-b228-ba274c1cf2ee] in running tasks}}

Stack Trace:
java.lang.AssertionError: {responseHeader={status=0, QTime=44}, status={state=running, msg=found [01458808-f4d1-4e57-b228-ba274c1cf2ee] in running tasks}}
	at __randomizedtesting.SeedInfo.seed([58FB9D8FA5E3F023:3E982A18D139625A]:0)
	at org.junit.Assert.fail(Assert.java:89)
	at org.junit.Assert.assertTrue(Assert.java:42)
	at org.junit.Assert.assertNotNull(Assert.java:713)
	at org.apache.solr.cloud.ReindexCollectionTest.testAbort(ReindexCollectionTest.java:425)
	at java.base/jdk.internal.reflect.NativeMethodAccessorImpl.invoke0(Native Method)
	at java.base/jdk.internal.reflect.NativeMethodAccessorImpl.invoke(NativeMethodAccessorImpl.java:62)
	at java.base/jdk.internal.reflect.DelegatingMethodAccessorImpl.invoke(DelegatingMethodAccessorImpl.java:43)
	at java.base/java.lang.reflect.Method.invoke(Method.java:566)
	at com.carrotsearch.randomizedtesting.RandomizedRunner.invoke(RandomizedRunner.java:1758)
	at com.carrotsearch.randomizedtesting.RandomizedRunner$8.evaluate(RandomizedRunner.java:946)
	at com.carrotsearch.randomizedtesting.RandomizedRunner$9.evaluate(RandomizedRunner.java:982)
	at com.carrotsearch.randomizedtesting.RandomizedRunner$10.evaluate(RandomizedRunner.java:996)
	at com.carrotsearch.randomizedtesting.rules.SystemPropertiesRestoreRule$1.evaluate(SystemPropertiesRestoreRule.java:80)
	at org.junit.rules.RunRules.evaluate(RunRules.java:20)
	at org.apache.lucene.tests.util.TestRuleSetupTeardownChained$1.evaluate(TestRuleSetupTeardownChained.java:44)
	at org.apache.lucene.tests.util.AbstractBeforeAfterRule$1.evaluate(AbstractBeforeAfterRule.java:43)
	at org.apache.lucene.tests.util.TestRuleThreadAndTestName$1.evaluate(TestRuleThreadAndTestName.java:45)
	at org.apache.lucene.tests.util.TestRuleIgnoreAfterMaxFailures$1.evaluate(TestRuleIgnoreAfterMaxFailures.java:60)
	at org.apache.lucene.tests.util.TestRuleMarkFailure$1.evaluate(TestRuleMarkFailure.java:44)
	at org.junit.rules.RunRules.evaluate(RunRules.java:20)
	at com.carrotsearch.randomizedtesting.rules.StatementAdapter.evaluate(StatementAdapter.java:36)
	at com.carrotsearch.randomizedtesting.ThreadLeakControl$StatementRunner.run(ThreadLeakControl.java:390)
	at com.carrotsearch.randomizedtesting.ThreadLeakControl.forkTimeoutingTask(ThreadLeakControl.java:843)
	at com.carrotsearch.randomizedtesting.ThreadLeakControl$3.evaluate(ThreadLeakControl.java:490)
	at com.carrotsearch.randomizedtesting.RandomizedRunner.runSingleTest(RandomizedRunner.java:955)
	at com.carrotsearch.randomizedtesting.RandomizedRunner$5.evaluate(RandomizedRunner.java:840)
	at com.carrotsearch.randomizedtesting.RandomizedRunner$6.evaluate(RandomizedRunner.java:891)
	at com.carrotsearch.randomizedtesting.RandomizedRunner$7.evaluate(RandomizedRunner.java:902)
	at com.carrotsearch.randomizedtesting.rules.StatementAdapter.evaluate(StatementAdapter.java:36)
	at org.apache.lucene.tests.util.AbstractBeforeAfterRule$1.evaluate(AbstractBeforeAfterRule.java:43)
	at org.apache.lucene.tests.util.AbstractBeforeAfterRule$1.evaluate(AbstractBeforeAfterRule.java:43)
	at com.carrotsearch.randomizedtesting.rules.SystemPropertiesRestoreRule$1.evaluate(SystemPropertiesRestoreRule.java:80)
	at org.junit.rules.RunRules.evaluate(RunRules.java:20)
	at org.apache.lucene.tests.util.AbstractBeforeAfterRule$1.evaluate(AbstractBeforeAfterRule.java:43)
	at com.carrotsearch.randomizedtesting.rules.StatementAdapter.evaluate(StatementAdapter.java:36)
	at org.apache.lucene.tests.util.TestRuleStoreClassName$1.evaluate(TestRuleStoreClassName.java:38)
	at com.carrotsearch.randomizedtesting.rules.NoShadowingOrOverridesOnMethodsRule$1.evaluate(NoShadowingOrOverridesOnMethodsRule.java:40)
	at com.carrotsearch.randomizedtesting.rules.NoShadowingOrOverridesOnMethodsRule$1.evaluate(NoShadowingOrOverridesOnMethodsRule.java:40)
	at com.carrotsearch.randomizedtesting.rules.StatementAdapter.evaluate(StatementAdapter.java:36)
	at com.carrotsearch.randomizedtesting.rules.StatementAdapter.evaluate(StatementAdapter.java:36)
	at org.apache.lucene.tests.util.TestRuleAssertionsRequired$1.evaluate(TestRuleAssertionsRequired.java:53)
	at org.apache.lucene.tests.util.AbstractBeforeAfterRule$1.evaluate(AbstractBeforeAfterRule.java:43)
	at org.apache.lucene.tests.util.TestRuleMarkFailure$1.evaluate(TestRuleMarkFailure.java:44)
	at org.apache.lucene.tests.util.TestRuleIgnoreAfterMaxFailures$1.evaluate(TestRuleIgnoreAfterMaxFailures.java:60)
	at org.apache.lucene.tests.util.TestRuleIgnoreTestSuites$1.evaluate(TestRuleIgnoreTestSuites.java:47)
	at org.junit.rules.RunRules.evaluate(RunRules.java:20)
	at com.carrotsearch.randomizedtesting.rules.StatementAdapter.evaluate(StatementAdapter.java:36)
	at com.carrotsearch.randomizedtesting.ThreadLeakControl$StatementRunner.run(ThreadLeakControl.java:390)
	at com.carrotsearch.randomizedtesting.ThreadLeakControl.lambda$forkTimeoutingTask$0(ThreadLeakControl.java:850)
	at java.base/java.lang.Thread.run(Thread.java:829)


FAILED:  org.apache.solr.cloud.TestTlogReplica.testCreateDelete {seed=[58FB9D8FA5E3F023:F7BDD03F67D1C33F]}

Error Message:
org.apache.solr.client.solrj.SolrServerException: Timeout occurred while waiting response from server at: https://127.0.0.1:34415/solr

Stack Trace:
org.apache.solr.client.solrj.SolrServerException: Timeout occurred while waiting response from server at: https://127.0.0.1:34415/solr
	at __randomizedtesting.SeedInfo.seed([58FB9D8FA5E3F023:F7BDD03F67D1C33F]:0)
	at app//org.apache.solr.client.solrj.impl.HttpSolrClient.executeMethod(HttpSolrClient.java:729)
	at app//org.apache.solr.client.solrj.impl.HttpSolrClient.request(HttpSolrClient.java:234)
	at app//org.apache.solr.client.solrj.impl.HttpSolrClient.request(HttpSolrClient.java:215)
	at app//org.apache.solr.client.solrj.impl.LBSolrClient.doRequest(LBSolrClient.java:405)
	at app//org.apache.solr.client.solrj.impl.LBSolrClient.request(LBSolrClient.java:371)
	at app//org.apache.solr.client.solrj.impl.CloudSolrClient.sendRequest(CloudSolrClient.java:1174)
	at app//org.apache.solr.client.solrj.impl.CloudSolrClient.requestWithRetryOnStaleState(CloudSolrClient.java:880)
	at app//org.apache.solr.client.solrj.impl.CloudSolrClient.request(CloudSolrClient.java:807)
	at app//org.apache.solr.client.solrj.SolrRequest.process(SolrRequest.java:234)
	at app//org.apache.solr.client.solrj.SolrRequest.process(SolrRequest.java:249)
	at app//org.apache.solr.cloud.TestTlogReplica.testCreateDelete(TestTlogReplica.java:241)
	at java.base@11.0.16/jdk.internal.reflect.NativeMethodAccessorImpl.invoke0(Native Method)
	at java.base@11.0.16/jdk.internal.reflect.NativeMethodAccessorImpl.invoke(NativeMethodAccessorImpl.java:62)
	at java.base@11.0.16/jdk.internal.reflect.DelegatingMethodAccessorImpl.invoke(DelegatingMethodAccessorImpl.java:43)
	at java.base@11.0.16/java.lang.reflect.Method.invoke(Method.java:566)
	at app//com.carrotsearch.randomizedtesting.RandomizedRunner.invoke(RandomizedRunner.java:1758)
	at app//com.carrotsearch.randomizedtesting.RandomizedRunner$8.evaluate(RandomizedRunner.java:946)
	at app//com.carrotsearch.randomizedtesting.RandomizedRunner$9.evaluate(RandomizedRunner.java:982)
	at app//com.carrotsearch.randomizedtesting.RandomizedRunner$10.evaluate(RandomizedRunner.java:996)
	at app//com.carrotsearch.randomizedtesting.rules.SystemPropertiesRestoreRule$1.evaluate(SystemPropertiesRestoreRule.java:80)
	at app//org.junit.rules.RunRules.evaluate(RunRules.java:20)
	at app//org.apache.lucene.tests.util.TestRuleSetupTeardownChained$1.evaluate(TestRuleSetupTeardownChained.java:44)
	at app//org.apache.lucene.tests.util.AbstractBeforeAfterRule$1.evaluate(AbstractBeforeAfterRule.java:43)
	at app//org.apache.lucene.tests.util.TestRuleThreadAndTestName$1.evaluate(TestRuleThreadAndTestName.java:45)
	at app//org.apache.lucene.tests.util.TestRuleIgnoreAfterMaxFailures$1.evaluate(TestRuleIgnoreAfterMaxFailures.java:60)
	at app//org.apache.lucene.tests.util.TestRuleMarkFailure$1.evaluate(TestRuleMarkFailure.java:44)
	at app//org.junit.rules.RunRules.evaluate(RunRules.java:20)
	at app//com.carrotsearch.randomizedtesting.rules.StatementAdapter.evaluate(StatementAdapter.java:36)
	at app//com.carrotsearch.randomizedtesting.ThreadLeakControl$StatementRunner.run(ThreadLeakControl.java:390)
	at app//com.carrotsearch.randomizedtesting.ThreadLeakControl.forkTimeoutingTask(ThreadLeakControl.java:843)
	at app//com.carrotsearch.randomizedtesting.ThreadLeakControl$3.evaluate(ThreadLeakControl.java:490)
	at app//com.carrotsearch.randomizedtesting.RandomizedRunner.runSingleTest(RandomizedRunner.java:955)
	at app//com.carrotsearch.randomizedtesting.RandomizedRunner$5.evaluate(RandomizedRunner.java:840)
	at app//com.carrotsearch.randomizedtesting.RandomizedRunner$6.evaluate(RandomizedRunner.java:891)
	at app//com.carrotsearch.randomizedtesting.RandomizedRunner$7.evaluate(RandomizedRunner.java:902)
	at app//com.carrotsearch.randomizedtesting.rules.StatementAdapter.evaluate(StatementAdapter.java:36)
	at app//org.apache.lucene.tests.util.AbstractBeforeAfterRule$1.evaluate(AbstractBeforeAfterRule.java:43)
	at app//org.apache.lucene.tests.util.AbstractBeforeAfterRule$1.evaluate(AbstractBeforeAfterRule.java:43)
	at app//com.carrotsearch.randomizedtesting.rules.SystemPropertiesRestoreRule$1.evaluate(SystemPropertiesRestoreRule.java:80)
	at app//org.junit.rules.RunRules.evaluate(RunRules.java:20)
	at app//org.apache.lucene.tests.util.AbstractBeforeAfterRule$1.evaluate(AbstractBeforeAfterRule.java:43)
	at app//com.carrotsearch.randomizedtesting.rules.StatementAdapter.evaluate(StatementAdapter.java:36)
	at app//org.apache.lucene.tests.util.TestRuleStoreClassName$1.evaluate(TestRuleStoreClassName.java:38)
	at app//com.carrotsearch.randomizedtesting.rules.NoShadowingOrOverridesOnMethodsRule$1.evaluate(NoShadowingOrOverridesOnMethodsRule.java:40)
	at app//com.carrotsearch.randomizedtesting.rules.NoShadowingOrOverridesOnMethodsRule$1.evaluate(NoShadowingOrOverridesOnMethodsRule.java:40)
	at app//com.carrotsearch.randomizedtesting.rules.StatementAdapter.evaluate(StatementAdapter.java:36)
	at app//com.carrotsearch.randomizedtesting.rules.StatementAdapter.evaluate(StatementAdapter.java:36)
	at app//org.apache.lucene.tests.util.TestRuleAssertionsRequired$1.evaluate(TestRuleAssertionsRequired.java:53)
	at app//org.apache.lucene.tests.util.AbstractBeforeAfterRule$1.evaluate(AbstractBeforeAfterRule.java:43)
	at app//org.apache.lucene.tests.util.TestRuleMarkFailure$1.evaluate(TestRuleMarkFailure.java:44)
	at app//org.apache.lucene.tests.util.TestRuleIgnoreAfterMaxFailures$1.evaluate(TestRuleIgnoreAfterMaxFailures.java:60)
	at app//org.apache.lucene.tests.util.TestRuleIgnoreTestSuites$1.evaluate(TestRuleIgnoreTestSuites.java:47)
	at app//org.junit.rules.RunRules.evaluate(RunRules.java:20)
	at app//com.carrotsearch.randomizedtesting.rules.StatementAdapter.evaluate(StatementAdapter.java:36)
	at app//com.carrotsearch.randomizedtesting.ThreadLeakControl$StatementRunner.run(ThreadLeakControl.java:390)
	at app//com.carrotsearch.randomizedtesting.ThreadLeakControl.lambda$forkTimeoutingTask$0(ThreadLeakControl.java:850)
	at java.base@11.0.16/java.lang.Thread.run(Thread.java:829)
Caused by: java.net.SocketTimeoutException: Read timed out
	at java.base/java.net.SocketInputStream.socketRead0(Native Method)
	at java.base/java.net.SocketInputStream.socketRead(SocketInputStream.java:115)
	at java.base/java.net.SocketInputStream.read(SocketInputStream.java:168)
	at java.base/java.net.SocketInputStream.read(SocketInputStream.java:140)
	at java.base/sun.security.ssl.SSLSocketInputRecord.read(SSLSocketInputRecord.java:478)
	at java.base/sun.security.ssl.SSLSocketInputRecord.readHeader(SSLSocketInputRecord.java:472)
	at java.base/sun.security.ssl.SSLSocketInputRecord.bytesInCompletePacket(SSLSocketInputRecord.java:70)
	at java.base/sun.security.ssl.SSLSocketImpl.readApplicationRecord(SSLSocketImpl.java:1454)
	at java.base/sun.security.ssl.SSLSocketImpl$AppInputStream.read(SSLSocketImpl.java:1065)
	at org.apache.http.impl.io.SessionInputBufferImpl.streamRead(SessionInputBufferImpl.java:137)
	at org.apache.http.impl.io.SessionInputBufferImpl.fillBuffer(SessionInputBufferImpl.java:153)
	at org.apache.http.impl.io.SessionInputBufferImpl.readLine(SessionInputBufferImpl.java:280)
	at org.apache.http.impl.conn.DefaultHttpResponseParser.parseHead(DefaultHttpResponseParser.java:138)
	at org.apache.http.impl.conn.DefaultHttpResponseParser.parseHead(DefaultHttpResponseParser.java:56)
	at org.apache.http.impl.io.AbstractMessageParser.parse(AbstractMessageParser.java:259)
	at org.apache.http.impl.DefaultBHttpClientConnection.receiveResponseHeader(DefaultBHttpClientConnection.java:163)
	at org.apache.http.impl.conn.CPoolProxy.receiveResponseHeader(CPoolProxy.java:157)
	at org.apache.http.protocol.HttpRequestExecutor.doReceiveResponse(HttpRequestExecutor.java:273)
	at org.apache.http.protocol.HttpRequestExecutor.execute(HttpRequestExecutor.java:125)
	at org.apache.http.impl.execchain.MainClientExec.execute(MainClientExec.java:272)
	at org.apache.http.impl.execchain.ProtocolExec.execute(ProtocolExec.java:186)
	at org.apache.http.impl.execchain.RetryExec.execute(RetryExec.java:89)
	at org.apache.http.impl.execchain.RedirectExec.execute(RedirectExec.java:110)
	at org.apache.http.impl.client.InternalHttpClient.doExecute(InternalHttpClient.java:185)
	at org.apache.http.impl.client.CloseableHttpClient.execute(CloseableHttpClient.java:83)
	at org.apache.http.impl.client.CloseableHttpClient.execute(CloseableHttpClient.java:56)
	at org.apache.solr.client.solrj.impl.HttpSolrClient.executeMethod(HttpSolrClient.java:577)
	... 56 more


FAILED:  org.apache.solr.cloud.api.collections.TestCollectionAPI.test

Error Message:
org.apache.solr.client.solrj.impl.BaseHttpSolrClient$RemoteSolrException: Error from server at http://127.0.0.1:39955/cj: Underlying core creation failed while creating collection: control_collection

Stack Trace:
org.apache.solr.client.solrj.impl.BaseHttpSolrClient$RemoteSolrException: Error from server at http://127.0.0.1:39955/cj: Underlying core creation failed while creating collection: control_collection
	at __randomizedtesting.SeedInfo.seed([58FB9D8FA5E3F023:D0AFA2550B1F9DDB]:0)
	at app//org.apache.solr.client.solrj.impl.HttpSolrClient.executeMethod(HttpSolrClient.java:720)
	at app//org.apache.solr.client.solrj.impl.HttpSolrClient.request(HttpSolrClient.java:234)
	at app//org.apache.solr.client.solrj.impl.HttpSolrClient.request(HttpSolrClient.java:215)
	at app//org.apache.solr.client.solrj.impl.LBSolrClient.doRequest(LBSolrClient.java:405)
	at app//org.apache.solr.client.solrj.impl.LBSolrClient.request(LBSolrClient.java:371)
	at app//org.apache.solr.client.solrj.impl.CloudSolrClient.sendRequest(CloudSolrClient.java:1174)
	at app//org.apache.solr.client.solrj.impl.CloudSolrClient.requestWithRetryOnStaleState(CloudSolrClient.java:880)
	at app//org.apache.solr.client.solrj.impl.CloudSolrClient.request(CloudSolrClient.java:807)
	at app//org.apache.solr.client.solrj.SolrRequest.process(SolrRequest.java:234)
	at app//org.apache.solr.client.solrj.SolrRequest.process(SolrRequest.java:249)
	at app//org.apache.solr.cloud.AbstractFullDistribZkTestBase.createServers(AbstractFullDistribZkTestBase.java:353)
	at app//org.apache.solr.BaseDistributedSearchTestCase$ShardsRepeatRule$ShardsFixedStatement.callStatement(BaseDistributedSearchTestCase.java:1164)
	at app//org.apache.solr.BaseDistributedSearchTestCase$ShardsRepeatRule$ShardsStatement.evaluate(BaseDistributedSearchTestCase.java:1137)
	at app//com.carrotsearch.randomizedtesting.rules.SystemPropertiesRestoreRule$1.evaluate(SystemPropertiesRestoreRule.java:80)
	at app//org.junit.rules.RunRules.evaluate(RunRules.java:20)
	at app//org.apache.lucene.tests.util.TestRuleSetupTeardownChained$1.evaluate(TestRuleSetupTeardownChained.java:44)
	at app//org.apache.lucene.tests.util.AbstractBeforeAfterRule$1.evaluate(AbstractBeforeAfterRule.java:43)
	at app//org.apache.lucene.tests.util.TestRuleThreadAndTestName$1.evaluate(TestRuleThreadAndTestName.java:45)
	at app//org.apache.lucene.tests.util.TestRuleIgnoreAfterMaxFailures$1.evaluate(TestRuleIgnoreAfterMaxFailures.java:60)
	at app//org.apache.lucene.tests.util.TestRuleMarkFailure$1.evaluate(TestRuleMarkFailure.java:44)
	at app//org.junit.rules.RunRules.evaluate(RunRules.java:20)
	at app//com.carrotsearch.randomizedtesting.rules.StatementAdapter.evaluate(StatementAdapter.java:36)
	at app//com.carrotsearch.randomizedtesting.ThreadLeakControl$StatementRunner.run(ThreadLeakControl.java:390)
	at app//com.carrotsearch.randomizedtesting.ThreadLeakControl.forkTimeoutingTask(ThreadLeakControl.java:843)
	at app//com.carrotsearch.randomizedtesting.ThreadLeakControl$3.evaluate(ThreadLeakControl.java:490)
	at app//com.carrotsearch.randomizedtesting.RandomizedRunner.runSingleTest(RandomizedRunner.java:955)
	at app//com.carrotsearch.randomizedtesting.RandomizedRunner$5.evaluate(RandomizedRunner.java:840)
	at app//com.carrotsearch.randomizedtesting.RandomizedRunner$6.evaluate(RandomizedRunner.java:891)
	at app//com.carrotsearch.randomizedtesting.RandomizedRunner$7.evaluate(RandomizedRunner.java:902)
	at app//com.carrotsearch.randomizedtesting.rules.StatementAdapter.evaluate(StatementAdapter.java:36)
	at app//org.apache.lucene.tests.util.AbstractBeforeAfterRule$1.evaluate(AbstractBeforeAfterRule.java:43)
	at app//org.apache.lucene.tests.util.AbstractBeforeAfterRule$1.evaluate(AbstractBeforeAfterRule.java:43)
	at app//com.carrotsearch.randomizedtesting.rules.SystemPropertiesRestoreRule$1.evaluate(SystemPropertiesRestoreRule.java:80)
	at app//org.junit.rules.RunRules.evaluate(RunRules.java:20)
	at app//org.apache.lucene.tests.util.AbstractBeforeAfterRule$1.evaluate(AbstractBeforeAfterRule.java:43)
	at app//com.carrotsearch.randomizedtesting.rules.StatementAdapter.evaluate(StatementAdapter.java:36)
	at app//org.apache.lucene.tests.util.TestRuleStoreClassName$1.evaluate(TestRuleStoreClassName.java:38)
	at app//com.carrotsearch.randomizedtesting.rules.NoShadowingOrOverridesOnMethodsRule$1.evaluate(NoShadowingOrOverridesOnMethodsRule.java:40)
	at app//com.carrotsearch.randomizedtesting.rules.NoShadowingOrOverridesOnMethodsRule$1.evaluate(NoShadowingOrOverridesOnMethodsRule.java:40)
	at app//com.carrotsearch.randomizedtesting.rules.StatementAdapter.evaluate(StatementAdapter.java:36)
	at app//com.carrotsearch.randomizedtesting.rules.StatementAdapter.evaluate(StatementAdapter.java:36)
	at app//org.apache.lucene.tests.util.TestRuleAssertionsRequired$1.evaluate(TestRuleAssertionsRequired.java:53)
	at app//org.apache.lucene.tests.util.AbstractBeforeAfterRule$1.evaluate(AbstractBeforeAfterRule.java:43)
	at app//org.apache.lucene.tests.util.TestRuleMarkFailure$1.evaluate(TestRuleMarkFailure.java:44)
	at app//org.apache.lucene.tests.util.TestRuleIgnoreAfterMaxFailures$1.evaluate(TestRuleIgnoreAfterMaxFailures.java:60)
	at app//org.apache.lucene.tests.util.TestRuleIgnoreTestSuites$1.evaluate(TestRuleIgnoreTestSuites.java:47)
	at app//org.junit.rules.RunRules.evaluate(RunRules.java:20)
	at app//com.carrotsearch.randomizedtesting.rules.StatementAdapter.evaluate(StatementAdapter.java:36)
	at app//com.carrotsearch.randomizedtesting.ThreadLeakControl$StatementRunner.run(ThreadLeakControl.java:390)
	at app//com.carrotsearch.randomizedtesting.ThreadLeakControl.lambda$forkTimeoutingTask$0(ThreadLeakControl.java:850)
	at java.base@11.0.16/java.lang.Thread.run(Thread.java:829)


FAILED:  org.apache.solr.cloud.api.collections.TestCollectionAPI.testRecreateCollectionAfterFailure

Error Message:
org.apache.solr.client.solrj.impl.BaseHttpSolrClient$RemoteSolrException: Error from server at http://127.0.0.1:33569/cj: Underlying core creation failed while creating collection: control_collection

Stack Trace:
org.apache.solr.client.solrj.impl.BaseHttpSolrClient$RemoteSolrException: Error from server at http://127.0.0.1:33569/cj: Underlying core creation failed while creating collection: control_collection
	at __randomizedtesting.SeedInfo.seed([58FB9D8FA5E3F023:6FC9C564BF80BBD4]:0)
	at app//org.apache.solr.client.solrj.impl.HttpSolrClient.executeMethod(HttpSolrClient.java:720)
	at app//org.apache.solr.client.solrj.impl.HttpSolrClient.request(HttpSolrClient.java:234)
	at app//org.apache.solr.client.solrj.impl.HttpSolrClient.request(HttpSolrClient.java:215)
	at app//org.apache.solr.client.solrj.impl.LBSolrClient.doRequest(LBSolrClient.java:405)
	at app//org.apache.solr.client.solrj.impl.LBSolrClient.request(LBSolrClient.java:371)
	at app//org.apache.solr.client.solrj.impl.CloudSolrClient.sendRequest(CloudSolrClient.java:1174)
	at app//org.apache.solr.client.solrj.impl.CloudSolrClient.requestWithRetryOnStaleState(CloudSolrClient.java:880)
	at app//org.apache.solr.client.solrj.impl.CloudSolrClient.request(CloudSolrClient.java:807)
	at app//org.apache.solr.client.solrj.SolrRequest.process(SolrRequest.java:234)
	at app//org.apache.solr.client.solrj.SolrRequest.process(SolrRequest.java:249)
	at app//org.apache.solr.cloud.AbstractFullDistribZkTestBase.createServers(AbstractFullDistribZkTestBase.java:353)
	at app//org.apache.solr.BaseDistributedSearchTestCase$ShardsRepeatRule$ShardsFixedStatement.callStatement(BaseDistributedSearchTestCase.java:1164)
	at app//org.apache.solr.BaseDistributedSearchTestCase$ShardsRepeatRule$ShardsStatement.evaluate(BaseDistributedSearchTestCase.java:1137)
	at app//com.carrotsearch.randomizedtesting.rules.SystemPropertiesRestoreRule$1.evaluate(SystemPropertiesRestoreRule.java:80)
	at app//org.junit.rules.RunRules.evaluate(RunRules.java:20)
	at app//org.apache.lucene.tests.util.TestRuleSetupTeardownChained$1.evaluate(TestRuleSetupTeardownChained.java:44)
	at app//org.apache.lucene.tests.util.AbstractBeforeAfterRule$1.evaluate(AbstractBeforeAfterRule.java:43)
	at app//org.apache.lucene.tests.util.TestRuleThreadAndTestName$1.evaluate(TestRuleThreadAndTestName.java:45)
	at app//org.apache.lucene.tests.util.TestRuleIgnoreAfterMaxFailures$1.evaluate(TestRuleIgnoreAfterMaxFailures.java:60)
	at app//org.apache.lucene.tests.util.TestRuleMarkFailure$1.evaluate(TestRuleMarkFailure.java:44)
	at app//org.junit.rules.RunRules.evaluate(RunRules.java:20)
	at app//com.carrotsearch.randomizedtesting.rules.StatementAdapter.evaluate(StatementAdapter.java:36)
	at app//com.carrotsearch.randomizedtesting.ThreadLeakControl$StatementRunner.run(ThreadLeakControl.java:390)
	at app//com.carrotsearch.randomizedtesting.ThreadLeakControl.forkTimeoutingTask(ThreadLeakControl.java:843)
	at app//com.carrotsearch.randomizedtesting.ThreadLeakControl$3.evaluate(ThreadLeakControl.java:490)
	at app//com.carrotsearch.randomizedtesting.RandomizedRunner.runSingleTest(RandomizedRunner.java:955)
	at app//com.carrotsearch.randomizedtesting.RandomizedRunner$5.evaluate(RandomizedRunner.java:840)
	at app//com.carrotsearch.randomizedtesting.RandomizedRunner$6.evaluate(RandomizedRunner.java:891)
	at app//com.carrotsearch.randomizedtesting.RandomizedRunner$7.evaluate(RandomizedRunner.java:902)
	at app//com.carrotsearch.randomizedtesting.rules.StatementAdapter.evaluate(StatementAdapter.java:36)
	at app//org.apache.lucene.tests.util.AbstractBeforeAfterRule$1.evaluate(AbstractBeforeAfterRule.java:43)
	at app//org.apache.lucene.tests.util.AbstractBeforeAfterRule$1.evaluate(AbstractBeforeAfterRule.java:43)
	at app//com.carrotsearch.randomizedtesting.rules.SystemPropertiesRestoreRule$1.evaluate(SystemPropertiesRestoreRule.java:80)
	at app//org.junit.rules.RunRules.evaluate(RunRules.java:20)
	at app//org.apache.lucene.tests.util.AbstractBeforeAfterRule$1.evaluate(AbstractBeforeAfterRule.java:43)
	at app//com.carrotsearch.randomizedtesting.rules.StatementAdapter.evaluate(StatementAdapter.java:36)
	at app//org.apache.lucene.tests.util.TestRuleStoreClassName$1.evaluate(TestRuleStoreClassName.java:38)
	at app//com.carrotsearch.randomizedtesting.rules.NoShadowingOrOverridesOnMethodsRule$1.evaluate(NoShadowingOrOverridesOnMethodsRule.java:40)
	at app//com.carrotsearch.randomizedtesting.rules.NoShadowingOrOverridesOnMethodsRule$1.evaluate(NoShadowingOrOverridesOnMethodsRule.java:40)
	at app//com.carrotsearch.randomizedtesting.rules.StatementAdapter.evaluate(StatementAdapter.java:36)
	at app//com.carrotsearch.randomizedtesting.rules.StatementAdapter.evaluate(StatementAdapter.java:36)
	at app//org.apache.lucene.tests.util.TestRuleAssertionsRequired$1.evaluate(TestRuleAssertionsRequired.java:53)
	at app//org.apache.lucene.tests.util.AbstractBeforeAfterRule$1.evaluate(AbstractBeforeAfterRule.java:43)
	at app//org.apache.lucene.tests.util.TestRuleMarkFailure$1.evaluate(TestRuleMarkFailure.java:44)
	at app//org.apache.lucene.tests.util.TestRuleIgnoreAfterMaxFailures$1.evaluate(TestRuleIgnoreAfterMaxFailures.java:60)
	at app//org.apache.lucene.tests.util.TestRuleIgnoreTestSuites$1.evaluate(TestRuleIgnoreTestSuites.java:47)
	at app//org.junit.rules.RunRules.evaluate(RunRules.java:20)
	at app//com.carrotsearch.randomizedtesting.rules.StatementAdapter.evaluate(StatementAdapter.java:36)
	at app//com.carrotsearch.randomizedtesting.ThreadLeakControl$StatementRunner.run(ThreadLeakControl.java:390)
	at app//com.carrotsearch.randomizedtesting.ThreadLeakControl.lambda$forkTimeoutingTask$0(ThreadLeakControl.java:850)
	at java.base@11.0.16/java.lang.Thread.run(Thread.java:829)


FAILED:  org.apache.solr.handler.TestSolrConfigHandlerCloud.test

Error Message:
java.lang.AssertionError: {
  "responseHeader":{
    "status":500,
    "QTime":30947},
  "errorMessages":["1 out of 3 the property overlay to be of version 13 within 30 seconds! Failed cores: [https://127.0.0.1:46617/_zn/a/collection1_shard1_replica_n3/]\n"],
  "WARNING":"This response format is experimental.  It is likely to change in the future.",
  "error":{
    "metadata":[
      "error-class","org.apache.solr.common.SolrException",
      "root-error-class","org.apache.solr.common.SolrException"],
    "msg":"1 out of 3 the property overlay to be of version 13 within 30 seconds! Failed cores: [https://127.0.0.1:46617/_zn/a/collection1_shard1_replica_n3/]",
    "trace":"org.apache.solr.common.SolrException: 1 out of 3 the property overlay to be of version 13 within 30 seconds! Failed cores: [https://127.0.0.1:46617/_zn/a/collection1_shard1_replica_n3/]\n\tat org.apache.solr.handler.SolrConfigHandler.waitForAllReplicasState(SolrConfigHandler.java:898)\n\tat org.apache.solr.handler.SolrConfigHandler$Command.handleCommands(SolrConfigHandler.java:597)\n\tat org.apache.solr.handler.SolrConfigHandler$Command.handlePOST(SolrConfigHandler.java:410)\n\tat org.apache.solr.handler.SolrConfigHandler.handleRequestBody(SolrConfigHandler.java:148)\n\tat org.apache.solr.handler.RequestHandlerBase.handleRequest(RequestHandlerBase.java:224)\n\tat org.apache.solr.core.SolrCore.execute(SolrCore.java:2873)\n\tat org.apache.solr.servlet.HttpSolrCall.executeCoreRequest(HttpSolrCall.java:858)\n\tat org.apache.solr.servlet.HttpSolrCall.call(HttpSolrCall.java:554)\n\tat org.apache.solr.servlet.SolrDispatchFilter.dispatch(SolrDispatchFilter.java:251)\n\tat org.apache.solr.servlet.SolrDispatchFilter.lambda$doFilter$0(SolrDispatchFilter.java:219)\n\tat org.apache.solr.servlet.ServletUtils.traceHttpRequestExecution2(ServletUtils.java:257)\n\tat org.apache.solr.servlet.ServletUtils.rateLimitRequest(ServletUtils.java:227)\n\tat org.apache.solr.servlet.SolrDispatchFilter.doFilter(SolrDispatchFilter.java:214)\n\tat org.apache.solr.servlet.SolrDispatchFilter.doFilter(SolrDispatchFilter.java:196)\n\tat org.eclipse.jetty.servlet.FilterHolder.doFilter(FilterHolder.java:193)\n\tat org.eclipse.jetty.servlet.ServletHandler$Chain.doFilter(ServletHandler.java:1626)\n\tat org.apache.solr.client.solrj.embedded.JettySolrRunner$DebugFilter.doFilter(JettySolrRunner.java:186)\n\tat org.eclipse.jetty.servlet.FilterHolder.doFilter(FilterHolder.java:193)\n\tat org.eclipse.jetty.servlet.ServletHandler$Chain.doFilter(ServletHandler.java:1626)\n\tat org.eclipse.jetty.servlet.ServletHandler.doHandle(ServletHandler.java:552)\n\tat org.eclipse.jetty.server.handler.ScopedHandler.nextHandle(ScopedHandler.java:233)\n\tat org.eclipse.jetty.server.session.SessionHandler.doHandle(SessionHandler.java:1624)\n\tat org.eclipse.jetty.server.handler.ScopedHandler.nextHandle(ScopedHandler.java:233)\n\tat org.eclipse.jetty.server.handler.ContextHandler.doHandle(ContextHandler.java:1440)\n\tat org.eclipse.jetty.server.handler.ScopedHandler.nextScope(ScopedHandler.java:188)\n\tat org.eclipse.jetty.servlet.ServletHandler.doScope(ServletHandler.java:505)\n\tat org.eclipse.jetty.server.session.SessionHandler.doScope(SessionHandler.java:1594)\n\tat org.eclipse.jetty.server.handler.ScopedHandler.nextScope(ScopedHandler.java:186)\n\tat org.eclipse.jetty.server.handler.ContextHandler.doScope(ContextHandler.java:1355)\n\tat org.eclipse.jetty.server.handler.ScopedHandler.handle(ScopedHandler.java:141)\n\tat org.eclipse.jetty.server.handler.HandlerWrapper.handle(HandlerWrapper.java:127)\n\tat org.eclipse.jetty.rewrite.handler.RewriteHandler.handle(RewriteHandler.java:322)\n\tat org.eclipse.jetty.server.handler.gzip.GzipHandler.handle(GzipHandler.java:722)\n\tat org.eclipse.jetty.server.handler.HandlerWrapper.handle(HandlerWrapper.java:127)\n\tat org.eclipse.jetty.server.Server.handle(Server.java:516)\n\tat org.eclipse.jetty.server.HttpChannel.lambda$handle$1(HttpChannel.java:487)\n\tat org.eclipse.jetty.server.HttpChannel.dispatch(HttpChannel.java:732)\n\tat org.eclipse.jetty.server.HttpChannel.handle(HttpChannel.java:479)\n\tat org.eclipse.jetty.server.HttpConnection.onFillable(HttpConnection.java:277)\n\tat org.eclipse.jetty.io.AbstractConnection$ReadCallback.succeeded(AbstractConnection.java:311)\n\tat org.eclipse.jetty.io.FillInterest.fillable(FillInterest.java:105)\n\tat org.eclipse.jetty.io.ssl.SslConnection$DecryptedEndPoint.onFillable(SslConnection.java:555)\n\tat org.eclipse.jetty.io.ssl.SslConnection.onFillable(SslConnection.java:410)\n\tat org.eclipse.jetty.io.ssl.SslConnection$2.succeeded(SslConnection.java:164)\n\tat org.eclipse.jetty.io.FillInterest.fillable(FillInterest.java:105)\n\tat org.eclipse.jetty.io.ChannelEndPoint$1.run(ChannelEndPoint.java:104)\n\tat org.eclipse.jetty.util.thread.QueuedThreadPool.runJob(QueuedThreadPool.java:883)\n\tat org.eclipse.jetty.util.thread.QueuedThreadPool$Runner.run(QueuedThreadPool.java:1034)\n\tat java.base/java.lang.Thread.run(Thread.java:829)\n",
    "code":500}}
 expected null, but was:<[1 out of 3 the property overlay to be of version 13 within 30 seconds! Failed cores: [https://127.0.0.1:46617/_zn/a/collection1_shard1_replica_n3/]
]>

Stack Trace:
java.lang.AssertionError: {
  "responseHeader":{
    "status":500,
    "QTime":30947},
  "errorMessages":["1 out of 3 the property overlay to be of version 13 within 30 seconds! Failed cores: [https://127.0.0.1:46617/_zn/a/collection1_shard1_replica_n3/]\n"],
  "WARNING":"This response format is experimental.  It is likely to change in the future.",
  "error":{
    "metadata":[
      "error-class","org.apache.solr.common.SolrException",
      "root-error-class","org.apache.solr.common.SolrException"],
    "msg":"1 out of 3 the property overlay to be of version 13 within 30 seconds! Failed cores: [https://127.0.0.1:46617/_zn/a/collection1_shard1_replica_n3/]",
    "trace":"org.apache.solr.common.SolrException: 1 out of 3 the property overlay to be of version 13 within 30 seconds! Failed cores: [https://127.0.0.1:46617/_zn/a/collection1_shard1_replica_n3/]\n\tat org.apache.solr.handler.SolrConfigHandler.waitForAllReplicasState(SolrConfigHandler.java:898)\n\tat org.apache.solr.handler.SolrConfigHandler$Command.handleCommands(SolrConfigHandler.java:597)\n\tat org.apache.solr.handler.SolrConfigHandler$Command.handlePOST(SolrConfigHandler.java:410)\n\tat org.apache.solr.handler.SolrConfigHandler.handleRequestBody(SolrConfigHandler.java:148)\n\tat org.apache.solr.handler.RequestHandlerBase.handleRequest(RequestHandlerBase.java:224)\n\tat org.apache.solr.core.SolrCore.execute(SolrCore.java:2873)\n\tat org.apache.solr.servlet.HttpSolrCall.executeCoreRequest(HttpSolrCall.java:858)\n\tat org.apache.solr.servlet.HttpSolrCall.call(HttpSolrCall.java:554)\n\tat org.apache.solr.servlet.SolrDispatchFilter.dispatch(SolrDispatchFilter.java:251)\n\tat org.apache.solr.servlet.SolrDispatchFilter.lambda$doFilter$0(SolrDispatchFilter.java:219)\n\tat org.apache.solr.servlet.ServletUtils.traceHttpRequestExecution2(ServletUtils.java:257)\n\tat org.apache.solr.servlet.ServletUtils.rateLimitRequest(ServletUtils.java:227)\n\tat org.apache.solr.servlet.SolrDispatchFilter.doFilter(SolrDispatchFilter.java:214)\n\tat org.apache.solr.servlet.SolrDispatchFilter.doFilter(SolrDispatchFilter.java:196)\n\tat org.eclipse.jetty.servlet.FilterHolder.doFilter(FilterHolder.java:193)\n\tat org.eclipse.jetty.servlet.ServletHandler$Chain.doFilter(ServletHandler.java:1626)\n\tat org.apache.solr.client.solrj.embedded.JettySolrRunner$DebugFilter.doFilter(JettySolrRunner.java:186)\n\tat org.eclipse.jetty.servlet.FilterHolder.doFilter(FilterHolder.java:193)\n\tat org.eclipse.jetty.servlet.ServletHandler$Chain.doFilter(ServletHandler.java:1626)\n\tat org.eclipse.jetty.servlet.ServletHandler.doHandle(ServletHandler.java:552)\n\tat org.eclipse.jetty.server.handler.ScopedHandler.nextHandle(ScopedHandler.java:233)\n\tat org.eclipse.jetty.server.session.SessionHandler.doHandle(SessionHandler.java:1624)\n\tat org.eclipse.jetty.server.handler.ScopedHandler.nextHandle(ScopedHandler.java:233)\n\tat org.eclipse.jetty.server.handler.ContextHandler.doHandle(ContextHandler.java:1440)\n\tat org.eclipse.jetty.server.handler.ScopedHandler.nextScope(ScopedHandler.java:188)\n\tat org.eclipse.jetty.servlet.ServletHandler.doScope(ServletHandler.java:505)\n\tat org.eclipse.jetty.server.session.SessionHandler.doScope(SessionHandler.java:1594)\n\tat org.eclipse.jetty.server.handler.ScopedHandler.nextScope(ScopedHandler.java:186)\n\tat org.eclipse.jetty.server.handler.ContextHandler.doScope(ContextHandler.java:1355)\n\tat org.eclipse.jetty.server.handler.ScopedHandler.handle(ScopedHandler.java:141)\n\tat org.eclipse.jetty.server.handler.HandlerWrapper.handle(HandlerWrapper.java:127)\n\tat org.eclipse.jetty.rewrite.handler.RewriteHandler.handle(RewriteHandler.java:322)\n\tat org.eclipse.jetty.server.handler.gzip.GzipHandler.handle(GzipHandler.java:722)\n\tat org.eclipse.jetty.server.handler.HandlerWrapper.handle(HandlerWrapper.java:127)\n\tat org.eclipse.jetty.server.Server.handle(Server.java:516)\n\tat org.eclipse.jetty.server.HttpChannel.lambda$handle$1(HttpChannel.java:487)\n\tat org.eclipse.jetty.server.HttpChannel.dispatch(HttpChannel.java:732)\n\tat org.eclipse.jetty.server.HttpChannel.handle(HttpChannel.java:479)\n\tat org.eclipse.jetty.server.HttpConnection.onFillable(HttpConnection.java:277)\n\tat org.eclipse.jetty.io.AbstractConnection$ReadCallback.succeeded(AbstractConnection.java:311)\n\tat org.eclipse.jetty.io.FillInterest.fillable(FillInterest.java:105)\n\tat org.eclipse.jetty.io.ssl.SslConnection$DecryptedEndPoint.onFillable(SslConnection.java:555)\n\tat org.eclipse.jetty.io.ssl.SslConnection.onFillable(SslConnection.java:410)\n\tat org.eclipse.jetty.io.ssl.SslConnection$2.succeeded(SslConnection.java:164)\n\tat org.eclipse.jetty.io.FillInterest.fillable(FillInterest.java:105)\n\tat org.eclipse.jetty.io.ChannelEndPoint$1.run(ChannelEndPoint.java:104)\n\tat org.eclipse.jetty.util.thread.QueuedThreadPool.runJob(QueuedThreadPool.java:883)\n\tat org.eclipse.jetty.util.thread.QueuedThreadPool$Runner.run(QueuedThreadPool.java:1034)\n\tat java.base/java.lang.Thread.run(Thread.java:829)\n",
    "code":500}}
 expected null, but was:<[1 out of 3 the property overlay to be of version 13 within 30 seconds! Failed cores: [https://127.0.0.1:46617/_zn/a/collection1_shard1_replica_n3/]
]>
	at __randomizedtesting.SeedInfo.seed([58FB9D8FA5E3F023:D0AFA2550B1F9DDB]:0)
	at org.junit.Assert.fail(Assert.java:89)
	at org.junit.Assert.failNotNull(Assert.java:756)
	at org.junit.Assert.assertNull(Assert.java:738)
	at org.apache.solr.core.TestSolrConfigHandler.runConfigCommand(TestSolrConfigHandler.java:225)
	at org.apache.solr.core.TestSolrConfigHandler.reqhandlertests(TestSolrConfigHandler.java:464)
	at org.apache.solr.handler.TestSolrConfigHandlerCloud.testReqHandlerAPIs(TestSolrConfigHandlerCloud.java:80)
	at org.apache.solr.handler.TestSolrConfigHandlerCloud.test(TestSolrConfigHandlerCloud.java:49)
	at java.base/jdk.internal.reflect.NativeMethodAccessorImpl.invoke0(Native Method)
	at java.base/jdk.internal.reflect.NativeMethodAccessorImpl.invoke(NativeMethodAccessorImpl.java:62)
	at java.base/jdk.internal.reflect.DelegatingMethodAccessorImpl.invoke(DelegatingMethodAccessorImpl.java:43)
	at java.base/java.lang.reflect.Method.invoke(Method.java:566)
	at com.carrotsearch.randomizedtesting.RandomizedRunner.invoke(RandomizedRunner.java:1758)
	at com.carrotsearch.randomizedtesting.RandomizedRunner$8.evaluate(RandomizedRunner.java:946)
	at com.carrotsearch.randomizedtesting.RandomizedRunner$9.evaluate(RandomizedRunner.java:982)
	at com.carrotsearch.randomizedtesting.RandomizedRunner$10.evaluate(RandomizedRunner.java:996)
	at org.apache.solr.BaseDistributedSearchTestCase$ShardsRepeatRule$ShardsFixedStatement.callStatement(BaseDistributedSearchTestCase.java:1166)
	at org.apache.solr.BaseDistributedSearchTestCase$ShardsRepeatRule$ShardsStatement.evaluate(BaseDistributedSearchTestCase.java:1137)
	at com.carrotsearch.randomizedtesting.rules.SystemPropertiesRestoreRule$1.evaluate(SystemPropertiesRestoreRule.java:80)
	at org.junit.rules.RunRules.evaluate(RunRules.java:20)
	at org.apache.lucene.tests.util.TestRuleSetupTeardownChained$1.evaluate(TestRuleSetupTeardownChained.java:44)
	at org.apache.lucene.tests.util.AbstractBeforeAfterRule$1.evaluate(AbstractBeforeAfterRule.java:43)
	at org.apache.lucene.tests.util.TestRuleThreadAndTestName$1.evaluate(TestRuleThreadAndTestName.java:45)
	at org.apache.lucene.tests.util.TestRuleIgnoreAfterMaxFailures$1.evaluate(TestRuleIgnoreAfterMaxFailures.java:60)
	at org.apache.lucene.tests.util.TestRuleMarkFailure$1.evaluate(TestRuleMarkFailure.java:44)
	at org.junit.rules.RunRules.evaluate(RunRules.java:20)
	at com.carrotsearch.randomizedtesting.rules.StatementAdapter.evaluate(StatementAdapter.java:36)
	at com.carrotsearch.randomizedtesting.ThreadLeakControl$StatementRunner.run(ThreadLeakControl.java:390)
	at com.carrotsearch.randomizedtesting.ThreadLeakControl.forkTimeoutingTask(ThreadLeakControl.java:843)
	at com.carrotsearch.randomizedtesting.ThreadLeakControl$3.evaluate(ThreadLeakControl.java:490)
	at com.carrotsearch.randomizedtesting.RandomizedRunner.runSingleTest(RandomizedRunner.java:955)
	at com.carrotsearch.randomizedtesting.RandomizedRunner$5.evaluate(RandomizedRunner.java:840)
	at com.carrotsearch.randomizedtesting.RandomizedRunner$6.evaluate(RandomizedRunner.java:891)
	at com.carrotsearch.randomizedtesting.RandomizedRunner$7.evaluate(RandomizedRunner.java:902)
	at com.carrotsearch.randomizedtesting.rules.StatementAdapter.evaluate(StatementAdapter.java:36)
	at org.apache.lucene.tests.util.AbstractBeforeAfterRule$1.evaluate(AbstractBeforeAfterRule.java:43)
	at org.apache.lucene.tests.util.AbstractBeforeAfterRule$1.evaluate(AbstractBeforeAfterRule.java:43)
	at com.carrotsearch.randomizedtesting.rules.SystemPropertiesRestoreRule$1.evaluate(SystemPropertiesRestoreRule.java:80)
	at org.junit.rules.RunRules.evaluate(RunRules.java:20)
	at org.apache.lucene.tests.util.AbstractBeforeAfterRule$1.evaluate(AbstractBeforeAfterRule.java:43)
	at com.carrotsearch.randomizedtesting.rules.StatementAdapter.evaluate(StatementAdapter.java:36)
	at org.apache.lucene.tests.util.TestRuleStoreClassName$1.evaluate(TestRuleStoreClassName.java:38)
	at com.carrotsearch.randomizedtesting.rules.NoShadowingOrOverridesOnMethodsRule$1.evaluate(NoShadowingOrOverridesOnMethodsRule.java:40)
	at com.carrotsearch.randomizedtesting.rules.NoShadowingOrOverridesOnMethodsRule$1.evaluate(NoShadowingOrOverridesOnMethodsRule.java:40)
	at com.carrotsearch.randomizedtesting.rules.StatementAdapter.evaluate(StatementAdapter.java:36)
	at com.carrotsearch.randomizedtesting.rules.StatementAdapter.evaluate(StatementAdapter.java:36)
	at org.apache.lucene.tests.util.TestRuleAssertionsRequired$1.evaluate(TestRuleAssertionsRequired.java:53)
	at org.apache.lucene.tests.util.AbstractBeforeAfterRule$1.evaluate(AbstractBeforeAfterRule.java:43)
	at org.apache.lucene.tests.util.TestRuleMarkFailure$1.evaluate(TestRuleMarkFailure.java:44)
	at org.apache.lucene.tests.util.TestRuleIgnoreAfterMaxFailures$1.evaluate(TestRuleIgnoreAfterMaxFailures.java:60)
	at org.apache.lucene.tests.util.TestRuleIgnoreTestSuites$1.evaluate(TestRuleIgnoreTestSuites.java:47)
	at org.junit.rules.RunRules.evaluate(RunRules.java:20)
	at com.carrotsearch.randomizedtesting.rules.StatementAdapter.evaluate(StatementAdapter.java:36)
	at com.carrotsearch.randomizedtesting.ThreadLeakControl$StatementRunner.run(ThreadLeakControl.java:390)
	at com.carrotsearch.randomizedtesting.ThreadLeakControl.lambda$forkTimeoutingTask$0(ThreadLeakControl.java:850)
	at java.base/java.lang.Thread.run(Thread.java:829)


FAILED:  org.apache.solr.handler.TestSystemCollAutoCreate.testAutoCreate

Error Message:
java.lang.AssertionError: Error in posting blob {error={metadata=[error-class, org.apache.solr.common.SolrException, root-error-class, org.apache.solr.common.SolrException], msg=Could not auto-create .system collection: {
  "failure":{
    "127.0.0.1:39731_acqry%2Fa":"org.apache.solr.client.solrj.SolrServerException:Total timeout 15000 ms elapsed",
    "127.0.0.1:40247_acqry%2Fa":"org.apache.solr.client.solrj.SolrServerException:Total timeout 15000 ms elapsed",
    "127.0.0.1:41935_acqry%2Fa":"org.apache.solr.client.solrj.SolrServerException:Total timeout 15000 ms elapsed"},
  "Operation create caused exception:":"org.apache.solr.common.SolrException:org.apache.solr.common.SolrException: Underlying core creation failed while creating collection: .system",
  "exception":{
    "msg":"Underlying core creation failed while creating collection: .system",
    "rspCode":400}}, trace=org.apache.solr.common.SolrException: Could not auto-create .system collection: {
  "failure":{
    "127.0.0.1:39731_acqry%2Fa":"org.apache.solr.client.solrj.SolrServerException:Total timeout 15000 ms elapsed",
    "127.0.0.1:40247_acqry%2Fa":"org.apache.solr.client.solrj.SolrServerException:Total timeout 15000 ms elapsed",
    "127.0.0.1:41935_acqry%2Fa":"org.apache.solr.client.solrj.SolrServerException:Total timeout 15000 ms elapsed"},
  "Operation create caused exception:":"org.apache.solr.common.SolrException:org.apache.solr.common.SolrException: Underlying core creation failed while creating collection: .system",
  "exception":{
    "msg":"Underlying core creation failed while creating collection: .system",
    "rspCode":400}}
	at org.apache.solr.servlet.HttpSolrCall.autoCreateSystemColl(HttpSolrCall.java:376)
	at org.apache.solr.servlet.HttpSolrCall.init(HttpSolrCall.java:310)
	at org.apache.solr.servlet.HttpSolrCall.call(HttpSolrCall.java:502)
	at org.apache.solr.servlet.SolrDispatchFilter.dispatch(SolrDispatchFilter.java:251)
	at org.apache.solr.servlet.SolrDispatchFilter.lambda$doFilter$0(SolrDispatchFilter.java:219)
	at org.apache.solr.servlet.ServletUtils.traceHttpRequestExecution2(ServletUtils.java:257)
	at org.apache.solr.servlet.ServletUtils.rateLimitRequest(ServletUtils.java:227)
	at org.apache.solr.servlet.SolrDispatchFilter.doFilter(SolrDispatchFilter.java:214)
	at org.apache.solr.servlet.SolrDispatchFilter.doFilter(SolrDispatchFilter.java:196)
	at org.eclipse.jetty.servlet.FilterHolder.doFilter(FilterHolder.java:193)
	at org.eclipse.jetty.servlet.ServletHandler$Chain.doFilter(ServletHandler.java:1626)
	at org.apache.solr.client.solrj.embedded.JettySolrRunner$DebugFilter.doFilter(JettySolrRunner.java:186)
	at org.eclipse.jetty.servlet.FilterHolder.doFilter(FilterHolder.java:193)
	at org.eclipse.jetty.servlet.ServletHandler$Chain.doFilter(ServletHandler.java:1626)
	at org.eclipse.jetty.servlet.ServletHandler.doHandle(ServletHandler.java:552)
	at org.eclipse.jetty.server.handler.ScopedHandler.nextHandle(ScopedHandler.java:233)
	at org.eclipse.jetty.server.session.SessionHandler.doHandle(SessionHandler.java:1624)
	at org.eclipse.jetty.server.handler.ScopedHandler.nextHandle(ScopedHandler.java:233)
	at org.eclipse.jetty.server.handler.ContextHandler.doHandle(ContextHandler.java:1440)
	at org.eclipse.jetty.server.handler.ScopedHandler.nextScope(ScopedHandler.java:188)
	at org.eclipse.jetty.servlet.ServletHandler.doScope(ServletHandler.java:505)
	at org.eclipse.jetty.server.session.SessionHandler.doScope(SessionHandler.java:1594)
	at org.eclipse.jetty.server.handler.ScopedHandler.nextScope(ScopedHandler.java:186)
	at org.eclipse.jetty.server.handler.ContextHandler.doScope(ContextHandler.java:1355)
	at org.eclipse.jetty.server.handler.ScopedHandler.handle(ScopedHandler.java:141)
	at org.eclipse.jetty.server.handler.HandlerWrapper.handle(HandlerWrapper.java:127)
	at org.eclipse.jetty.rewrite.handler.RewriteHandler.handle(RewriteHandler.java:322)
	at org.eclipse.jetty.server.handler.gzip.GzipHandler.handle(GzipHandler.java:722)
	at org.eclipse.jetty.server.handler.HandlerWrapper.handle(HandlerWrapper.java:127)
	at org.eclipse.jetty.server.Server.handle(Server.java:516)
	at org.eclipse.jetty.server.HttpChannel.lambda$handle$1(HttpChannel.java:487)
	at org.eclipse.jetty.server.HttpChannel.dispatch(HttpChannel.java:732)
	at org.eclipse.jetty.server.HttpChannel.handle(HttpChannel.java:479)
	at org.eclipse.jetty.server.HttpConnection.onFillable(HttpConnection.java:277)
	at org.eclipse.jetty.io.AbstractConnection$ReadCallback.succeeded(AbstractConnection.java:311)
	at org.eclipse.jetty.io.FillInterest.fillable(FillInterest.java:105)
	at org.eclipse.jetty.io.ChannelEndPoint$1.run(ChannelEndPoint.java:104)
	at org.eclipse.jetty.util.thread.QueuedThreadPool.runJob(QueuedThreadPool.java:883)
	at org.eclipse.jetty.util.thread.QueuedThreadPool$Runner.run(QueuedThreadPool.java:1034)
	at java.base/java.lang.Thread.run(Thread.java:829)
, code=500}}

Stack Trace:
java.lang.AssertionError: Error in posting blob {error={metadata=[error-class, org.apache.solr.common.SolrException, root-error-class, org.apache.solr.common.SolrException], msg=Could not auto-create .system collection: {
  "failure":{
    "127.0.0.1:39731_acqry%2Fa":"org.apache.solr.client.solrj.SolrServerException:Total timeout 15000 ms elapsed",
    "127.0.0.1:40247_acqry%2Fa":"org.apache.solr.client.solrj.SolrServerException:Total timeout 15000 ms elapsed",
    "127.0.0.1:41935_acqry%2Fa":"org.apache.solr.client.solrj.SolrServerException:Total timeout 15000 ms elapsed"},
  "Operation create caused exception:":"org.apache.solr.common.SolrException:org.apache.solr.common.SolrException: Underlying core creation failed while creating collection: .system",
  "exception":{
    "msg":"Underlying core creation failed while creating collection: .system",
    "rspCode":400}}, trace=org.apache.solr.common.SolrException: Could not auto-create .system collection: {
  "failure":{
    "127.0.0.1:39731_acqry%2Fa":"org.apache.solr.client.solrj.SolrServerException:Total timeout 15000 ms elapsed",
    "127.0.0.1:40247_acqry%2Fa":"org.apache.solr.client.solrj.SolrServerException:Total timeout 15000 ms elapsed",
    "127.0.0.1:41935_acqry%2Fa":"org.apache.solr.client.solrj.SolrServerException:Total timeout 15000 ms elapsed"},
  "Operation create caused exception:":"org.apache.solr.common.SolrException:org.apache.solr.common.SolrException: Underlying core creation failed while creating collection: .system",
  "exception":{
    "msg":"Underlying core creation failed while creating collection: .system",
    "rspCode":400}}
	at org.apache.solr.servlet.HttpSolrCall.autoCreateSystemColl(HttpSolrCall.java:376)
	at org.apache.solr.servlet.HttpSolrCall.init(HttpSolrCall.java:310)
	at org.apache.solr.servlet.HttpSolrCall.call(HttpSolrCall.java:502)
	at org.apache.solr.servlet.SolrDispatchFilter.dispatch(SolrDispatchFilter.java:251)
	at org.apache.solr.servlet.SolrDispatchFilter.lambda$doFilter$0(SolrDispatchFilter.java:219)
	at org.apache.solr.servlet.ServletUtils.traceHttpRequestExecution2(ServletUtils.java:257)
	at org.apache.solr.servlet.ServletUtils.rateLimitRequest(ServletUtils.java:227)
	at org.apache.solr.servlet.SolrDispatchFilter.doFilter(SolrDispatchFilter.java:214)
	at org.apache.solr.servlet.SolrDispatchFilter.doFilter(SolrDispatchFilter.java:196)
	at org.eclipse.jetty.servlet.FilterHolder.doFilter(FilterHolder.java:193)
	at org.eclipse.jetty.servlet.ServletHandler$Chain.doFilter(ServletHandler.java:1626)
	at org.apache.solr.client.solrj.embedded.JettySolrRunner$DebugFilter.doFilter(JettySolrRunner.java:186)
	at org.eclipse.jetty.servlet.FilterHolder.doFilter(FilterHolder.java:193)
	at org.eclipse.jetty.servlet.ServletHandler$Chain.doFilter(ServletHandler.java:1626)
	at org.eclipse.jetty.servlet.ServletHandler.doHandle(ServletHandler.java:552)
	at org.eclipse.jetty.server.handler.ScopedHandler.nextHandle(ScopedHandler.java:233)
	at org.eclipse.jetty.server.session.SessionHandler.doHandle(SessionHandler.java:1624)
	at org.eclipse.jetty.server.handler.ScopedHandler.nextHandle(ScopedHandler.java:233)
	at org.eclipse.jetty.server.handler.ContextHandler.doHandle(ContextHandler.java:1440)
	at org.eclipse.jetty.server.handler.ScopedHandler.nextScope(ScopedHandler.java:188)
	at org.eclipse.jetty.servlet.ServletHandler.doScope(ServletHandler.java:505)
	at org.eclipse.jetty.server.session.SessionHandler.doScope(SessionHandler.java:1594)
	at org.eclipse.jetty.server.handler.ScopedHandler.nextScope(ScopedHandler.java:186)
	at org.eclipse.jetty.server.handler.ContextHandler.doScope(ContextHandler.java:1355)
	at org.eclipse.jetty.server.handler.ScopedHandler.handle(ScopedHandler.java:141)
	at org.eclipse.jetty.server.handler.HandlerWrapper.handle(HandlerWrapper.java:127)
	at org.eclipse.jetty.rewrite.handler.RewriteHandler.handle(RewriteHandler.java:322)
	at org.eclipse.jetty.server.handler.gzip.GzipHandler.handle(GzipHandler.java:722)
	at org.eclipse.jetty.server.handler.HandlerWrapper.handle(HandlerWrapper.java:127)
	at org.eclipse.jetty.server.Server.handle(Server.java:516)
	at org.eclipse.jetty.server.HttpChannel.lambda$handle$1(HttpChannel.java:487)
	at org.eclipse.jetty.server.HttpChannel.dispatch(HttpChannel.java:732)
	at org.eclipse.jetty.server.HttpChannel.handle(HttpChannel.java:479)
	at org.eclipse.jetty.server.HttpConnection.onFillable(HttpConnection.java:277)
	at org.eclipse.jetty.io.AbstractConnection$ReadCallback.succeeded(AbstractConnection.java:311)
	at org.eclipse.jetty.io.FillInterest.fillable(FillInterest.java:105)
	at org.eclipse.jetty.io.ChannelEndPoint$1.run(ChannelEndPoint.java:104)
	at org.eclipse.jetty.util.thread.QueuedThreadPool.runJob(QueuedThreadPool.java:883)
	at org.eclipse.jetty.util.thread.QueuedThreadPool$Runner.run(QueuedThreadPool.java:1034)
	at java.base/java.lang.Thread.run(Thread.java:829)
, code=500}}
	at __randomizedtesting.SeedInfo.seed([58FB9D8FA5E3F023:67A0295E139D394E]:0)
	at org.junit.Assert.fail(Assert.java:89)
	at org.junit.Assert.assertTrue(Assert.java:42)
	at org.junit.Assert.assertFalse(Assert.java:65)
	at org.apache.solr.handler.TestBlobHandler.postData(TestBlobHandler.java:202)
	at org.apache.solr.handler.TestBlobHandler.postAndCheck(TestBlobHandler.java:141)
	at org.apache.solr.handler.TestBlobHandler.checkBlobPost(TestBlobHandler.java:97)
	at org.apache.solr.handler.TestSystemCollAutoCreate.testAutoCreate(TestSystemCollAutoCreate.java:24)
	at java.base/jdk.internal.reflect.NativeMethodAccessorImpl.invoke0(Native Method)
	at java.base/jdk.internal.reflect.NativeMethodAccessorImpl.invoke(NativeMethodAccessorImpl.java:62)
	at java.base/jdk.internal.reflect.DelegatingMethodAccessorImpl.invoke(DelegatingMethodAccessorImpl.java:43)
	at java.base/java.lang.reflect.Method.invoke(Method.java:566)
	at com.carrotsearch.randomizedtesting.RandomizedRunner.invoke(RandomizedRunner.java:1758)
	at com.carrotsearch.randomizedtesting.RandomizedRunner$8.evaluate(RandomizedRunner.java:946)
	at com.carrotsearch.randomizedtesting.RandomizedRunner$9.evaluate(RandomizedRunner.java:982)
	at com.carrotsearch.randomizedtesting.RandomizedRunner$10.evaluate(RandomizedRunner.java:996)
	at org.apache.solr.BaseDistributedSearchTestCase$ShardsRepeatRule$ShardsFixedStatement.callStatement(BaseDistributedSearchTestCase.java:1166)
	at org.apache.solr.BaseDistributedSearchTestCase$ShardsRepeatRule$ShardsStatement.evaluate(BaseDistributedSearchTestCase.java:1137)
	at com.carrotsearch.randomizedtesting.rules.SystemPropertiesRestoreRule$1.evaluate(SystemPropertiesRestoreRule.java:80)
	at org.junit.rules.RunRules.evaluate(RunRules.java:20)
	at org.apache.lucene.tests.util.TestRuleSetupTeardownChained$1.evaluate(TestRuleSetupTeardownChained.java:44)
	at org.apache.lucene.tests.util.AbstractBeforeAfterRule$1.evaluate(AbstractBeforeAfterRule.java:43)
	at org.apache.lucene.tests.util.TestRuleThreadAndTestName$1.evaluate(TestRuleThreadAndTestName.java:45)
	at org.apache.lucene.tests.util.TestRuleIgnoreAfterMaxFailures$1.evaluate(TestRuleIgnoreAfterMaxFailures.java:60)
	at org.apache.lucene.tests.util.TestRuleMarkFailure$1.evaluate(TestRuleMarkFailure.java:44)
	at org.junit.rules.RunRules.evaluate(RunRules.java:20)
	at com.carrotsearch.randomizedtesting.rules.StatementAdapter.evaluate(StatementAdapter.java:36)
	at com.carrotsearch.randomizedtesting.ThreadLeakControl$StatementRunner.run(ThreadLeakControl.java:390)
	at com.carrotsearch.randomizedtesting.ThreadLeakControl.forkTimeoutingTask(ThreadLeakControl.java:843)
	at com.carrotsearch.randomizedtesting.ThreadLeakControl$3.evaluate(ThreadLeakControl.java:490)
	at com.carrotsearch.randomizedtesting.RandomizedRunner.runSingleTest(RandomizedRunner.java:955)
	at com.carrotsearch.randomizedtesting.RandomizedRunner$5.evaluate(RandomizedRunner.java:840)
	at com.carrotsearch.randomizedtesting.RandomizedRunner$6.evaluate(RandomizedRunner.java:891)
	at com.carrotsearch.randomizedtesting.RandomizedRunner$7.evaluate(RandomizedRunner.java:902)
	at com.carrotsearch.randomizedtesting.rules.StatementAdapter.evaluate(StatementAdapter.java:36)
	at org.apache.lucene.tests.util.AbstractBeforeAfterRule$1.evaluate(AbstractBeforeAfterRule.java:43)
	at org.apache.lucene.tests.util.AbstractBeforeAfterRule$1.evaluate(AbstractBeforeAfterRule.java:43)
	at com.carrotsearch.randomizedtesting.rules.SystemPropertiesRestoreRule$1.evaluate(SystemPropertiesRestoreRule.java:80)
	at org.junit.rules.RunRules.evaluate(RunRules.java:20)
	at org.apache.lucene.tests.util.AbstractBeforeAfterRule$1.evaluate(AbstractBeforeAfterRule.java:43)
	at com.carrotsearch.randomizedtesting.rules.StatementAdapter.evaluate(StatementAdapter.java:36)
	at org.apache.lucene.tests.util.TestRuleStoreClassName$1.evaluate(TestRuleStoreClassName.java:38)
	at com.carrotsearch.randomizedtesting.rules.NoShadowingOrOverridesOnMethodsRule$1.evaluate(NoShadowingOrOverridesOnMethodsRule.java:40)
	at com.carrotsearch.randomizedtesting.rules.NoShadowingOrOverridesOnMethodsRule$1.evaluate(NoShadowingOrOverridesOnMethodsRule.java:40)
	at com.carrotsearch.randomizedtesting.rules.StatementAdapter.evaluate(StatementAdapter.java:36)
	at com.carrotsearch.randomizedtesting.rules.StatementAdapter.evaluate(StatementAdapter.java:36)
	at org.apache.lucene.tests.util.TestRuleAssertionsRequired$1.evaluate(TestRuleAssertionsRequired.java:53)
	at org.apache.lucene.tests.util.AbstractBeforeAfterRule$1.evaluate(AbstractBeforeAfterRule.java:43)
	at org.apache.lucene.tests.util.TestRuleMarkFailure$1.evaluate(TestRuleMarkFailure.java:44)
	at org.apache.lucene.tests.util.TestRuleIgnoreAfterMaxFailures$1.evaluate(TestRuleIgnoreAfterMaxFailures.java:60)
	at org.apache.lucene.tests.util.TestRuleIgnoreTestSuites$1.evaluate(TestRuleIgnoreTestSuites.java:47)
	at org.junit.rules.RunRules.evaluate(RunRules.java:20)
	at com.carrotsearch.randomizedtesting.rules.StatementAdapter.evaluate(StatementAdapter.java:36)
	at com.carrotsearch.randomizedtesting.ThreadLeakControl$StatementRunner.run(ThreadLeakControl.java:390)
	at com.carrotsearch.randomizedtesting.ThreadLeakControl.lambda$forkTimeoutingTask$0(ThreadLeakControl.java:850)
	at java.base/java.lang.Thread.run(Thread.java:829)


FAILED:  org.apache.solr.handler.configsets.ListConfigSetsAPITest.testSuccessfulListConfigsetsRaw

Error Message:
org.glassfish.jersey.test.spi.TestContainerException: java.net.BindException: Address already in use

Stack Trace:
org.glassfish.jersey.test.spi.TestContainerException: java.net.BindException: Address already in use
	at app//org.glassfish.jersey.test.grizzly.GrizzlyTestContainerFactory$GrizzlyTestContainer.start(GrizzlyTestContainerFactory.java:102)
	at app//org.glassfish.jersey.test.JerseyTest.setUp(JerseyTest.java:625)
	at java.base@11.0.16/jdk.internal.reflect.NativeMethodAccessorImpl.invoke0(Native Method)
	at java.base@11.0.16/jdk.internal.reflect.NativeMethodAccessorImpl.invoke(NativeMethodAccessorImpl.java:62)
	at java.base@11.0.16/jdk.internal.reflect.DelegatingMethodAccessorImpl.invoke(DelegatingMethodAccessorImpl.java:43)
	at java.base@11.0.16/java.lang.reflect.Method.invoke(Method.java:566)
	at app//org.junit.runners.model.FrameworkMethod$1.runReflectiveCall(FrameworkMethod.java:59)
	at app//org.junit.internal.runners.model.ReflectiveCallable.run(ReflectiveCallable.java:12)
	at app//org.junit.runners.model.FrameworkMethod.invokeExplosively(FrameworkMethod.java:56)
	at app//org.junit.internal.runners.statements.RunBefores.invokeMethod(RunBefores.java:33)
	at app//org.junit.internal.runners.statements.RunBefores.evaluate(RunBefores.java:24)
	at app//org.junit.internal.runners.statements.RunAfters.evaluate(RunAfters.java:27)
	at app//org.junit.runners.ParentRunner$3.evaluate(ParentRunner.java:306)
	at app//org.junit.runners.BlockJUnit4ClassRunner$1.evaluate(BlockJUnit4ClassRunner.java:100)
	at app//org.junit.runners.ParentRunner.runLeaf(ParentRunner.java:366)
	at app//org.junit.runners.BlockJUnit4ClassRunner.runChild(BlockJUnit4ClassRunner.java:103)
	at app//org.junit.runners.BlockJUnit4ClassRunner.runChild(BlockJUnit4ClassRunner.java:63)
	at app//org.junit.runners.ParentRunner$4.run(ParentRunner.java:331)
	at app//org.junit.runners.ParentRunner$1.schedule(ParentRunner.java:79)
	at app//org.junit.runners.ParentRunner.runChildren(ParentRunner.java:329)
	at app//org.junit.runners.ParentRunner.access$100(ParentRunner.java:66)
	at app//org.junit.runners.ParentRunner$2.evaluate(ParentRunner.java:293)
	at app//org.junit.internal.runners.statements.RunBefores.evaluate(RunBefores.java:26)
	at app//org.junit.runners.ParentRunner$3.evaluate(ParentRunner.java:306)
	at app//org.junit.runners.ParentRunner.run(ParentRunner.java:413)
	at org.gradle.api.internal.tasks.testing.junit.JUnitTestClassExecutor.runTestClass(JUnitTestClassExecutor.java:110)
	at org.gradle.api.internal.tasks.testing.junit.JUnitTestClassExecutor.execute(JUnitTestClassExecutor.java:58)
	at org.gradle.api.internal.tasks.testing.junit.JUnitTestClassExecutor.execute(JUnitTestClassExecutor.java:38)
	at org.gradle.api.internal.tasks.testing.junit.AbstractJUnitTestClassProcessor.processTestClass(AbstractJUnitTestClassProcessor.java:62)
	at org.gradle.api.internal.tasks.testing.SuiteTestClassProcessor.processTestClass(SuiteTestClassProcessor.java:51)
	at jdk.internal.reflect.GeneratedMethodAccessor16.invoke(Unknown Source)
	at java.base@11.0.16/jdk.internal.reflect.DelegatingMethodAccessorImpl.invoke(DelegatingMethodAccessorImpl.java:43)
	at java.base@11.0.16/java.lang.reflect.Method.invoke(Method.java:566)
	at org.gradle.internal.dispatch.ReflectionDispatch.dispatch(ReflectionDispatch.java:36)
	at org.gradle.internal.dispatch.ReflectionDispatch.dispatch(ReflectionDispatch.java:24)
	at org.gradle.internal.dispatch.ContextClassLoaderDispatch.dispatch(ContextClassLoaderDispatch.java:33)
	at org.gradle.internal.dispatch.ProxyDispatchAdapter$DispatchingInvocationHandler.invoke(ProxyDispatchAdapter.java:94)
	at com.sun.proxy.$Proxy2.processTestClass(Unknown Source)
	at org.gradle.api.internal.tasks.testing.worker.TestWorker$2.run(TestWorker.java:176)
	at org.gradle.api.internal.tasks.testing.worker.TestWorker.executeAndMaintainThreadName(TestWorker.java:129)
	at org.gradle.api.internal.tasks.testing.worker.TestWorker.execute(TestWorker.java:100)
	at org.gradle.api.internal.tasks.testing.worker.TestWorker.execute(TestWorker.java:60)
	at org.gradle.process.internal.worker.child.ActionExecutionWorker.execute(ActionExecutionWorker.java:56)
	at org.gradle.process.internal.worker.child.SystemApplicationClassLoaderWorker.call(SystemApplicationClassLoaderWorker.java:133)
	at org.gradle.process.internal.worker.child.SystemApplicationClassLoaderWorker.call(SystemApplicationClassLoaderWorker.java:71)
	at app//worker.org.gradle.process.internal.worker.GradleWorkerMain.run(GradleWorkerMain.java:69)
	at app//worker.org.gradle.process.internal.worker.GradleWorkerMain.main(GradleWorkerMain.java:74)
Caused by: java.net.BindException: Address already in use
	at java.base/sun.nio.ch.Net.bind0(Native Method)
	at java.base/sun.nio.ch.Net.bind(Net.java:459)
	at java.base/sun.nio.ch.Net.bind(Net.java:448)
	at java.base/sun.nio.ch.ServerSocketChannelImpl.bind(ServerSocketChannelImpl.java:227)
	at java.base/sun.nio.ch.ServerSocketAdaptor.bind(ServerSocketAdaptor.java:80)
	at org.glassfish.grizzly.nio.transport.TCPNIOBindingHandler.bindToChannelAndAddress(TCPNIOBindingHandler.java:107)
	at org.glassfish.grizzly.nio.transport.TCPNIOBindingHandler.bind(TCPNIOBindingHandler.java:64)
	at org.glassfish.grizzly.nio.transport.TCPNIOTransport.bind(TCPNIOTransport.java:215)
	at org.glassfish.grizzly.nio.transport.TCPNIOTransport.bind(TCPNIOTransport.java:195)
	at org.glassfish.grizzly.nio.transport.TCPNIOTransport.bind(TCPNIOTransport.java:186)
	at org.glassfish.grizzly.http.server.NetworkListener.start(NetworkListener.java:711)
	at org.glassfish.grizzly.http.server.HttpServer.start(HttpServer.java:256)
	at org.glassfish.jersey.test.grizzly.GrizzlyTestContainerFactory$GrizzlyTestContainer.start(GrizzlyTestContainerFactory.java:93)
	... 46 more


FAILED:  org.apache.solr.schema.TestBulkSchemaConcurrent.test

Error Message:
java.lang.AssertionError: [[], [dynamic field *_lol1 still exists, new type mystr1 still exists, field a1 still exists, CopyField source=a1,dest=hello_lol1 still exists]]

Stack Trace:
java.lang.AssertionError: [[], [dynamic field *_lol1 still exists, new type mystr1 still exists, field a1 still exists, CopyField source=a1,dest=hello_lol1 still exists]]
	at __randomizedtesting.SeedInfo.seed([58FB9D8FA5E3F023:D0AFA2550B1F9DDB]:0)
	at org.junit.Assert.fail(Assert.java:89)
	at org.junit.Assert.assertTrue(Assert.java:42)
	at org.apache.solr.schema.TestBulkSchemaConcurrent.test(TestBulkSchemaConcurrent.java:122)
	at java.base/jdk.internal.reflect.NativeMethodAccessorImpl.invoke0(Native Method)
	at java.base/jdk.internal.reflect.NativeMethodAccessorImpl.invoke(NativeMethodAccessorImpl.java:62)
	at java.base/jdk.internal.reflect.DelegatingMethodAccessorImpl.invoke(DelegatingMethodAccessorImpl.java:43)
	at java.base/java.lang.reflect.Method.invoke(Method.java:566)
	at com.carrotsearch.randomizedtesting.RandomizedRunner.invoke(RandomizedRunner.java:1758)
	at com.carrotsearch.randomizedtesting.RandomizedRunner$8.evaluate(RandomizedRunner.java:946)
	at com.carrotsearch.randomizedtesting.RandomizedRunner$9.evaluate(RandomizedRunner.java:982)
	at com.carrotsearch.randomizedtesting.RandomizedRunner$10.evaluate(RandomizedRunner.java:996)
	at org.apache.solr.BaseDistributedSearchTestCase$ShardsRepeatRule$ShardsFixedStatement.callStatement(BaseDistributedSearchTestCase.java:1166)
	at org.apache.solr.BaseDistributedSearchTestCase$ShardsRepeatRule$ShardsStatement.evaluate(BaseDistributedSearchTestCase.java:1137)
	at com.carrotsearch.randomizedtesting.rules.SystemPropertiesRestoreRule$1.evaluate(SystemPropertiesRestoreRule.java:80)
	at org.junit.rules.RunRules.evaluate(RunRules.java:20)
	at org.apache.lucene.tests.util.TestRuleSetupTeardownChained$1.evaluate(TestRuleSetupTeardownChained.java:44)
	at org.apache.lucene.tests.util.AbstractBeforeAfterRule$1.evaluate(AbstractBeforeAfterRule.java:43)
	at org.apache.lucene.tests.util.TestRuleThreadAndTestName$1.evaluate(TestRuleThreadAndTestName.java:45)
	at org.apache.lucene.tests.util.TestRuleIgnoreAfterMaxFailures$1.evaluate(TestRuleIgnoreAfterMaxFailures.java:60)
	at org.apache.lucene.tests.util.TestRuleMarkFailure$1.evaluate(TestRuleMarkFailure.java:44)
	at org.junit.rules.RunRules.evaluate(RunRules.java:20)
	at com.carrotsearch.randomizedtesting.rules.StatementAdapter.evaluate(StatementAdapter.java:36)
	at com.carrotsearch.randomizedtesting.ThreadLeakControl$StatementRunner.run(ThreadLeakControl.java:390)
	at com.carrotsearch.randomizedtesting.ThreadLeakControl.forkTimeoutingTask(ThreadLeakControl.java:843)
	at com.carrotsearch.randomizedtesting.ThreadLeakControl$3.evaluate(ThreadLeakControl.java:490)
	at com.carrotsearch.randomizedtesting.RandomizedRunner.runSingleTest(RandomizedRunner.java:955)
	at com.carrotsearch.randomizedtesting.RandomizedRunner$5.evaluate(RandomizedRunner.java:840)
	at com.carrotsearch.randomizedtesting.RandomizedRunner$6.evaluate(RandomizedRunner.java:891)
	at com.carrotsearch.randomizedtesting.RandomizedRunner$7.evaluate(RandomizedRunner.java:902)
	at com.carrotsearch.randomizedtesting.rules.StatementAdapter.evaluate(StatementAdapter.java:36)
	at org.apache.lucene.tests.util.AbstractBeforeAfterRule$1.evaluate(AbstractBeforeAfterRule.java:43)
	at org.apache.lucene.tests.util.AbstractBeforeAfterRule$1.evaluate(AbstractBeforeAfterRule.java:43)
	at com.carrotsearch.randomizedtesting.rules.SystemPropertiesRestoreRule$1.evaluate(SystemPropertiesRestoreRule.java:80)
	at org.junit.rules.RunRules.evaluate(RunRules.java:20)
	at org.apache.lucene.tests.util.AbstractBeforeAfterRule$1.evaluate(AbstractBeforeAfterRule.java:43)
	at com.carrotsearch.randomizedtesting.rules.StatementAdapter.evaluate(StatementAdapter.java:36)
	at org.apache.lucene.tests.util.TestRuleStoreClassName$1.evaluate(TestRuleStoreClassName.java:38)
	at com.carrotsearch.randomizedtesting.rules.NoShadowingOrOverridesOnMethodsRule$1.evaluate(NoShadowingOrOverridesOnMethodsRule.java:40)
	at com.carrotsearch.randomizedtesting.rules.NoShadowingOrOverridesOnMethodsRule$1.evaluate(NoShadowingOrOverridesOnMethodsRule.java:40)
	at com.carrotsearch.randomizedtesting.rules.StatementAdapter.evaluate(StatementAdapter.java:36)
	at com.carrotsearch.randomizedtesting.rules.StatementAdapter.evaluate(StatementAdapter.java:36)
	at org.apache.lucene.tests.util.TestRuleAssertionsRequired$1.evaluate(TestRuleAssertionsRequired.java:53)
	at org.apache.lucene.tests.util.AbstractBeforeAfterRule$1.evaluate(AbstractBeforeAfterRule.java:43)
	at org.apache.lucene.tests.util.TestRuleMarkFailure$1.evaluate(TestRuleMarkFailure.java:44)
	at org.apache.lucene.tests.util.TestRuleIgnoreAfterMaxFailures$1.evaluate(TestRuleIgnoreAfterMaxFailures.java:60)
	at org.apache.lucene.tests.util.TestRuleIgnoreTestSuites$1.evaluate(TestRuleIgnoreTestSuites.java:47)
	at org.junit.rules.RunRules.evaluate(RunRules.java:20)
	at com.carrotsearch.randomizedtesting.rules.StatementAdapter.evaluate(StatementAdapter.java:36)
	at com.carrotsearch.randomizedtesting.ThreadLeakControl$StatementRunner.run(ThreadLeakControl.java:390)
	at com.carrotsearch.randomizedtesting.ThreadLeakControl.lambda$forkTimeoutingTask$0(ThreadLeakControl.java:850)
	at java.base/java.lang.Thread.run(Thread.java:829)




Build Log:
[...truncated 27557 lines...]
ERROR: The following test(s) have failed:
  - org.apache.solr.cloud.HttpPartitionOnCommitTest.test (:solr:core)
    Test output: /home/jenkins/jenkins-home/712657a4/workspace/Solr/Solr-Check-main-s390x/solr/core/build/test-results/test/outputs/OUTPUT-org.apache.solr.cloud.HttpPartitionOnCommitTest.txt
    Reproduce with: gradlew :solr:core:test --tests "org.apache.solr.cloud.HttpPartitionOnCommitTest.test" -Ptests.jvms=4 -Ptests.haltonfailure=false "-Ptests.jvmargs=-XX:TieredStopAtLevel=1 -XX:ReservedCodeCacheSize=120m" -Ptests.seed=58FB9D8FA5E3F023 -Ptests.multiplier=2 -Ptests.badapples=false -Ptests.file.encoding=ISO-8859-1

  - org.apache.solr.cloud.ReindexCollectionTest.testAbort (:solr:core)
    Test output: /home/jenkins/jenkins-home/712657a4/workspace/Solr/Solr-Check-main-s390x/solr/core/build/test-results/test/outputs/OUTPUT-org.apache.solr.cloud.ReindexCollectionTest.txt
    Reproduce with: gradlew :solr:core:test --tests "org.apache.solr.cloud.ReindexCollectionTest.testAbort" -Ptests.jvms=4 -Ptests.haltonfailure=false "-Ptests.jvmargs=-XX:TieredStopAtLevel=1 -XX:ReservedCodeCacheSize=120m" -Ptests.seed=58FB9D8FA5E3F023 -Ptests.multiplier=2 -Ptests.badapples=false -Ptests.file.encoding=ISO-8859-1

  - org.apache.solr.cloud.TestTlogReplica.testCreateDelete {seed=[58FB9D8FA5E3F023:F7BDD03F67D1C33F]} (:solr:core)
    Test output: /home/jenkins/jenkins-home/712657a4/workspace/Solr/Solr-Check-main-s390x/solr/core/build/test-results/test/outputs/OUTPUT-org.apache.solr.cloud.TestTlogReplica.txt
    Reproduce with: gradlew :solr:core:test --tests "org.apache.solr.cloud.TestTlogReplica.testCreateDelete {seed=[58FB9D8FA5E3F023:F7BDD03F67D1C33F]}" -Ptests.jvms=4 -Ptests.haltonfailure=false "-Ptests.jvmargs=-XX:TieredStopAtLevel=1 -XX:ReservedCodeCacheSize=120m" -Ptests.seed=58FB9D8FA5E3F023 -Ptests.multiplier=2 -Ptests.badapples=false -Ptests.file.encoding=ISO-8859-1

  - org.apache.solr.cloud.api.collections.TestCollectionAPI.test (:solr:core)
    Test output: /home/jenkins/jenkins-home/712657a4/workspace/Solr/Solr-Check-main-s390x/solr/core/build/test-results/test/outputs/OUTPUT-org.apache.solr.cloud.api.collections.TestCollectionAPI.txt
    Reproduce with: gradlew :solr:core:test --tests "org.apache.solr.cloud.api.collections.TestCollectionAPI.test" -Ptests.jvms=4 -Ptests.haltonfailure=false "-Ptests.jvmargs=-XX:TieredStopAtLevel=1 -XX:ReservedCodeCacheSize=120m" -Ptests.seed=58FB9D8FA5E3F023 -Ptests.multiplier=2 -Ptests.badapples=false -Ptests.file.encoding=ISO-8859-1

  - org.apache.solr.cloud.api.collections.TestCollectionAPI.testRecreateCollectionAfterFailure (:solr:core)
    Test output: /home/jenkins/jenkins-home/712657a4/workspace/Solr/Solr-Check-main-s390x/solr/core/build/test-results/test/outputs/OUTPUT-org.apache.solr.cloud.api.collections.TestCollectionAPI.txt
    Reproduce with: gradlew :solr:core:test --tests "org.apache.solr.cloud.api.collections.TestCollectionAPI.testRecreateCollectionAfterFailure" -Ptests.jvms=4 -Ptests.haltonfailure=false "-Ptests.jvmargs=-XX:TieredStopAtLevel=1 -XX:ReservedCodeCacheSize=120m" -Ptests.seed=58FB9D8FA5E3F023 -Ptests.multiplier=2 -Ptests.badapples=false -Ptests.file.encoding=ISO-8859-1

  - org.apache.solr.handler.TestSolrConfigHandlerCloud.test (:solr:core)
    Test output: /home/jenkins/jenkins-home/712657a4/workspace/Solr/Solr-Check-main-s390x/solr/core/build/test-results/test/outputs/OUTPUT-org.apache.solr.handler.TestSolrConfigHandlerCloud.txt
    Reproduce with: gradlew :solr:core:test --tests "org.apache.solr.handler.TestSolrConfigHandlerCloud.test" -Ptests.jvms=4 -Ptests.haltonfailure=false "-Ptests.jvmargs=-XX:TieredStopAtLevel=1 -XX:ReservedCodeCacheSize=120m" -Ptests.seed=58FB9D8FA5E3F023 -Ptests.multiplier=2 -Ptests.badapples=false -Ptests.file.encoding=ISO-8859-1

  - org.apache.solr.handler.TestSystemCollAutoCreate.testAutoCreate (:solr:core)
    Test output: /home/jenkins/jenkins-home/712657a4/workspace/Solr/Solr-Check-main-s390x/solr/core/build/test-results/test/outputs/OUTPUT-org.apache.solr.handler.TestSystemCollAutoCreate.txt
    Reproduce with: gradlew :solr:core:test --tests "org.apache.solr.handler.TestSystemCollAutoCreate.testAutoCreate" -Ptests.jvms=4 -Ptests.haltonfailure=false "-Ptests.jvmargs=-XX:TieredStopAtLevel=1 -XX:ReservedCodeCacheSize=120m" -Ptests.seed=58FB9D8FA5E3F023 -Ptests.multiplier=2 -Ptests.badapples=false -Ptests.file.encoding=ISO-8859-1

  - org.apache.solr.handler.configsets.ListConfigSetsAPITest.testSuccessfulListConfigsetsRaw (:solr:core)
    Test output: /home/jenkins/jenkins-home/712657a4/workspace/Solr/Solr-Check-main-s390x/solr/core/build/test-results/test/outputs/OUTPUT-org.apache.solr.handler.configsets.ListConfigSetsAPITest.txt
    Reproduce with: gradlew :solr:core:test --tests "org.apache.solr.handler.configsets.ListConfigSetsAPITest.testSuccessfulListConfigsetsRaw" -Ptests.jvms=4 -Ptests.haltonfailure=false "-Ptests.jvmargs=-XX:TieredStopAtLevel=1 -XX:ReservedCodeCacheSize=120m" -Ptests.seed=58FB9D8FA5E3F023 -Ptests.multiplier=2 -Ptests.badapples=false -Ptests.file.encoding=ISO-8859-1

  - org.apache.solr.schema.TestBulkSchemaConcurrent.test (:solr:core)
    Test output: /home/jenkins/jenkins-home/712657a4/workspace/Solr/Solr-Check-main-s390x/solr/core/build/test-results/test/outputs/OUTPUT-org.apache.solr.schema.TestBulkSchemaConcurrent.txt
    Reproduce with: gradlew :solr:core:test --tests "org.apache.solr.schema.TestBulkSchemaConcurrent.test" -Ptests.jvms=4 -Ptests.haltonfailure=false "-Ptests.jvmargs=-XX:TieredStopAtLevel=1 -XX:ReservedCodeCacheSize=120m" -Ptests.seed=58FB9D8FA5E3F023 -Ptests.multiplier=2 -Ptests.badapples=false -Ptests.file.encoding=ISO-8859-1


Deprecated Gradle features were used in this build, making it incompatible with Gradle 8.0.

You can use '--warning-mode all' to show the individual deprecation warnings and determine if they come from your own scripts or plugins.

See https://docs.gradle.org/7.5.1/userguide/command_line_interface.html#sec:command_line_warnings

BUILD SUCCESSFUL in 3h 12m 46s
609 actionable tasks: 609 executed
Build step 'Invoke Gradle script' changed build result to SUCCESS
Archiving artifacts
hudson.FilePath$ValidateAntFileMask$1Cancel
	at hudson.FilePath$ValidateAntFileMask$1.isCaseSensitive(FilePath.java:3209)
	at org.apache.tools.ant.DirectoryScanner.lambda$isIncluded$3(DirectoryScanner.java:1374)
	at java.base/java.util.stream.MatchOps$1MatchSink.accept(MatchOps.java:90)
	at java.base/java.util.Spliterators$ArraySpliterator.tryAdvance(Spliterators.java:958)
	at java.base/java.util.stream.ReferencePipeline.forEachWithCancel(ReferencePipeline.java:127)
	at java.base/java.util.stream.AbstractPipeline.copyIntoWithCancel(AbstractPipeline.java:502)
	at java.base/java.util.stream.AbstractPipeline.copyInto(AbstractPipeline.java:488)
	at java.base/java.util.stream.AbstractPipeline.wrapAndCopyInto(AbstractPipeline.java:474)
	at java.base/java.util.stream.MatchOps$MatchOp.evaluateSequential(MatchOps.java:230)
	at java.base/java.util.stream.MatchOps$MatchOp.evaluateSequential(MatchOps.java:196)
	at java.base/java.util.stream.AbstractPipeline.evaluate(AbstractPipeline.java:234)
	at java.base/java.util.stream.ReferencePipeline.anyMatch(ReferencePipeline.java:528)
	at org.apache.tools.ant.DirectoryScanner.isIncluded(DirectoryScanner.java:1374)
	at org.apache.tools.ant.DirectoryScanner.scandir(DirectoryScanner.java:1241)
	at org.apache.tools.ant.DirectoryScanner.scandir(DirectoryScanner.java:1267)
	at org.apache.tools.ant.DirectoryScanner.scandir(DirectoryScanner.java:1267)
	at org.apache.tools.ant.DirectoryScanner.scandir(DirectoryScanner.java:1267)
	at org.apache.tools.ant.DirectoryScanner.scandir(DirectoryScanner.java:1267)
	at org.apache.tools.ant.DirectoryScanner.scandir(DirectoryScanner.java:1267)
	at org.apache.tools.ant.DirectoryScanner.scandir(DirectoryScanner.java:1267)
	at org.apache.tools.ant.DirectoryScanner.scandir(DirectoryScanner.java:1267)
	at org.apache.tools.ant.DirectoryScanner.scandir(DirectoryScanner.java:1267)
	at org.apache.tools.ant.DirectoryScanner.scandir(DirectoryScanner.java:1267)
	at org.apache.tools.ant.DirectoryScanner.scandir(DirectoryScanner.java:1194)
	at org.apache.tools.ant.DirectoryScanner.scandir(DirectoryScanner.java:1156)
	at org.apache.tools.ant.DirectoryScanner.checkIncludePatterns(DirectoryScanner.java:954)
	at org.apache.tools.ant.DirectoryScanner.scan(DirectoryScanner.java:912)
	at hudson.FilePath$ValidateAntFileMask.hasMatch(FilePath.java:3222)
Caused: java.lang.InterruptedException: no matches found within 10000
	at hudson.FilePath$ValidateAntFileMask.hasMatch(FilePath.java:3227)
	at hudson.FilePath$ValidateAntFileMask.invoke(FilePath.java:3105)
	at hudson.FilePath$ValidateAntFileMask.invoke(FilePath.java:3083)
	at hudson.FilePath$FileCallableWrapper.call(FilePath.java:3487)
Also:   hudson.remoting.Channel$CallSiteStackTrace: Remote call to jenkins-s390x-2
		at hudson.remoting.Channel.attachCallSiteStackTrace(Channel.java:1784)
		at hudson.remoting.UserRequest$ExceptionResponse.retrieve(UserRequest.java:356)
		at hudson.remoting.Channel.call(Channel.java:1000)
		at hudson.FilePath.act(FilePath.java:1194)
		at hudson.FilePath.act(FilePath.java:1183)
		at hudson.FilePath.validateAntFileMask(FilePath.java:3080)
		at hudson.tasks.ArtifactArchiver.perform(ArtifactArchiver.java:269)
		at hudson.tasks.BuildStepCompatibilityLayer.perform(BuildStepCompatibilityLayer.java:79)
		at hudson.tasks.BuildStepMonitor$1.perform(BuildStepMonitor.java:20)
		at hudson.model.AbstractBuild$AbstractBuildExecution.perform(AbstractBuild.java:814)
		at hudson.model.AbstractBuild$AbstractBuildExecution.performAllBuildSteps(AbstractBuild.java:763)
		at hudson.model.Build$BuildExecution.post2(Build.java:179)
		at hudson.model.AbstractBuild$AbstractBuildExecution.post(AbstractBuild.java:707)
		at hudson.model.Run.execute(Run.java:1921)
		at hudson.model.FreeStyleBuild.run(FreeStyleBuild.java:44)
		at hudson.model.ResourceController.execute(ResourceController.java:101)
		at hudson.model.Executor.run(Executor.java:442)
Caused: hudson.FilePath$TunneledInterruptedException
	at hudson.FilePath$FileCallableWrapper.call(FilePath.java:3489)
	at hudson.remoting.UserRequest.perform(UserRequest.java:211)
	at hudson.remoting.UserRequest.perform(UserRequest.java:54)
	at hudson.remoting.Request$2.run(Request.java:376)
	at hudson.remoting.InterceptingExecutorService.lambda$wrap$0(InterceptingExecutorService.java:78)
	at java.base/java.util.concurrent.FutureTask.run(FutureTask.java:264)
	at java.base/java.util.concurrent.ThreadPoolExecutor.runWorker(ThreadPoolExecutor.java:1128)
	at java.base/java.util.concurrent.ThreadPoolExecutor$Worker.run(ThreadPoolExecutor.java:628)
	at java.base/java.lang.Thread.run(Thread.java:829)
Caused: java.lang.InterruptedException: java.lang.InterruptedException: no matches found within 10000
	at hudson.FilePath.act(FilePath.java:1196)
	at hudson.FilePath.act(FilePath.java:1183)
	at hudson.FilePath.validateAntFileMask(FilePath.java:3080)
	at hudson.tasks.ArtifactArchiver.perform(ArtifactArchiver.java:269)
	at hudson.tasks.BuildStepCompatibilityLayer.perform(BuildStepCompatibilityLayer.java:79)
	at hudson.tasks.BuildStepMonitor$1.perform(BuildStepMonitor.java:20)
	at hudson.model.AbstractBuild$AbstractBuildExecution.perform(AbstractBuild.java:814)
	at hudson.model.AbstractBuild$AbstractBuildExecution.performAllBuildSteps(AbstractBuild.java:763)
	at hudson.model.Build$BuildExecution.post2(Build.java:179)
	at hudson.model.AbstractBuild$AbstractBuildExecution.post(AbstractBuild.java:707)
	at hudson.model.Run.execute(Run.java:1921)
	at hudson.model.FreeStyleBuild.run(FreeStyleBuild.java:44)
	at hudson.model.ResourceController.execute(ResourceController.java:101)
	at hudson.model.Executor.run(Executor.java:442)
No artifacts found that match the file pattern "**/*.events,heapdumps/**,**/hs_err_pid*". Configuration error?
Recording test results
[Checks API] No suitable checks publisher found.
Build step 'Publish JUnit test result report' changed build result to UNSTABLE
Email was triggered for: Unstable (Test Failures)
Sending email for trigger: Unstable (Test Failures)

[JENKINS] Solr » Solr-Check-main-s390x - Build # 75 - Still unstable!

Posted by Apache Jenkins Server <je...@builds.apache.org>.
Build: https://ci-builds.apache.org/job/Solr/job/Solr-Check-main-s390x/75/

3 tests failed.
FAILED:  org.apache.solr.handler.admin.HealthCheckHandlerTest.testHealthCheckHandler

Error Message:
org.apache.solr.client.solrj.impl.BaseHttpSolrClient$RemoteSolrException: Error from server at https://127.0.0.1:46237/solr: Host Unavailable: Not in live nodes as per zk

Stack Trace:
org.apache.solr.client.solrj.impl.BaseHttpSolrClient$RemoteSolrException: Error from server at https://127.0.0.1:46237/solr: Host Unavailable: Not in live nodes as per zk
	at __randomizedtesting.SeedInfo.seed([4C377187FEDFA331:6D253699CBD027A5]:0)
	at app//org.apache.solr.client.solrj.impl.HttpSolrClient.executeMethod(HttpSolrClient.java:720)
	at app//org.apache.solr.client.solrj.impl.HttpSolrClient.request(HttpSolrClient.java:234)
	at app//org.apache.solr.client.solrj.impl.HttpSolrClient.request(HttpSolrClient.java:215)
	at app//org.apache.solr.client.solrj.SolrRequest.process(SolrRequest.java:234)
	at app//org.apache.solr.client.solrj.SolrRequest.process(SolrRequest.java:249)
	at app//org.apache.solr.handler.admin.HealthCheckHandlerTest.testHealthCheckHandler(HealthCheckHandlerTest.java:124)
	at java.base@11.0.17/jdk.internal.reflect.NativeMethodAccessorImpl.invoke0(Native Method)
	at java.base@11.0.17/jdk.internal.reflect.NativeMethodAccessorImpl.invoke(NativeMethodAccessorImpl.java:62)
	at java.base@11.0.17/jdk.internal.reflect.DelegatingMethodAccessorImpl.invoke(DelegatingMethodAccessorImpl.java:43)
	at java.base@11.0.17/java.lang.reflect.Method.invoke(Method.java:566)
	at app//com.carrotsearch.randomizedtesting.RandomizedRunner.invoke(RandomizedRunner.java:1758)
	at app//com.carrotsearch.randomizedtesting.RandomizedRunner$8.evaluate(RandomizedRunner.java:946)
	at app//com.carrotsearch.randomizedtesting.RandomizedRunner$9.evaluate(RandomizedRunner.java:982)
	at app//com.carrotsearch.randomizedtesting.RandomizedRunner$10.evaluate(RandomizedRunner.java:996)
	at app//com.carrotsearch.randomizedtesting.rules.SystemPropertiesRestoreRule$1.evaluate(SystemPropertiesRestoreRule.java:80)
	at app//org.junit.rules.RunRules.evaluate(RunRules.java:20)
	at app//org.apache.lucene.tests.util.TestRuleSetupTeardownChained$1.evaluate(TestRuleSetupTeardownChained.java:44)
	at app//org.apache.lucene.tests.util.AbstractBeforeAfterRule$1.evaluate(AbstractBeforeAfterRule.java:43)
	at app//org.apache.lucene.tests.util.TestRuleThreadAndTestName$1.evaluate(TestRuleThreadAndTestName.java:45)
	at app//org.apache.lucene.tests.util.TestRuleIgnoreAfterMaxFailures$1.evaluate(TestRuleIgnoreAfterMaxFailures.java:60)
	at app//org.apache.lucene.tests.util.TestRuleMarkFailure$1.evaluate(TestRuleMarkFailure.java:44)
	at app//org.junit.rules.RunRules.evaluate(RunRules.java:20)
	at app//com.carrotsearch.randomizedtesting.rules.StatementAdapter.evaluate(StatementAdapter.java:36)
	at app//com.carrotsearch.randomizedtesting.ThreadLeakControl$StatementRunner.run(ThreadLeakControl.java:390)
	at app//com.carrotsearch.randomizedtesting.ThreadLeakControl.forkTimeoutingTask(ThreadLeakControl.java:843)
	at app//com.carrotsearch.randomizedtesting.ThreadLeakControl$3.evaluate(ThreadLeakControl.java:490)
	at app//com.carrotsearch.randomizedtesting.RandomizedRunner.runSingleTest(RandomizedRunner.java:955)
	at app//com.carrotsearch.randomizedtesting.RandomizedRunner$5.evaluate(RandomizedRunner.java:840)
	at app//com.carrotsearch.randomizedtesting.RandomizedRunner$6.evaluate(RandomizedRunner.java:891)
	at app//com.carrotsearch.randomizedtesting.RandomizedRunner$7.evaluate(RandomizedRunner.java:902)
	at app//com.carrotsearch.randomizedtesting.rules.StatementAdapter.evaluate(StatementAdapter.java:36)
	at app//org.apache.lucene.tests.util.AbstractBeforeAfterRule$1.evaluate(AbstractBeforeAfterRule.java:43)
	at app//org.apache.lucene.tests.util.AbstractBeforeAfterRule$1.evaluate(AbstractBeforeAfterRule.java:43)
	at app//com.carrotsearch.randomizedtesting.rules.SystemPropertiesRestoreRule$1.evaluate(SystemPropertiesRestoreRule.java:80)
	at app//org.junit.rules.RunRules.evaluate(RunRules.java:20)
	at app//org.apache.lucene.tests.util.AbstractBeforeAfterRule$1.evaluate(AbstractBeforeAfterRule.java:43)
	at app//com.carrotsearch.randomizedtesting.rules.StatementAdapter.evaluate(StatementAdapter.java:36)
	at app//org.apache.lucene.tests.util.TestRuleStoreClassName$1.evaluate(TestRuleStoreClassName.java:38)
	at app//com.carrotsearch.randomizedtesting.rules.NoShadowingOrOverridesOnMethodsRule$1.evaluate(NoShadowingOrOverridesOnMethodsRule.java:40)
	at app//com.carrotsearch.randomizedtesting.rules.NoShadowingOrOverridesOnMethodsRule$1.evaluate(NoShadowingOrOverridesOnMethodsRule.java:40)
	at app//com.carrotsearch.randomizedtesting.rules.StatementAdapter.evaluate(StatementAdapter.java:36)
	at app//com.carrotsearch.randomizedtesting.rules.StatementAdapter.evaluate(StatementAdapter.java:36)
	at app//org.apache.lucene.tests.util.TestRuleAssertionsRequired$1.evaluate(TestRuleAssertionsRequired.java:53)
	at app//org.apache.lucene.tests.util.AbstractBeforeAfterRule$1.evaluate(AbstractBeforeAfterRule.java:43)
	at app//org.apache.lucene.tests.util.TestRuleMarkFailure$1.evaluate(TestRuleMarkFailure.java:44)
	at app//org.apache.lucene.tests.util.TestRuleIgnoreAfterMaxFailures$1.evaluate(TestRuleIgnoreAfterMaxFailures.java:60)
	at app//org.apache.lucene.tests.util.TestRuleIgnoreTestSuites$1.evaluate(TestRuleIgnoreTestSuites.java:47)
	at app//org.junit.rules.RunRules.evaluate(RunRules.java:20)
	at app//com.carrotsearch.randomizedtesting.rules.StatementAdapter.evaluate(StatementAdapter.java:36)
	at app//com.carrotsearch.randomizedtesting.ThreadLeakControl$StatementRunner.run(ThreadLeakControl.java:390)
	at app//com.carrotsearch.randomizedtesting.ThreadLeakControl.lambda$forkTimeoutingTask$0(ThreadLeakControl.java:850)
	at java.base@11.0.17/java.lang.Thread.run(Thread.java:829)


FAILED:  org.apache.solr.handler.designer.TestSchemaDesignerSettingsDAO.classMethod

Error Message:
java.util.concurrent.TimeoutException: Timed out waiting for all collections to be fully removed.

Stack Trace:
java.util.concurrent.TimeoutException: Timed out waiting for all collections to be fully removed.
	at __randomizedtesting.SeedInfo.seed([4C377187FEDFA331]:0)
	at org.apache.solr.cloud.MiniSolrCloudCluster.deleteAllCollections(MiniSolrCloudCluster.java:661)
	at org.apache.solr.handler.designer.TestSchemaDesignerSettingsDAO.tearDownCluster(TestSchemaDesignerSettingsDAO.java:52)
	at java.base/jdk.internal.reflect.NativeMethodAccessorImpl.invoke0(Native Method)
	at java.base/jdk.internal.reflect.NativeMethodAccessorImpl.invoke(NativeMethodAccessorImpl.java:62)
	at java.base/jdk.internal.reflect.DelegatingMethodAccessorImpl.invoke(DelegatingMethodAccessorImpl.java:43)
	at java.base/java.lang.reflect.Method.invoke(Method.java:566)
	at com.carrotsearch.randomizedtesting.RandomizedRunner.invoke(RandomizedRunner.java:1758)
	at com.carrotsearch.randomizedtesting.RandomizedRunner$7.evaluate(RandomizedRunner.java:909)
	at com.carrotsearch.randomizedtesting.rules.StatementAdapter.evaluate(StatementAdapter.java:36)
	at org.apache.lucene.tests.util.AbstractBeforeAfterRule$1.evaluate(AbstractBeforeAfterRule.java:43)
	at org.apache.lucene.tests.util.AbstractBeforeAfterRule$1.evaluate(AbstractBeforeAfterRule.java:43)
	at com.carrotsearch.randomizedtesting.rules.SystemPropertiesRestoreRule$1.evaluate(SystemPropertiesRestoreRule.java:80)
	at org.junit.rules.RunRules.evaluate(RunRules.java:20)
	at org.apache.lucene.tests.util.AbstractBeforeAfterRule$1.evaluate(AbstractBeforeAfterRule.java:43)
	at com.carrotsearch.randomizedtesting.rules.StatementAdapter.evaluate(StatementAdapter.java:36)
	at org.apache.lucene.tests.util.TestRuleStoreClassName$1.evaluate(TestRuleStoreClassName.java:38)
	at com.carrotsearch.randomizedtesting.rules.NoShadowingOrOverridesOnMethodsRule$1.evaluate(NoShadowingOrOverridesOnMethodsRule.java:40)
	at com.carrotsearch.randomizedtesting.rules.NoShadowingOrOverridesOnMethodsRule$1.evaluate(NoShadowingOrOverridesOnMethodsRule.java:40)
	at com.carrotsearch.randomizedtesting.rules.StatementAdapter.evaluate(StatementAdapter.java:36)
	at com.carrotsearch.randomizedtesting.rules.StatementAdapter.evaluate(StatementAdapter.java:36)
	at org.apache.lucene.tests.util.TestRuleAssertionsRequired$1.evaluate(TestRuleAssertionsRequired.java:53)
	at org.apache.lucene.tests.util.AbstractBeforeAfterRule$1.evaluate(AbstractBeforeAfterRule.java:43)
	at org.apache.lucene.tests.util.TestRuleMarkFailure$1.evaluate(TestRuleMarkFailure.java:44)
	at org.apache.lucene.tests.util.TestRuleIgnoreAfterMaxFailures$1.evaluate(TestRuleIgnoreAfterMaxFailures.java:60)
	at org.apache.lucene.tests.util.TestRuleIgnoreTestSuites$1.evaluate(TestRuleIgnoreTestSuites.java:47)
	at org.junit.rules.RunRules.evaluate(RunRules.java:20)
	at com.carrotsearch.randomizedtesting.rules.StatementAdapter.evaluate(StatementAdapter.java:36)
	at com.carrotsearch.randomizedtesting.ThreadLeakControl$StatementRunner.run(ThreadLeakControl.java:390)
	at com.carrotsearch.randomizedtesting.ThreadLeakControl.lambda$forkTimeoutingTask$0(ThreadLeakControl.java:850)
	at java.base/java.lang.Thread.run(Thread.java:829)


FAILED:  org.apache.solr.cloud.HttpPartitionOnCommitTest.test

Error Message:
org.apache.solr.client.solrj.impl.BaseHttpSolrClient$RemoteSolrException: Error from server at http://127.0.0.1:37011: Underlying core creation failed while creating collection: control_collection

Stack Trace:
org.apache.solr.client.solrj.impl.BaseHttpSolrClient$RemoteSolrException: Error from server at http://127.0.0.1:37011: Underlying core creation failed while creating collection: control_collection
	at __randomizedtesting.SeedInfo.seed([4C377187FEDFA331:C4634E5D5023CEC9]:0)
	at app//org.apache.solr.client.solrj.impl.HttpSolrClient.executeMethod(HttpSolrClient.java:720)
	at app//org.apache.solr.client.solrj.impl.HttpSolrClient.request(HttpSolrClient.java:234)
	at app//org.apache.solr.client.solrj.impl.HttpSolrClient.request(HttpSolrClient.java:215)
	at app//org.apache.solr.client.solrj.impl.LBSolrClient.doRequest(LBSolrClient.java:405)
	at app//org.apache.solr.client.solrj.impl.LBSolrClient.request(LBSolrClient.java:371)
	at app//org.apache.solr.client.solrj.impl.CloudSolrClient.sendRequest(CloudSolrClient.java:1174)
	at app//org.apache.solr.client.solrj.impl.CloudSolrClient.requestWithRetryOnStaleState(CloudSolrClient.java:880)
	at app//org.apache.solr.client.solrj.impl.CloudSolrClient.request(CloudSolrClient.java:807)
	at app//org.apache.solr.client.solrj.SolrRequest.process(SolrRequest.java:234)
	at app//org.apache.solr.client.solrj.SolrRequest.process(SolrRequest.java:249)
	at app//org.apache.solr.cloud.AbstractFullDistribZkTestBase.createServers(AbstractFullDistribZkTestBase.java:353)
	at app//org.apache.solr.BaseDistributedSearchTestCase$ShardsRepeatRule$ShardsFixedStatement.callStatement(BaseDistributedSearchTestCase.java:1164)
	at app//org.apache.solr.BaseDistributedSearchTestCase$ShardsRepeatRule$ShardsStatement.evaluate(BaseDistributedSearchTestCase.java:1137)
	at app//com.carrotsearch.randomizedtesting.rules.SystemPropertiesRestoreRule$1.evaluate(SystemPropertiesRestoreRule.java:80)
	at app//org.junit.rules.RunRules.evaluate(RunRules.java:20)
	at app//org.apache.lucene.tests.util.TestRuleSetupTeardownChained$1.evaluate(TestRuleSetupTeardownChained.java:44)
	at app//org.apache.lucene.tests.util.AbstractBeforeAfterRule$1.evaluate(AbstractBeforeAfterRule.java:43)
	at app//org.apache.lucene.tests.util.TestRuleThreadAndTestName$1.evaluate(TestRuleThreadAndTestName.java:45)
	at app//org.apache.lucene.tests.util.TestRuleIgnoreAfterMaxFailures$1.evaluate(TestRuleIgnoreAfterMaxFailures.java:60)
	at app//org.apache.lucene.tests.util.TestRuleMarkFailure$1.evaluate(TestRuleMarkFailure.java:44)
	at app//org.junit.rules.RunRules.evaluate(RunRules.java:20)
	at app//com.carrotsearch.randomizedtesting.rules.StatementAdapter.evaluate(StatementAdapter.java:36)
	at app//com.carrotsearch.randomizedtesting.ThreadLeakControl$StatementRunner.run(ThreadLeakControl.java:390)
	at app//com.carrotsearch.randomizedtesting.ThreadLeakControl.forkTimeoutingTask(ThreadLeakControl.java:843)
	at app//com.carrotsearch.randomizedtesting.ThreadLeakControl$3.evaluate(ThreadLeakControl.java:490)
	at app//com.carrotsearch.randomizedtesting.RandomizedRunner.runSingleTest(RandomizedRunner.java:955)
	at app//com.carrotsearch.randomizedtesting.RandomizedRunner$5.evaluate(RandomizedRunner.java:840)
	at app//com.carrotsearch.randomizedtesting.RandomizedRunner$6.evaluate(RandomizedRunner.java:891)
	at app//com.carrotsearch.randomizedtesting.RandomizedRunner$7.evaluate(RandomizedRunner.java:902)
	at app//com.carrotsearch.randomizedtesting.rules.StatementAdapter.evaluate(StatementAdapter.java:36)
	at app//org.apache.lucene.tests.util.AbstractBeforeAfterRule$1.evaluate(AbstractBeforeAfterRule.java:43)
	at app//org.apache.lucene.tests.util.AbstractBeforeAfterRule$1.evaluate(AbstractBeforeAfterRule.java:43)
	at app//com.carrotsearch.randomizedtesting.rules.SystemPropertiesRestoreRule$1.evaluate(SystemPropertiesRestoreRule.java:80)
	at app//org.junit.rules.RunRules.evaluate(RunRules.java:20)
	at app//org.apache.lucene.tests.util.AbstractBeforeAfterRule$1.evaluate(AbstractBeforeAfterRule.java:43)
	at app//com.carrotsearch.randomizedtesting.rules.StatementAdapter.evaluate(StatementAdapter.java:36)
	at app//org.apache.lucene.tests.util.TestRuleStoreClassName$1.evaluate(TestRuleStoreClassName.java:38)
	at app//com.carrotsearch.randomizedtesting.rules.NoShadowingOrOverridesOnMethodsRule$1.evaluate(NoShadowingOrOverridesOnMethodsRule.java:40)
	at app//com.carrotsearch.randomizedtesting.rules.NoShadowingOrOverridesOnMethodsRule$1.evaluate(NoShadowingOrOverridesOnMethodsRule.java:40)
	at app//com.carrotsearch.randomizedtesting.rules.StatementAdapter.evaluate(StatementAdapter.java:36)
	at app//com.carrotsearch.randomizedtesting.rules.StatementAdapter.evaluate(StatementAdapter.java:36)
	at app//org.apache.lucene.tests.util.TestRuleAssertionsRequired$1.evaluate(TestRuleAssertionsRequired.java:53)
	at app//org.apache.lucene.tests.util.AbstractBeforeAfterRule$1.evaluate(AbstractBeforeAfterRule.java:43)
	at app//org.apache.lucene.tests.util.TestRuleMarkFailure$1.evaluate(TestRuleMarkFailure.java:44)
	at app//org.apache.lucene.tests.util.TestRuleIgnoreAfterMaxFailures$1.evaluate(TestRuleIgnoreAfterMaxFailures.java:60)
	at app//org.apache.lucene.tests.util.TestRuleIgnoreTestSuites$1.evaluate(TestRuleIgnoreTestSuites.java:47)
	at app//org.junit.rules.RunRules.evaluate(RunRules.java:20)
	at app//com.carrotsearch.randomizedtesting.rules.StatementAdapter.evaluate(StatementAdapter.java:36)
	at app//com.carrotsearch.randomizedtesting.ThreadLeakControl$StatementRunner.run(ThreadLeakControl.java:390)
	at app//com.carrotsearch.randomizedtesting.ThreadLeakControl.lambda$forkTimeoutingTask$0(ThreadLeakControl.java:850)
	at java.base@11.0.17/java.lang.Thread.run(Thread.java:829)




Build Log:
[...truncated 2718 lines...]
ERROR: The following test(s) have failed:
  - org.apache.solr.cloud.HttpPartitionOnCommitTest.test (:solr:core)
    Test output: /home/jenkins/jenkins-home/712657a4/workspace/Solr/Solr-Check-main-s390x/solr/core/build/test-results/test/outputs/OUTPUT-org.apache.solr.cloud.HttpPartitionOnCommitTest.txt
    Reproduce with: gradlew :solr:core:test --tests "org.apache.solr.cloud.HttpPartitionOnCommitTest.test" -Ptests.jvms=4 -Ptests.haltonfailure=false "-Ptests.jvmargs=-XX:TieredStopAtLevel=1 -XX:ReservedCodeCacheSize=120m" -Ptests.seed=4C377187FEDFA331 -Ptests.multiplier=2 -Ptests.badapples=false -Ptests.file.encoding=UTF-8

  - org.apache.solr.handler.admin.HealthCheckHandlerTest.testHealthCheckHandler (:solr:core)
    Test output: /home/jenkins/jenkins-home/712657a4/workspace/Solr/Solr-Check-main-s390x/solr/core/build/test-results/test/outputs/OUTPUT-org.apache.solr.handler.admin.HealthCheckHandlerTest.txt
    Reproduce with: gradlew :solr:core:test --tests "org.apache.solr.handler.admin.HealthCheckHandlerTest.testHealthCheckHandler" -Ptests.jvms=4 -Ptests.haltonfailure=false "-Ptests.jvmargs=-XX:TieredStopAtLevel=1 -XX:ReservedCodeCacheSize=120m" -Ptests.seed=4C377187FEDFA331 -Ptests.multiplier=2 -Ptests.badapples=false -Ptests.file.encoding=UTF-8

  - org.apache.solr.handler.designer.TestSchemaDesignerSettingsDAO.classMethod (:solr:core)
    Test output: /home/jenkins/jenkins-home/712657a4/workspace/Solr/Solr-Check-main-s390x/solr/core/build/test-results/test/outputs/OUTPUT-org.apache.solr.handler.designer.TestSchemaDesignerSettingsDAO.txt
    Reproduce with: gradlew :solr:core:test --tests "org.apache.solr.handler.designer.TestSchemaDesignerSettingsDAO.classMethod" -Ptests.jvms=4 -Ptests.haltonfailure=false "-Ptests.jvmargs=-XX:TieredStopAtLevel=1 -XX:ReservedCodeCacheSize=120m" -Ptests.seed=4C377187FEDFA331 -Ptests.multiplier=2 -Ptests.badapples=false -Ptests.file.encoding=UTF-8


Deprecated Gradle features were used in this build, making it incompatible with Gradle 8.0.

You can use '--warning-mode all' to show the individual deprecation warnings and determine if they come from your own scripts or plugins.

See https://docs.gradle.org/7.5.1/userguide/command_line_interface.html#sec:command_line_warnings

BUILD SUCCESSFUL in 2h 21m 4s
609 actionable tasks: 609 executed
Build step 'Invoke Gradle script' changed build result to SUCCESS
Archiving artifacts
hudson.FilePath$ValidateAntFileMask$1Cancel
	at hudson.FilePath$ValidateAntFileMask$1.isCaseSensitive(FilePath.java:3209)
	at org.apache.tools.ant.DirectoryScanner.lambda$isIncluded$3(DirectoryScanner.java:1374)
	at java.base/java.util.stream.MatchOps$1MatchSink.accept(MatchOps.java:90)
	at java.base/java.util.Spliterators$ArraySpliterator.tryAdvance(Spliterators.java:958)
	at java.base/java.util.stream.ReferencePipeline.forEachWithCancel(ReferencePipeline.java:127)
	at java.base/java.util.stream.AbstractPipeline.copyIntoWithCancel(AbstractPipeline.java:502)
	at java.base/java.util.stream.AbstractPipeline.copyInto(AbstractPipeline.java:488)
	at java.base/java.util.stream.AbstractPipeline.wrapAndCopyInto(AbstractPipeline.java:474)
	at java.base/java.util.stream.MatchOps$MatchOp.evaluateSequential(MatchOps.java:230)
	at java.base/java.util.stream.MatchOps$MatchOp.evaluateSequential(MatchOps.java:196)
	at java.base/java.util.stream.AbstractPipeline.evaluate(AbstractPipeline.java:234)
	at java.base/java.util.stream.ReferencePipeline.anyMatch(ReferencePipeline.java:528)
	at org.apache.tools.ant.DirectoryScanner.isIncluded(DirectoryScanner.java:1374)
	at org.apache.tools.ant.DirectoryScanner.scandir(DirectoryScanner.java:1241)
	at org.apache.tools.ant.DirectoryScanner.scandir(DirectoryScanner.java:1267)
	at org.apache.tools.ant.DirectoryScanner.scandir(DirectoryScanner.java:1267)
	at org.apache.tools.ant.DirectoryScanner.scandir(DirectoryScanner.java:1267)
	at org.apache.tools.ant.DirectoryScanner.scandir(DirectoryScanner.java:1267)
	at org.apache.tools.ant.DirectoryScanner.scandir(DirectoryScanner.java:1267)
	at org.apache.tools.ant.DirectoryScanner.scandir(DirectoryScanner.java:1267)
	at org.apache.tools.ant.DirectoryScanner.scandir(DirectoryScanner.java:1194)
	at org.apache.tools.ant.DirectoryScanner.scandir(DirectoryScanner.java:1156)
	at org.apache.tools.ant.DirectoryScanner.checkIncludePatterns(DirectoryScanner.java:954)
	at org.apache.tools.ant.DirectoryScanner.scan(DirectoryScanner.java:912)
	at hudson.FilePath$ValidateAntFileMask.hasMatch(FilePath.java:3222)
Caused: java.lang.InterruptedException: no matches found within 10000
	at hudson.FilePath$ValidateAntFileMask.hasMatch(FilePath.java:3227)
	at hudson.FilePath$ValidateAntFileMask.invoke(FilePath.java:3105)
	at hudson.FilePath$ValidateAntFileMask.invoke(FilePath.java:3083)
	at hudson.FilePath$FileCallableWrapper.call(FilePath.java:3487)
Also:   hudson.remoting.Channel$CallSiteStackTrace: Remote call to jenkins-s390x-2
		at hudson.remoting.Channel.attachCallSiteStackTrace(Channel.java:1784)
		at hudson.remoting.UserRequest$ExceptionResponse.retrieve(UserRequest.java:356)
		at hudson.remoting.Channel.call(Channel.java:1000)
		at hudson.FilePath.act(FilePath.java:1194)
		at hudson.FilePath.act(FilePath.java:1183)
		at hudson.FilePath.validateAntFileMask(FilePath.java:3080)
		at hudson.tasks.ArtifactArchiver.perform(ArtifactArchiver.java:269)
		at hudson.tasks.BuildStepCompatibilityLayer.perform(BuildStepCompatibilityLayer.java:79)
		at hudson.tasks.BuildStepMonitor$1.perform(BuildStepMonitor.java:20)
		at hudson.model.AbstractBuild$AbstractBuildExecution.perform(AbstractBuild.java:814)
		at hudson.model.AbstractBuild$AbstractBuildExecution.performAllBuildSteps(AbstractBuild.java:763)
		at hudson.model.Build$BuildExecution.post2(Build.java:179)
		at hudson.model.AbstractBuild$AbstractBuildExecution.post(AbstractBuild.java:707)
		at hudson.model.Run.execute(Run.java:1921)
		at hudson.model.FreeStyleBuild.run(FreeStyleBuild.java:44)
		at hudson.model.ResourceController.execute(ResourceController.java:101)
		at hudson.model.Executor.run(Executor.java:442)
Caused: hudson.FilePath$TunneledInterruptedException
	at hudson.FilePath$FileCallableWrapper.call(FilePath.java:3489)
	at hudson.remoting.UserRequest.perform(UserRequest.java:211)
	at hudson.remoting.UserRequest.perform(UserRequest.java:54)
	at hudson.remoting.Request$2.run(Request.java:376)
	at hudson.remoting.InterceptingExecutorService.lambda$wrap$0(InterceptingExecutorService.java:78)
	at java.base/java.util.concurrent.FutureTask.run(FutureTask.java:264)
	at java.base/java.util.concurrent.ThreadPoolExecutor.runWorker(ThreadPoolExecutor.java:1128)
	at java.base/java.util.concurrent.ThreadPoolExecutor$Worker.run(ThreadPoolExecutor.java:628)
	at java.base/java.lang.Thread.run(Thread.java:829)
Caused: java.lang.InterruptedException: java.lang.InterruptedException: no matches found within 10000
	at hudson.FilePath.act(FilePath.java:1196)
	at hudson.FilePath.act(FilePath.java:1183)
	at hudson.FilePath.validateAntFileMask(FilePath.java:3080)
	at hudson.tasks.ArtifactArchiver.perform(ArtifactArchiver.java:269)
	at hudson.tasks.BuildStepCompatibilityLayer.perform(BuildStepCompatibilityLayer.java:79)
	at hudson.tasks.BuildStepMonitor$1.perform(BuildStepMonitor.java:20)
	at hudson.model.AbstractBuild$AbstractBuildExecution.perform(AbstractBuild.java:814)
	at hudson.model.AbstractBuild$AbstractBuildExecution.performAllBuildSteps(AbstractBuild.java:763)
	at hudson.model.Build$BuildExecution.post2(Build.java:179)
	at hudson.model.AbstractBuild$AbstractBuildExecution.post(AbstractBuild.java:707)
	at hudson.model.Run.execute(Run.java:1921)
	at hudson.model.FreeStyleBuild.run(FreeStyleBuild.java:44)
	at hudson.model.ResourceController.execute(ResourceController.java:101)
	at hudson.model.Executor.run(Executor.java:442)
No artifacts found that match the file pattern "**/*.events,heapdumps/**,**/hs_err_pid*". Configuration error?
Recording test results
[Checks API] No suitable checks publisher found.
Build step 'Publish JUnit test result report' changed build result to UNSTABLE
Email was triggered for: Unstable (Test Failures)
Sending email for trigger: Unstable (Test Failures)

[JENKINS] Solr » Solr-Check-main-s390x - Build # 74 - Still Failing!

Posted by Apache Jenkins Server <je...@builds.apache.org>.
Build: https://ci-builds.apache.org/job/Solr/job/Solr-Check-main-s390x/74/

9 tests failed.
FAILED:  org.apache.solr.cloud.MoveReplicaTest.testFailedMove

Error Message:
org.apache.solr.client.solrj.impl.BaseHttpSolrClient$RemoteSolrException: Error from server at https://127.0.0.1:41391/solr: Underlying core creation failed while creating collection: MoveReplicaTest_failed_coll_true

Stack Trace:
org.apache.solr.client.solrj.impl.BaseHttpSolrClient$RemoteSolrException: Error from server at https://127.0.0.1:41391/solr: Underlying core creation failed while creating collection: MoveReplicaTest_failed_coll_true
	at __randomizedtesting.SeedInfo.seed([8A39AA414661ABDA:20F479B3F1B27E0A]:0)
	at app//org.apache.solr.client.solrj.impl.HttpSolrClient.executeMethod(HttpSolrClient.java:720)
	at app//org.apache.solr.client.solrj.impl.HttpSolrClient.request(HttpSolrClient.java:234)
	at app//org.apache.solr.client.solrj.impl.HttpSolrClient.request(HttpSolrClient.java:215)
	at app//org.apache.solr.client.solrj.impl.LBSolrClient.doRequest(LBSolrClient.java:405)
	at app//org.apache.solr.client.solrj.impl.LBSolrClient.request(LBSolrClient.java:371)
	at app//org.apache.solr.client.solrj.impl.CloudSolrClient.sendRequest(CloudSolrClient.java:1174)
	at app//org.apache.solr.client.solrj.impl.CloudSolrClient.requestWithRetryOnStaleState(CloudSolrClient.java:880)
	at app//org.apache.solr.client.solrj.impl.CloudSolrClient.request(CloudSolrClient.java:807)
	at app//org.apache.solr.client.solrj.SolrClient.request(SolrClient.java:1193)
	at app//org.apache.solr.cloud.AbstractMoveReplicaTestBase.testFailedMove(AbstractMoveReplicaTestBase.java:270)
	at app//org.apache.solr.cloud.MoveReplicaTest.testFailedMove(MoveReplicaTest.java:37)
	at java.base@11.0.16/jdk.internal.reflect.NativeMethodAccessorImpl.invoke0(Native Method)
	at java.base@11.0.16/jdk.internal.reflect.NativeMethodAccessorImpl.invoke(NativeMethodAccessorImpl.java:62)
	at java.base@11.0.16/jdk.internal.reflect.DelegatingMethodAccessorImpl.invoke(DelegatingMethodAccessorImpl.java:43)
	at java.base@11.0.16/java.lang.reflect.Method.invoke(Method.java:566)
	at app//com.carrotsearch.randomizedtesting.RandomizedRunner.invoke(RandomizedRunner.java:1758)
	at app//com.carrotsearch.randomizedtesting.RandomizedRunner$8.evaluate(RandomizedRunner.java:946)
	at app//com.carrotsearch.randomizedtesting.RandomizedRunner$9.evaluate(RandomizedRunner.java:982)
	at app//com.carrotsearch.randomizedtesting.RandomizedRunner$10.evaluate(RandomizedRunner.java:996)
	at app//com.carrotsearch.randomizedtesting.rules.SystemPropertiesRestoreRule$1.evaluate(SystemPropertiesRestoreRule.java:80)
	at app//org.junit.rules.RunRules.evaluate(RunRules.java:20)
	at app//org.apache.lucene.tests.util.TestRuleSetupTeardownChained$1.evaluate(TestRuleSetupTeardownChained.java:44)
	at app//org.apache.lucene.tests.util.AbstractBeforeAfterRule$1.evaluate(AbstractBeforeAfterRule.java:43)
	at app//org.apache.lucene.tests.util.TestRuleThreadAndTestName$1.evaluate(TestRuleThreadAndTestName.java:45)
	at app//org.apache.lucene.tests.util.TestRuleIgnoreAfterMaxFailures$1.evaluate(TestRuleIgnoreAfterMaxFailures.java:60)
	at app//org.apache.lucene.tests.util.TestRuleMarkFailure$1.evaluate(TestRuleMarkFailure.java:44)
	at app//org.junit.rules.RunRules.evaluate(RunRules.java:20)
	at app//com.carrotsearch.randomizedtesting.rules.StatementAdapter.evaluate(StatementAdapter.java:36)
	at app//com.carrotsearch.randomizedtesting.ThreadLeakControl$StatementRunner.run(ThreadLeakControl.java:390)
	at app//com.carrotsearch.randomizedtesting.ThreadLeakControl.forkTimeoutingTask(ThreadLeakControl.java:843)
	at app//com.carrotsearch.randomizedtesting.ThreadLeakControl$3.evaluate(ThreadLeakControl.java:490)
	at app//com.carrotsearch.randomizedtesting.RandomizedRunner.runSingleTest(RandomizedRunner.java:955)
	at app//com.carrotsearch.randomizedtesting.RandomizedRunner$5.evaluate(RandomizedRunner.java:840)
	at app//com.carrotsearch.randomizedtesting.RandomizedRunner$6.evaluate(RandomizedRunner.java:891)
	at app//com.carrotsearch.randomizedtesting.RandomizedRunner$7.evaluate(RandomizedRunner.java:902)
	at app//com.carrotsearch.randomizedtesting.rules.StatementAdapter.evaluate(StatementAdapter.java:36)
	at app//org.apache.lucene.tests.util.AbstractBeforeAfterRule$1.evaluate(AbstractBeforeAfterRule.java:43)
	at app//org.apache.lucene.tests.util.AbstractBeforeAfterRule$1.evaluate(AbstractBeforeAfterRule.java:43)
	at app//com.carrotsearch.randomizedtesting.rules.SystemPropertiesRestoreRule$1.evaluate(SystemPropertiesRestoreRule.java:80)
	at app//org.junit.rules.RunRules.evaluate(RunRules.java:20)
	at app//org.apache.lucene.tests.util.AbstractBeforeAfterRule$1.evaluate(AbstractBeforeAfterRule.java:43)
	at app//com.carrotsearch.randomizedtesting.rules.StatementAdapter.evaluate(StatementAdapter.java:36)
	at app//org.apache.lucene.tests.util.TestRuleStoreClassName$1.evaluate(TestRuleStoreClassName.java:38)
	at app//com.carrotsearch.randomizedtesting.rules.NoShadowingOrOverridesOnMethodsRule$1.evaluate(NoShadowingOrOverridesOnMethodsRule.java:40)
	at app//com.carrotsearch.randomizedtesting.rules.NoShadowingOrOverridesOnMethodsRule$1.evaluate(NoShadowingOrOverridesOnMethodsRule.java:40)
	at app//com.carrotsearch.randomizedtesting.rules.StatementAdapter.evaluate(StatementAdapter.java:36)
	at app//com.carrotsearch.randomizedtesting.rules.StatementAdapter.evaluate(StatementAdapter.java:36)
	at app//org.apache.lucene.tests.util.TestRuleAssertionsRequired$1.evaluate(TestRuleAssertionsRequired.java:53)
	at app//org.apache.lucene.tests.util.AbstractBeforeAfterRule$1.evaluate(AbstractBeforeAfterRule.java:43)
	at app//org.apache.lucene.tests.util.TestRuleMarkFailure$1.evaluate(TestRuleMarkFailure.java:44)
	at app//org.apache.lucene.tests.util.TestRuleIgnoreAfterMaxFailures$1.evaluate(TestRuleIgnoreAfterMaxFailures.java:60)
	at app//org.apache.lucene.tests.util.TestRuleIgnoreTestSuites$1.evaluate(TestRuleIgnoreTestSuites.java:47)
	at app//org.junit.rules.RunRules.evaluate(RunRules.java:20)
	at app//com.carrotsearch.randomizedtesting.rules.StatementAdapter.evaluate(StatementAdapter.java:36)
	at app//com.carrotsearch.randomizedtesting.ThreadLeakControl$StatementRunner.run(ThreadLeakControl.java:390)
	at app//com.carrotsearch.randomizedtesting.ThreadLeakControl.lambda$forkTimeoutingTask$0(ThreadLeakControl.java:850)
	at java.base@11.0.16/java.lang.Thread.run(Thread.java:829)


FAILED:  org.apache.solr.cloud.OverseerTest.testReplay

Error Message:
java.util.concurrent.TimeoutException: Timeout waiting to see state for collection=collection1 :null

Stack Trace:
java.util.concurrent.TimeoutException: Timeout waiting to see state for collection=collection1 :null
	at __randomizedtesting.SeedInfo.seed([8A39AA414661ABDA:C2F0A205A852DAA1]:0)
	at org.apache.solr.common.cloud.ZkStateReader.waitForState(ZkStateReader.java:1910)
	at org.apache.solr.cloud.OverseerTest.testReplay(OverseerTest.java:1645)
	at java.base/jdk.internal.reflect.NativeMethodAccessorImpl.invoke0(Native Method)
	at java.base/jdk.internal.reflect.NativeMethodAccessorImpl.invoke(NativeMethodAccessorImpl.java:62)
	at java.base/jdk.internal.reflect.DelegatingMethodAccessorImpl.invoke(DelegatingMethodAccessorImpl.java:43)
	at java.base/java.lang.reflect.Method.invoke(Method.java:566)
	at com.carrotsearch.randomizedtesting.RandomizedRunner.invoke(RandomizedRunner.java:1758)
	at com.carrotsearch.randomizedtesting.RandomizedRunner$8.evaluate(RandomizedRunner.java:946)
	at com.carrotsearch.randomizedtesting.RandomizedRunner$9.evaluate(RandomizedRunner.java:982)
	at com.carrotsearch.randomizedtesting.RandomizedRunner$10.evaluate(RandomizedRunner.java:996)
	at com.carrotsearch.randomizedtesting.rules.SystemPropertiesRestoreRule$1.evaluate(SystemPropertiesRestoreRule.java:80)
	at org.junit.rules.RunRules.evaluate(RunRules.java:20)
	at org.apache.lucene.tests.util.TestRuleSetupTeardownChained$1.evaluate(TestRuleSetupTeardownChained.java:44)
	at org.apache.lucene.tests.util.AbstractBeforeAfterRule$1.evaluate(AbstractBeforeAfterRule.java:43)
	at org.apache.lucene.tests.util.TestRuleThreadAndTestName$1.evaluate(TestRuleThreadAndTestName.java:45)
	at org.apache.lucene.tests.util.TestRuleIgnoreAfterMaxFailures$1.evaluate(TestRuleIgnoreAfterMaxFailures.java:60)
	at org.apache.lucene.tests.util.TestRuleMarkFailure$1.evaluate(TestRuleMarkFailure.java:44)
	at org.junit.rules.RunRules.evaluate(RunRules.java:20)
	at com.carrotsearch.randomizedtesting.rules.StatementAdapter.evaluate(StatementAdapter.java:36)
	at com.carrotsearch.randomizedtesting.ThreadLeakControl$StatementRunner.run(ThreadLeakControl.java:390)
	at com.carrotsearch.randomizedtesting.ThreadLeakControl.forkTimeoutingTask(ThreadLeakControl.java:843)
	at com.carrotsearch.randomizedtesting.ThreadLeakControl$3.evaluate(ThreadLeakControl.java:490)
	at com.carrotsearch.randomizedtesting.RandomizedRunner.runSingleTest(RandomizedRunner.java:955)
	at com.carrotsearch.randomizedtesting.RandomizedRunner$5.evaluate(RandomizedRunner.java:840)
	at com.carrotsearch.randomizedtesting.RandomizedRunner$6.evaluate(RandomizedRunner.java:891)
	at com.carrotsearch.randomizedtesting.RandomizedRunner$7.evaluate(RandomizedRunner.java:902)
	at com.carrotsearch.randomizedtesting.rules.StatementAdapter.evaluate(StatementAdapter.java:36)
	at org.apache.lucene.tests.util.AbstractBeforeAfterRule$1.evaluate(AbstractBeforeAfterRule.java:43)
	at org.apache.lucene.tests.util.AbstractBeforeAfterRule$1.evaluate(AbstractBeforeAfterRule.java:43)
	at com.carrotsearch.randomizedtesting.rules.SystemPropertiesRestoreRule$1.evaluate(SystemPropertiesRestoreRule.java:80)
	at org.junit.rules.RunRules.evaluate(RunRules.java:20)
	at org.apache.lucene.tests.util.AbstractBeforeAfterRule$1.evaluate(AbstractBeforeAfterRule.java:43)
	at com.carrotsearch.randomizedtesting.rules.StatementAdapter.evaluate(StatementAdapter.java:36)
	at org.apache.lucene.tests.util.TestRuleStoreClassName$1.evaluate(TestRuleStoreClassName.java:38)
	at com.carrotsearch.randomizedtesting.rules.NoShadowingOrOverridesOnMethodsRule$1.evaluate(NoShadowingOrOverridesOnMethodsRule.java:40)
	at com.carrotsearch.randomizedtesting.rules.NoShadowingOrOverridesOnMethodsRule$1.evaluate(NoShadowingOrOverridesOnMethodsRule.java:40)
	at com.carrotsearch.randomizedtesting.rules.StatementAdapter.evaluate(StatementAdapter.java:36)
	at com.carrotsearch.randomizedtesting.rules.StatementAdapter.evaluate(StatementAdapter.java:36)
	at org.apache.lucene.tests.util.TestRuleAssertionsRequired$1.evaluate(TestRuleAssertionsRequired.java:53)
	at org.apache.lucene.tests.util.AbstractBeforeAfterRule$1.evaluate(AbstractBeforeAfterRule.java:43)
	at org.apache.lucene.tests.util.TestRuleMarkFailure$1.evaluate(TestRuleMarkFailure.java:44)
	at org.apache.lucene.tests.util.TestRuleIgnoreAfterMaxFailures$1.evaluate(TestRuleIgnoreAfterMaxFailures.java:60)
	at org.apache.lucene.tests.util.TestRuleIgnoreTestSuites$1.evaluate(TestRuleIgnoreTestSuites.java:47)
	at org.junit.rules.RunRules.evaluate(RunRules.java:20)
	at com.carrotsearch.randomizedtesting.rules.StatementAdapter.evaluate(StatementAdapter.java:36)
	at com.carrotsearch.randomizedtesting.ThreadLeakControl$StatementRunner.run(ThreadLeakControl.java:390)
	at com.carrotsearch.randomizedtesting.ThreadLeakControl.lambda$forkTimeoutingTask$0(ThreadLeakControl.java:850)
	at java.base/java.lang.Thread.run(Thread.java:829)


FAILED:  org.apache.solr.cloud.ReplaceNodeTest.test

Error Message:
java.lang.AssertionError: expected:<0> but was:<1>

Stack Trace:
java.lang.AssertionError: expected:<0> but was:<1>
	at __randomizedtesting.SeedInfo.seed([8A39AA414661ABDA:26D959BE89DC622]:0)
	at org.junit.Assert.fail(Assert.java:89)
	at org.junit.Assert.failNotEquals(Assert.java:835)
	at org.junit.Assert.assertEquals(Assert.java:647)
	at org.junit.Assert.assertEquals(Assert.java:633)
	at org.apache.solr.cloud.ReplaceNodeTest.test(ReplaceNodeTest.java:125)
	at java.base/jdk.internal.reflect.NativeMethodAccessorImpl.invoke0(Native Method)
	at java.base/jdk.internal.reflect.NativeMethodAccessorImpl.invoke(NativeMethodAccessorImpl.java:62)
	at java.base/jdk.internal.reflect.DelegatingMethodAccessorImpl.invoke(DelegatingMethodAccessorImpl.java:43)
	at java.base/java.lang.reflect.Method.invoke(Method.java:566)
	at com.carrotsearch.randomizedtesting.RandomizedRunner.invoke(RandomizedRunner.java:1758)
	at com.carrotsearch.randomizedtesting.RandomizedRunner$8.evaluate(RandomizedRunner.java:946)
	at com.carrotsearch.randomizedtesting.RandomizedRunner$9.evaluate(RandomizedRunner.java:982)
	at com.carrotsearch.randomizedtesting.RandomizedRunner$10.evaluate(RandomizedRunner.java:996)
	at com.carrotsearch.randomizedtesting.rules.SystemPropertiesRestoreRule$1.evaluate(SystemPropertiesRestoreRule.java:80)
	at org.junit.rules.RunRules.evaluate(RunRules.java:20)
	at org.apache.lucene.tests.util.TestRuleSetupTeardownChained$1.evaluate(TestRuleSetupTeardownChained.java:44)
	at org.apache.lucene.tests.util.AbstractBeforeAfterRule$1.evaluate(AbstractBeforeAfterRule.java:43)
	at org.apache.lucene.tests.util.TestRuleThreadAndTestName$1.evaluate(TestRuleThreadAndTestName.java:45)
	at org.apache.lucene.tests.util.TestRuleIgnoreAfterMaxFailures$1.evaluate(TestRuleIgnoreAfterMaxFailures.java:60)
	at org.apache.lucene.tests.util.TestRuleMarkFailure$1.evaluate(TestRuleMarkFailure.java:44)
	at org.junit.rules.RunRules.evaluate(RunRules.java:20)
	at com.carrotsearch.randomizedtesting.rules.StatementAdapter.evaluate(StatementAdapter.java:36)
	at com.carrotsearch.randomizedtesting.ThreadLeakControl$StatementRunner.run(ThreadLeakControl.java:390)
	at com.carrotsearch.randomizedtesting.ThreadLeakControl.forkTimeoutingTask(ThreadLeakControl.java:843)
	at com.carrotsearch.randomizedtesting.ThreadLeakControl$3.evaluate(ThreadLeakControl.java:490)
	at com.carrotsearch.randomizedtesting.RandomizedRunner.runSingleTest(RandomizedRunner.java:955)
	at com.carrotsearch.randomizedtesting.RandomizedRunner$5.evaluate(RandomizedRunner.java:840)
	at com.carrotsearch.randomizedtesting.RandomizedRunner$6.evaluate(RandomizedRunner.java:891)
	at com.carrotsearch.randomizedtesting.RandomizedRunner$7.evaluate(RandomizedRunner.java:902)
	at com.carrotsearch.randomizedtesting.rules.StatementAdapter.evaluate(StatementAdapter.java:36)
	at org.apache.lucene.tests.util.AbstractBeforeAfterRule$1.evaluate(AbstractBeforeAfterRule.java:43)
	at org.apache.lucene.tests.util.AbstractBeforeAfterRule$1.evaluate(AbstractBeforeAfterRule.java:43)
	at com.carrotsearch.randomizedtesting.rules.SystemPropertiesRestoreRule$1.evaluate(SystemPropertiesRestoreRule.java:80)
	at org.junit.rules.RunRules.evaluate(RunRules.java:20)
	at org.apache.lucene.tests.util.AbstractBeforeAfterRule$1.evaluate(AbstractBeforeAfterRule.java:43)
	at com.carrotsearch.randomizedtesting.rules.StatementAdapter.evaluate(StatementAdapter.java:36)
	at org.apache.lucene.tests.util.TestRuleStoreClassName$1.evaluate(TestRuleStoreClassName.java:38)
	at com.carrotsearch.randomizedtesting.rules.NoShadowingOrOverridesOnMethodsRule$1.evaluate(NoShadowingOrOverridesOnMethodsRule.java:40)
	at com.carrotsearch.randomizedtesting.rules.NoShadowingOrOverridesOnMethodsRule$1.evaluate(NoShadowingOrOverridesOnMethodsRule.java:40)
	at com.carrotsearch.randomizedtesting.rules.StatementAdapter.evaluate(StatementAdapter.java:36)
	at com.carrotsearch.randomizedtesting.rules.StatementAdapter.evaluate(StatementAdapter.java:36)
	at org.apache.lucene.tests.util.TestRuleAssertionsRequired$1.evaluate(TestRuleAssertionsRequired.java:53)
	at org.apache.lucene.tests.util.AbstractBeforeAfterRule$1.evaluate(AbstractBeforeAfterRule.java:43)
	at org.apache.lucene.tests.util.TestRuleMarkFailure$1.evaluate(TestRuleMarkFailure.java:44)
	at org.apache.lucene.tests.util.TestRuleIgnoreAfterMaxFailures$1.evaluate(TestRuleIgnoreAfterMaxFailures.java:60)
	at org.apache.lucene.tests.util.TestRuleIgnoreTestSuites$1.evaluate(TestRuleIgnoreTestSuites.java:47)
	at org.junit.rules.RunRules.evaluate(RunRules.java:20)
	at com.carrotsearch.randomizedtesting.rules.StatementAdapter.evaluate(StatementAdapter.java:36)
	at com.carrotsearch.randomizedtesting.ThreadLeakControl$StatementRunner.run(ThreadLeakControl.java:390)
	at com.carrotsearch.randomizedtesting.ThreadLeakControl.lambda$forkTimeoutingTask$0(ThreadLeakControl.java:850)
	at java.base/java.lang.Thread.run(Thread.java:829)


FAILED:  org.apache.solr.cloud.ReplicationFactorTest.test

Error Message:
org.apache.solr.client.solrj.impl.BaseHttpSolrClient$RemoteSolrException: Error from server at http://127.0.0.1:46479/mrs/wf: Underlying core creation failed while creating collection: control_collection

Stack Trace:
org.apache.solr.client.solrj.impl.BaseHttpSolrClient$RemoteSolrException: Error from server at http://127.0.0.1:46479/mrs/wf: Underlying core creation failed while creating collection: control_collection
	at __randomizedtesting.SeedInfo.seed([8A39AA414661ABDA:26D959BE89DC622]:0)
	at app//org.apache.solr.client.solrj.impl.HttpSolrClient.executeMethod(HttpSolrClient.java:720)
	at app//org.apache.solr.client.solrj.impl.HttpSolrClient.request(HttpSolrClient.java:234)
	at app//org.apache.solr.client.solrj.impl.HttpSolrClient.request(HttpSolrClient.java:215)
	at app//org.apache.solr.client.solrj.impl.LBSolrClient.doRequest(LBSolrClient.java:405)
	at app//org.apache.solr.client.solrj.impl.LBSolrClient.request(LBSolrClient.java:371)
	at app//org.apache.solr.client.solrj.impl.CloudSolrClient.sendRequest(CloudSolrClient.java:1174)
	at app//org.apache.solr.client.solrj.impl.CloudSolrClient.requestWithRetryOnStaleState(CloudSolrClient.java:880)
	at app//org.apache.solr.client.solrj.impl.CloudSolrClient.request(CloudSolrClient.java:807)
	at app//org.apache.solr.client.solrj.SolrRequest.process(SolrRequest.java:234)
	at app//org.apache.solr.client.solrj.SolrRequest.process(SolrRequest.java:249)
	at app//org.apache.solr.cloud.AbstractFullDistribZkTestBase.createServers(AbstractFullDistribZkTestBase.java:353)
	at app//org.apache.solr.BaseDistributedSearchTestCase$ShardsRepeatRule$ShardsFixedStatement.callStatement(BaseDistributedSearchTestCase.java:1164)
	at app//org.apache.solr.BaseDistributedSearchTestCase$ShardsRepeatRule$ShardsStatement.evaluate(BaseDistributedSearchTestCase.java:1137)
	at app//com.carrotsearch.randomizedtesting.rules.SystemPropertiesRestoreRule$1.evaluate(SystemPropertiesRestoreRule.java:80)
	at app//org.junit.rules.RunRules.evaluate(RunRules.java:20)
	at app//org.apache.lucene.tests.util.TestRuleSetupTeardownChained$1.evaluate(TestRuleSetupTeardownChained.java:44)
	at app//org.apache.lucene.tests.util.AbstractBeforeAfterRule$1.evaluate(AbstractBeforeAfterRule.java:43)
	at app//org.apache.lucene.tests.util.TestRuleThreadAndTestName$1.evaluate(TestRuleThreadAndTestName.java:45)
	at app//org.apache.lucene.tests.util.TestRuleIgnoreAfterMaxFailures$1.evaluate(TestRuleIgnoreAfterMaxFailures.java:60)
	at app//org.apache.lucene.tests.util.TestRuleMarkFailure$1.evaluate(TestRuleMarkFailure.java:44)
	at app//org.junit.rules.RunRules.evaluate(RunRules.java:20)
	at app//com.carrotsearch.randomizedtesting.rules.StatementAdapter.evaluate(StatementAdapter.java:36)
	at app//com.carrotsearch.randomizedtesting.ThreadLeakControl$StatementRunner.run(ThreadLeakControl.java:390)
	at app//com.carrotsearch.randomizedtesting.ThreadLeakControl.forkTimeoutingTask(ThreadLeakControl.java:843)
	at app//com.carrotsearch.randomizedtesting.ThreadLeakControl$3.evaluate(ThreadLeakControl.java:490)
	at app//com.carrotsearch.randomizedtesting.RandomizedRunner.runSingleTest(RandomizedRunner.java:955)
	at app//com.carrotsearch.randomizedtesting.RandomizedRunner$5.evaluate(RandomizedRunner.java:840)
	at app//com.carrotsearch.randomizedtesting.RandomizedRunner$6.evaluate(RandomizedRunner.java:891)
	at app//com.carrotsearch.randomizedtesting.RandomizedRunner$7.evaluate(RandomizedRunner.java:902)
	at app//com.carrotsearch.randomizedtesting.rules.StatementAdapter.evaluate(StatementAdapter.java:36)
	at app//org.apache.lucene.tests.util.AbstractBeforeAfterRule$1.evaluate(AbstractBeforeAfterRule.java:43)
	at app//org.apache.lucene.tests.util.AbstractBeforeAfterRule$1.evaluate(AbstractBeforeAfterRule.java:43)
	at app//com.carrotsearch.randomizedtesting.rules.SystemPropertiesRestoreRule$1.evaluate(SystemPropertiesRestoreRule.java:80)
	at app//org.junit.rules.RunRules.evaluate(RunRules.java:20)
	at app//org.apache.lucene.tests.util.AbstractBeforeAfterRule$1.evaluate(AbstractBeforeAfterRule.java:43)
	at app//com.carrotsearch.randomizedtesting.rules.StatementAdapter.evaluate(StatementAdapter.java:36)
	at app//org.apache.lucene.tests.util.TestRuleStoreClassName$1.evaluate(TestRuleStoreClassName.java:38)
	at app//com.carrotsearch.randomizedtesting.rules.NoShadowingOrOverridesOnMethodsRule$1.evaluate(NoShadowingOrOverridesOnMethodsRule.java:40)
	at app//com.carrotsearch.randomizedtesting.rules.NoShadowingOrOverridesOnMethodsRule$1.evaluate(NoShadowingOrOverridesOnMethodsRule.java:40)
	at app//com.carrotsearch.randomizedtesting.rules.StatementAdapter.evaluate(StatementAdapter.java:36)
	at app//com.carrotsearch.randomizedtesting.rules.StatementAdapter.evaluate(StatementAdapter.java:36)
	at app//org.apache.lucene.tests.util.TestRuleAssertionsRequired$1.evaluate(TestRuleAssertionsRequired.java:53)
	at app//org.apache.lucene.tests.util.AbstractBeforeAfterRule$1.evaluate(AbstractBeforeAfterRule.java:43)
	at app//org.apache.lucene.tests.util.TestRuleMarkFailure$1.evaluate(TestRuleMarkFailure.java:44)
	at app//org.apache.lucene.tests.util.TestRuleIgnoreAfterMaxFailures$1.evaluate(TestRuleIgnoreAfterMaxFailures.java:60)
	at app//org.apache.lucene.tests.util.TestRuleIgnoreTestSuites$1.evaluate(TestRuleIgnoreTestSuites.java:47)
	at app//org.junit.rules.RunRules.evaluate(RunRules.java:20)
	at app//com.carrotsearch.randomizedtesting.rules.StatementAdapter.evaluate(StatementAdapter.java:36)
	at app//com.carrotsearch.randomizedtesting.ThreadLeakControl$StatementRunner.run(ThreadLeakControl.java:390)
	at app//com.carrotsearch.randomizedtesting.ThreadLeakControl.lambda$forkTimeoutingTask$0(ThreadLeakControl.java:850)
	at java.base@11.0.16/java.lang.Thread.run(Thread.java:829)


FAILED:  org.apache.solr.cloud.SolrCloudExampleTest.testLoadDocsIntoGettingStartedCollection

Error Message:
java.lang.AssertionError: Collection 'gettingstarted' doesn't exist after trying to create it!

Stack Trace:
java.lang.AssertionError: Collection 'gettingstarted' doesn't exist after trying to create it!
	at __randomizedtesting.SeedInfo.seed([8A39AA414661ABDA:995A982E770E127C]:0)
	at org.junit.Assert.fail(Assert.java:89)
	at org.junit.Assert.assertTrue(Assert.java:42)
	at org.apache.solr.cloud.SolrCloudExampleTest.testLoadDocsIntoGettingStartedCollection(SolrCloudExampleTest.java:117)
	at java.base/jdk.internal.reflect.NativeMethodAccessorImpl.invoke0(Native Method)
	at java.base/jdk.internal.reflect.NativeMethodAccessorImpl.invoke(NativeMethodAccessorImpl.java:62)
	at java.base/jdk.internal.reflect.DelegatingMethodAccessorImpl.invoke(DelegatingMethodAccessorImpl.java:43)
	at java.base/java.lang.reflect.Method.invoke(Method.java:566)
	at com.carrotsearch.randomizedtesting.RandomizedRunner.invoke(RandomizedRunner.java:1758)
	at com.carrotsearch.randomizedtesting.RandomizedRunner$8.evaluate(RandomizedRunner.java:946)
	at com.carrotsearch.randomizedtesting.RandomizedRunner$9.evaluate(RandomizedRunner.java:982)
	at com.carrotsearch.randomizedtesting.RandomizedRunner$10.evaluate(RandomizedRunner.java:996)
	at org.apache.solr.BaseDistributedSearchTestCase$ShardsRepeatRule$ShardsFixedStatement.callStatement(BaseDistributedSearchTestCase.java:1166)
	at org.apache.solr.BaseDistributedSearchTestCase$ShardsRepeatRule$ShardsStatement.evaluate(BaseDistributedSearchTestCase.java:1137)
	at com.carrotsearch.randomizedtesting.rules.SystemPropertiesRestoreRule$1.evaluate(SystemPropertiesRestoreRule.java:80)
	at org.junit.rules.RunRules.evaluate(RunRules.java:20)
	at org.apache.lucene.tests.util.TestRuleSetupTeardownChained$1.evaluate(TestRuleSetupTeardownChained.java:44)
	at org.apache.lucene.tests.util.AbstractBeforeAfterRule$1.evaluate(AbstractBeforeAfterRule.java:43)
	at org.apache.lucene.tests.util.TestRuleThreadAndTestName$1.evaluate(TestRuleThreadAndTestName.java:45)
	at org.apache.lucene.tests.util.TestRuleIgnoreAfterMaxFailures$1.evaluate(TestRuleIgnoreAfterMaxFailures.java:60)
	at org.apache.lucene.tests.util.TestRuleMarkFailure$1.evaluate(TestRuleMarkFailure.java:44)
	at org.junit.rules.RunRules.evaluate(RunRules.java:20)
	at com.carrotsearch.randomizedtesting.rules.StatementAdapter.evaluate(StatementAdapter.java:36)
	at com.carrotsearch.randomizedtesting.ThreadLeakControl$StatementRunner.run(ThreadLeakControl.java:390)
	at com.carrotsearch.randomizedtesting.ThreadLeakControl.forkTimeoutingTask(ThreadLeakControl.java:843)
	at com.carrotsearch.randomizedtesting.ThreadLeakControl$3.evaluate(ThreadLeakControl.java:490)
	at com.carrotsearch.randomizedtesting.RandomizedRunner.runSingleTest(RandomizedRunner.java:955)
	at com.carrotsearch.randomizedtesting.RandomizedRunner$5.evaluate(RandomizedRunner.java:840)
	at com.carrotsearch.randomizedtesting.RandomizedRunner$6.evaluate(RandomizedRunner.java:891)
	at com.carrotsearch.randomizedtesting.RandomizedRunner$7.evaluate(RandomizedRunner.java:902)
	at com.carrotsearch.randomizedtesting.rules.StatementAdapter.evaluate(StatementAdapter.java:36)
	at org.apache.lucene.tests.util.AbstractBeforeAfterRule$1.evaluate(AbstractBeforeAfterRule.java:43)
	at org.apache.lucene.tests.util.AbstractBeforeAfterRule$1.evaluate(AbstractBeforeAfterRule.java:43)
	at com.carrotsearch.randomizedtesting.rules.SystemPropertiesRestoreRule$1.evaluate(SystemPropertiesRestoreRule.java:80)
	at org.junit.rules.RunRules.evaluate(RunRules.java:20)
	at org.apache.lucene.tests.util.AbstractBeforeAfterRule$1.evaluate(AbstractBeforeAfterRule.java:43)
	at com.carrotsearch.randomizedtesting.rules.StatementAdapter.evaluate(StatementAdapter.java:36)
	at org.apache.lucene.tests.util.TestRuleStoreClassName$1.evaluate(TestRuleStoreClassName.java:38)
	at com.carrotsearch.randomizedtesting.rules.NoShadowingOrOverridesOnMethodsRule$1.evaluate(NoShadowingOrOverridesOnMethodsRule.java:40)
	at com.carrotsearch.randomizedtesting.rules.NoShadowingOrOverridesOnMethodsRule$1.evaluate(NoShadowingOrOverridesOnMethodsRule.java:40)
	at com.carrotsearch.randomizedtesting.rules.StatementAdapter.evaluate(StatementAdapter.java:36)
	at com.carrotsearch.randomizedtesting.rules.StatementAdapter.evaluate(StatementAdapter.java:36)
	at org.apache.lucene.tests.util.TestRuleAssertionsRequired$1.evaluate(TestRuleAssertionsRequired.java:53)
	at org.apache.lucene.tests.util.AbstractBeforeAfterRule$1.evaluate(AbstractBeforeAfterRule.java:43)
	at org.apache.lucene.tests.util.TestRuleMarkFailure$1.evaluate(TestRuleMarkFailure.java:44)
	at org.apache.lucene.tests.util.TestRuleIgnoreAfterMaxFailures$1.evaluate(TestRuleIgnoreAfterMaxFailures.java:60)
	at org.apache.lucene.tests.util.TestRuleIgnoreTestSuites$1.evaluate(TestRuleIgnoreTestSuites.java:47)
	at org.junit.rules.RunRules.evaluate(RunRules.java:20)
	at com.carrotsearch.randomizedtesting.rules.StatementAdapter.evaluate(StatementAdapter.java:36)
	at com.carrotsearch.randomizedtesting.ThreadLeakControl$StatementRunner.run(ThreadLeakControl.java:390)
	at com.carrotsearch.randomizedtesting.ThreadLeakControl.lambda$forkTimeoutingTask$0(ThreadLeakControl.java:850)
	at java.base/java.lang.Thread.run(Thread.java:829)


FAILED:  org.apache.solr.cloud.TestRandomRequestDistribution.test

Error Message:
org.apache.solr.client.solrj.impl.BaseHttpSolrClient$RemoteSolrException: Error from server at http://127.0.0.1:40479: Underlying core creation failed while creating collection: football

Stack Trace:
org.apache.solr.client.solrj.impl.BaseHttpSolrClient$RemoteSolrException: Error from server at http://127.0.0.1:40479: Underlying core creation failed while creating collection: football
	at __randomizedtesting.SeedInfo.seed([8A39AA414661ABDA:26D959BE89DC622]:0)
	at app//org.apache.solr.client.solrj.impl.HttpSolrClient.executeMethod(HttpSolrClient.java:720)
	at app//org.apache.solr.client.solrj.impl.HttpSolrClient.request(HttpSolrClient.java:234)
	at app//org.apache.solr.client.solrj.impl.HttpSolrClient.request(HttpSolrClient.java:215)
	at app//org.apache.solr.client.solrj.impl.LBSolrClient.doRequest(LBSolrClient.java:405)
	at app//org.apache.solr.client.solrj.impl.LBSolrClient.request(LBSolrClient.java:371)
	at app//org.apache.solr.client.solrj.impl.CloudSolrClient.sendRequest(CloudSolrClient.java:1174)
	at app//org.apache.solr.client.solrj.impl.CloudSolrClient.requestWithRetryOnStaleState(CloudSolrClient.java:880)
	at app//org.apache.solr.client.solrj.impl.CloudSolrClient.request(CloudSolrClient.java:807)
	at app//org.apache.solr.client.solrj.SolrRequest.process(SolrRequest.java:234)
	at app//org.apache.solr.client.solrj.SolrRequest.process(SolrRequest.java:249)
	at app//org.apache.solr.cloud.TestRandomRequestDistribution.testQueryAgainstDownReplica(TestRandomRequestDistribution.java:151)
	at app//org.apache.solr.cloud.TestRandomRequestDistribution.test(TestRandomRequestDistribution.java:67)
	at java.base@11.0.16/jdk.internal.reflect.NativeMethodAccessorImpl.invoke0(Native Method)
	at java.base@11.0.16/jdk.internal.reflect.NativeMethodAccessorImpl.invoke(NativeMethodAccessorImpl.java:62)
	at java.base@11.0.16/jdk.internal.reflect.DelegatingMethodAccessorImpl.invoke(DelegatingMethodAccessorImpl.java:43)
	at java.base@11.0.16/java.lang.reflect.Method.invoke(Method.java:566)
	at app//com.carrotsearch.randomizedtesting.RandomizedRunner.invoke(RandomizedRunner.java:1758)
	at app//com.carrotsearch.randomizedtesting.RandomizedRunner$8.evaluate(RandomizedRunner.java:946)
	at app//com.carrotsearch.randomizedtesting.RandomizedRunner$9.evaluate(RandomizedRunner.java:982)
	at app//com.carrotsearch.randomizedtesting.RandomizedRunner$10.evaluate(RandomizedRunner.java:996)
	at app//org.apache.solr.BaseDistributedSearchTestCase$ShardsRepeatRule$ShardsFixedStatement.callStatement(BaseDistributedSearchTestCase.java:1166)
	at app//org.apache.solr.BaseDistributedSearchTestCase$ShardsRepeatRule$ShardsStatement.evaluate(BaseDistributedSearchTestCase.java:1137)
	at app//com.carrotsearch.randomizedtesting.rules.SystemPropertiesRestoreRule$1.evaluate(SystemPropertiesRestoreRule.java:80)
	at app//org.junit.rules.RunRules.evaluate(RunRules.java:20)
	at app//org.apache.lucene.tests.util.TestRuleSetupTeardownChained$1.evaluate(TestRuleSetupTeardownChained.java:44)
	at app//org.apache.lucene.tests.util.AbstractBeforeAfterRule$1.evaluate(AbstractBeforeAfterRule.java:43)
	at app//org.apache.lucene.tests.util.TestRuleThreadAndTestName$1.evaluate(TestRuleThreadAndTestName.java:45)
	at app//org.apache.lucene.tests.util.TestRuleIgnoreAfterMaxFailures$1.evaluate(TestRuleIgnoreAfterMaxFailures.java:60)
	at app//org.apache.lucene.tests.util.TestRuleMarkFailure$1.evaluate(TestRuleMarkFailure.java:44)
	at app//org.junit.rules.RunRules.evaluate(RunRules.java:20)
	at app//com.carrotsearch.randomizedtesting.rules.StatementAdapter.evaluate(StatementAdapter.java:36)
	at app//com.carrotsearch.randomizedtesting.ThreadLeakControl$StatementRunner.run(ThreadLeakControl.java:390)
	at app//com.carrotsearch.randomizedtesting.ThreadLeakControl.forkTimeoutingTask(ThreadLeakControl.java:843)
	at app//com.carrotsearch.randomizedtesting.ThreadLeakControl$3.evaluate(ThreadLeakControl.java:490)
	at app//com.carrotsearch.randomizedtesting.RandomizedRunner.runSingleTest(RandomizedRunner.java:955)
	at app//com.carrotsearch.randomizedtesting.RandomizedRunner$5.evaluate(RandomizedRunner.java:840)
	at app//com.carrotsearch.randomizedtesting.RandomizedRunner$6.evaluate(RandomizedRunner.java:891)
	at app//com.carrotsearch.randomizedtesting.RandomizedRunner$7.evaluate(RandomizedRunner.java:902)
	at app//com.carrotsearch.randomizedtesting.rules.StatementAdapter.evaluate(StatementAdapter.java:36)
	at app//org.apache.lucene.tests.util.AbstractBeforeAfterRule$1.evaluate(AbstractBeforeAfterRule.java:43)
	at app//org.apache.lucene.tests.util.AbstractBeforeAfterRule$1.evaluate(AbstractBeforeAfterRule.java:43)
	at app//com.carrotsearch.randomizedtesting.rules.SystemPropertiesRestoreRule$1.evaluate(SystemPropertiesRestoreRule.java:80)
	at app//org.junit.rules.RunRules.evaluate(RunRules.java:20)
	at app//org.apache.lucene.tests.util.AbstractBeforeAfterRule$1.evaluate(AbstractBeforeAfterRule.java:43)
	at app//com.carrotsearch.randomizedtesting.rules.StatementAdapter.evaluate(StatementAdapter.java:36)
	at app//org.apache.lucene.tests.util.TestRuleStoreClassName$1.evaluate(TestRuleStoreClassName.java:38)
	at app//com.carrotsearch.randomizedtesting.rules.NoShadowingOrOverridesOnMethodsRule$1.evaluate(NoShadowingOrOverridesOnMethodsRule.java:40)
	at app//com.carrotsearch.randomizedtesting.rules.NoShadowingOrOverridesOnMethodsRule$1.evaluate(NoShadowingOrOverridesOnMethodsRule.java:40)
	at app//com.carrotsearch.randomizedtesting.rules.StatementAdapter.evaluate(StatementAdapter.java:36)
	at app//com.carrotsearch.randomizedtesting.rules.StatementAdapter.evaluate(StatementAdapter.java:36)
	at app//org.apache.lucene.tests.util.TestRuleAssertionsRequired$1.evaluate(TestRuleAssertionsRequired.java:53)
	at app//org.apache.lucene.tests.util.AbstractBeforeAfterRule$1.evaluate(AbstractBeforeAfterRule.java:43)
	at app//org.apache.lucene.tests.util.TestRuleMarkFailure$1.evaluate(TestRuleMarkFailure.java:44)
	at app//org.apache.lucene.tests.util.TestRuleIgnoreAfterMaxFailures$1.evaluate(TestRuleIgnoreAfterMaxFailures.java:60)
	at app//org.apache.lucene.tests.util.TestRuleIgnoreTestSuites$1.evaluate(TestRuleIgnoreTestSuites.java:47)
	at app//org.junit.rules.RunRules.evaluate(RunRules.java:20)
	at app//com.carrotsearch.randomizedtesting.rules.StatementAdapter.evaluate(StatementAdapter.java:36)
	at app//com.carrotsearch.randomizedtesting.ThreadLeakControl$StatementRunner.run(ThreadLeakControl.java:390)
	at app//com.carrotsearch.randomizedtesting.ThreadLeakControl.lambda$forkTimeoutingTask$0(ThreadLeakControl.java:850)
	at java.base@11.0.16/java.lang.Thread.run(Thread.java:829)


FAILED:  org.apache.solr.search.join.CrossCollectionJoinQueryTest.classMethod

Error Message:
org.apache.solr.client.solrj.impl.BaseHttpSolrClient$RemoteSolrException: Error from server at http://127.0.0.1:39409/solr: Underlying core creation failed while creating collection: products

Stack Trace:
org.apache.solr.client.solrj.impl.BaseHttpSolrClient$RemoteSolrException: Error from server at http://127.0.0.1:39409/solr: Underlying core creation failed while creating collection: products
	at __randomizedtesting.SeedInfo.seed([8A39AA414661ABDA]:0)
	at app//org.apache.solr.client.solrj.impl.HttpSolrClient.executeMethod(HttpSolrClient.java:720)
	at app//org.apache.solr.client.solrj.impl.HttpSolrClient.request(HttpSolrClient.java:234)
	at app//org.apache.solr.client.solrj.impl.HttpSolrClient.request(HttpSolrClient.java:215)
	at app//org.apache.solr.client.solrj.impl.LBSolrClient.doRequest(LBSolrClient.java:405)
	at app//org.apache.solr.client.solrj.impl.LBSolrClient.request(LBSolrClient.java:371)
	at app//org.apache.solr.client.solrj.impl.CloudSolrClient.sendRequest(CloudSolrClient.java:1174)
	at app//org.apache.solr.client.solrj.impl.CloudSolrClient.requestWithRetryOnStaleState(CloudSolrClient.java:880)
	at app//org.apache.solr.client.solrj.impl.CloudSolrClient.request(CloudSolrClient.java:807)
	at app//org.apache.solr.client.solrj.SolrRequest.process(SolrRequest.java:234)
	at app//org.apache.solr.client.solrj.SolrRequest.process(SolrRequest.java:249)
	at app//org.apache.solr.search.join.CrossCollectionJoinQueryTest.setupCluster(CrossCollectionJoinQueryTest.java:56)
	at java.base@11.0.16/jdk.internal.reflect.NativeMethodAccessorImpl.invoke0(Native Method)
	at java.base@11.0.16/jdk.internal.reflect.NativeMethodAccessorImpl.invoke(NativeMethodAccessorImpl.java:62)
	at java.base@11.0.16/jdk.internal.reflect.DelegatingMethodAccessorImpl.invoke(DelegatingMethodAccessorImpl.java:43)
	at java.base@11.0.16/java.lang.reflect.Method.invoke(Method.java:566)
	at app//com.carrotsearch.randomizedtesting.RandomizedRunner.invoke(RandomizedRunner.java:1758)
	at app//com.carrotsearch.randomizedtesting.RandomizedRunner$6.evaluate(RandomizedRunner.java:886)
	at app//com.carrotsearch.randomizedtesting.RandomizedRunner$7.evaluate(RandomizedRunner.java:902)
	at app//com.carrotsearch.randomizedtesting.rules.StatementAdapter.evaluate(StatementAdapter.java:36)
	at app//org.apache.lucene.tests.util.AbstractBeforeAfterRule$1.evaluate(AbstractBeforeAfterRule.java:43)
	at app//org.apache.lucene.tests.util.AbstractBeforeAfterRule$1.evaluate(AbstractBeforeAfterRule.java:43)
	at app//com.carrotsearch.randomizedtesting.rules.SystemPropertiesRestoreRule$1.evaluate(SystemPropertiesRestoreRule.java:80)
	at app//org.junit.rules.RunRules.evaluate(RunRules.java:20)
	at app//org.apache.lucene.tests.util.AbstractBeforeAfterRule$1.evaluate(AbstractBeforeAfterRule.java:43)
	at app//com.carrotsearch.randomizedtesting.rules.StatementAdapter.evaluate(StatementAdapter.java:36)
	at app//org.apache.lucene.tests.util.TestRuleStoreClassName$1.evaluate(TestRuleStoreClassName.java:38)
	at app//com.carrotsearch.randomizedtesting.rules.NoShadowingOrOverridesOnMethodsRule$1.evaluate(NoShadowingOrOverridesOnMethodsRule.java:40)
	at app//com.carrotsearch.randomizedtesting.rules.NoShadowingOrOverridesOnMethodsRule$1.evaluate(NoShadowingOrOverridesOnMethodsRule.java:40)
	at app//com.carrotsearch.randomizedtesting.rules.StatementAdapter.evaluate(StatementAdapter.java:36)
	at app//com.carrotsearch.randomizedtesting.rules.StatementAdapter.evaluate(StatementAdapter.java:36)
	at app//org.apache.lucene.tests.util.TestRuleAssertionsRequired$1.evaluate(TestRuleAssertionsRequired.java:53)
	at app//org.apache.lucene.tests.util.AbstractBeforeAfterRule$1.evaluate(AbstractBeforeAfterRule.java:43)
	at app//org.apache.lucene.tests.util.TestRuleMarkFailure$1.evaluate(TestRuleMarkFailure.java:44)
	at app//org.apache.lucene.tests.util.TestRuleIgnoreAfterMaxFailures$1.evaluate(TestRuleIgnoreAfterMaxFailures.java:60)
	at app//org.apache.lucene.tests.util.TestRuleIgnoreTestSuites$1.evaluate(TestRuleIgnoreTestSuites.java:47)
	at app//org.junit.rules.RunRules.evaluate(RunRules.java:20)
	at app//com.carrotsearch.randomizedtesting.rules.StatementAdapter.evaluate(StatementAdapter.java:36)
	at app//com.carrotsearch.randomizedtesting.ThreadLeakControl$StatementRunner.run(ThreadLeakControl.java:390)
	at app//com.carrotsearch.randomizedtesting.ThreadLeakControl.lambda$forkTimeoutingTask$0(ThreadLeakControl.java:850)
	at java.base@11.0.16/java.lang.Thread.run(Thread.java:829)


FAILED:  org.apache.solr.cloud.ReplaceNodeTest.testGoodSpreadDuringAssignWithNoTarget

Error Message:
java.lang.AssertionError: There should be no more replicas on the sourceNode after a replaceNode request. expected:<[]> but was:<[core_node9:{
  "core":"replacenodetest_coll_shard1_replica_n3",
  "core_node_name":"core_node9",
  "node_name":"127.0.0.1:41897_solr",
  "base_url":"https://127.0.0.1:41897/solr",
  "state":"active",
  "collection":"replacenodetest_coll",
  "shard":"shard1",
  "type":"NRT",
  "force_set_state":"false"}, core_node12:{
  "core":"replacenodetest_coll_shard2_replica_n6",
  "leader":"true",
  "core_node_name":"core_node12",
  "node_name":"127.0.0.1:41897_solr",
  "base_url":"https://127.0.0.1:41897/solr",
  "state":"active",
  "collection":"replacenodetest_coll",
  "shard":"shard2",
  "type":"NRT",
  "force_set_state":"false"}, core_node8:{
  "core":"replacenodetest_coll_shard3_replica_n2",
  "core_node_name":"core_node8",
  "node_name":"127.0.0.1:41897_solr",
  "base_url":"https://127.0.0.1:41897/solr",
  "state":"active",
  "collection":"replacenodetest_coll",
  "shard":"shard3",
  "type":"NRT",
  "force_set_state":"false"}]>

Stack Trace:
java.lang.AssertionError: There should be no more replicas on the sourceNode after a replaceNode request. expected:<[]> but was:<[core_node9:{
  "core":"replacenodetest_coll_shard1_replica_n3",
  "core_node_name":"core_node9",
  "node_name":"127.0.0.1:41897_solr",
  "base_url":"https://127.0.0.1:41897/solr",
  "state":"active",
  "collection":"replacenodetest_coll",
  "shard":"shard1",
  "type":"NRT",
  "force_set_state":"false"}, core_node12:{
  "core":"replacenodetest_coll_shard2_replica_n6",
  "leader":"true",
  "core_node_name":"core_node12",
  "node_name":"127.0.0.1:41897_solr",
  "base_url":"https://127.0.0.1:41897/solr",
  "state":"active",
  "collection":"replacenodetest_coll",
  "shard":"shard2",
  "type":"NRT",
  "force_set_state":"false"}, core_node8:{
  "core":"replacenodetest_coll_shard3_replica_n2",
  "core_node_name":"core_node8",
  "node_name":"127.0.0.1:41897_solr",
  "base_url":"https://127.0.0.1:41897/solr",
  "state":"active",
  "collection":"replacenodetest_coll",
  "shard":"shard3",
  "type":"NRT",
  "force_set_state":"false"}]>
	at __randomizedtesting.SeedInfo.seed([8A39AA414661ABDA:A4527E7B73027AAE]:0)
	at org.junit.Assert.fail(Assert.java:89)
	at org.junit.Assert.failNotEquals(Assert.java:835)
	at org.junit.Assert.assertEquals(Assert.java:120)
	at org.apache.solr.cloud.ReplaceNodeTest.testGoodSpreadDuringAssignWithNoTarget(ReplaceNodeTest.java:274)
	at java.base/jdk.internal.reflect.NativeMethodAccessorImpl.invoke0(Native Method)
	at java.base/jdk.internal.reflect.NativeMethodAccessorImpl.invoke(NativeMethodAccessorImpl.java:62)
	at java.base/jdk.internal.reflect.DelegatingMethodAccessorImpl.invoke(DelegatingMethodAccessorImpl.java:43)
	at java.base/java.lang.reflect.Method.invoke(Method.java:566)
	at com.carrotsearch.randomizedtesting.RandomizedRunner.invoke(RandomizedRunner.java:1758)
	at com.carrotsearch.randomizedtesting.RandomizedRunner$8.evaluate(RandomizedRunner.java:946)
	at com.carrotsearch.randomizedtesting.RandomizedRunner$9.evaluate(RandomizedRunner.java:982)
	at com.carrotsearch.randomizedtesting.RandomizedRunner$10.evaluate(RandomizedRunner.java:996)
	at com.carrotsearch.randomizedtesting.rules.SystemPropertiesRestoreRule$1.evaluate(SystemPropertiesRestoreRule.java:80)
	at org.junit.rules.RunRules.evaluate(RunRules.java:20)
	at org.apache.lucene.tests.util.TestRuleSetupTeardownChained$1.evaluate(TestRuleSetupTeardownChained.java:44)
	at org.apache.lucene.tests.util.AbstractBeforeAfterRule$1.evaluate(AbstractBeforeAfterRule.java:43)
	at org.apache.lucene.tests.util.TestRuleThreadAndTestName$1.evaluate(TestRuleThreadAndTestName.java:45)
	at org.apache.lucene.tests.util.TestRuleIgnoreAfterMaxFailures$1.evaluate(TestRuleIgnoreAfterMaxFailures.java:60)
	at org.apache.lucene.tests.util.TestRuleMarkFailure$1.evaluate(TestRuleMarkFailure.java:44)
	at org.junit.rules.RunRules.evaluate(RunRules.java:20)
	at com.carrotsearch.randomizedtesting.rules.StatementAdapter.evaluate(StatementAdapter.java:36)
	at com.carrotsearch.randomizedtesting.ThreadLeakControl$StatementRunner.run(ThreadLeakControl.java:390)
	at com.carrotsearch.randomizedtesting.ThreadLeakControl.forkTimeoutingTask(ThreadLeakControl.java:843)
	at com.carrotsearch.randomizedtesting.ThreadLeakControl$3.evaluate(ThreadLeakControl.java:490)
	at com.carrotsearch.randomizedtesting.RandomizedRunner.runSingleTest(RandomizedRunner.java:955)
	at com.carrotsearch.randomizedtesting.RandomizedRunner$5.evaluate(RandomizedRunner.java:840)
	at com.carrotsearch.randomizedtesting.RandomizedRunner$6.evaluate(RandomizedRunner.java:891)
	at com.carrotsearch.randomizedtesting.RandomizedRunner$7.evaluate(RandomizedRunner.java:902)
	at com.carrotsearch.randomizedtesting.rules.StatementAdapter.evaluate(StatementAdapter.java:36)
	at org.apache.lucene.tests.util.AbstractBeforeAfterRule$1.evaluate(AbstractBeforeAfterRule.java:43)
	at org.apache.lucene.tests.util.AbstractBeforeAfterRule$1.evaluate(AbstractBeforeAfterRule.java:43)
	at com.carrotsearch.randomizedtesting.rules.SystemPropertiesRestoreRule$1.evaluate(SystemPropertiesRestoreRule.java:80)
	at org.junit.rules.RunRules.evaluate(RunRules.java:20)
	at org.apache.lucene.tests.util.AbstractBeforeAfterRule$1.evaluate(AbstractBeforeAfterRule.java:43)
	at com.carrotsearch.randomizedtesting.rules.StatementAdapter.evaluate(StatementAdapter.java:36)
	at org.apache.lucene.tests.util.TestRuleStoreClassName$1.evaluate(TestRuleStoreClassName.java:38)
	at com.carrotsearch.randomizedtesting.rules.NoShadowingOrOverridesOnMethodsRule$1.evaluate(NoShadowingOrOverridesOnMethodsRule.java:40)
	at com.carrotsearch.randomizedtesting.rules.NoShadowingOrOverridesOnMethodsRule$1.evaluate(NoShadowingOrOverridesOnMethodsRule.java:40)
	at com.carrotsearch.randomizedtesting.rules.StatementAdapter.evaluate(StatementAdapter.java:36)
	at com.carrotsearch.randomizedtesting.rules.StatementAdapter.evaluate(StatementAdapter.java:36)
	at org.apache.lucene.tests.util.TestRuleAssertionsRequired$1.evaluate(TestRuleAssertionsRequired.java:53)
	at org.apache.lucene.tests.util.AbstractBeforeAfterRule$1.evaluate(AbstractBeforeAfterRule.java:43)
	at org.apache.lucene.tests.util.TestRuleMarkFailure$1.evaluate(TestRuleMarkFailure.java:44)
	at org.apache.lucene.tests.util.TestRuleIgnoreAfterMaxFailures$1.evaluate(TestRuleIgnoreAfterMaxFailures.java:60)
	at org.apache.lucene.tests.util.TestRuleIgnoreTestSuites$1.evaluate(TestRuleIgnoreTestSuites.java:47)
	at org.junit.rules.RunRules.evaluate(RunRules.java:20)
	at com.carrotsearch.randomizedtesting.rules.StatementAdapter.evaluate(StatementAdapter.java:36)
	at com.carrotsearch.randomizedtesting.ThreadLeakControl$StatementRunner.run(ThreadLeakControl.java:390)
	at com.carrotsearch.randomizedtesting.ThreadLeakControl.lambda$forkTimeoutingTask$0(ThreadLeakControl.java:850)
	at java.base/java.lang.Thread.run(Thread.java:829)


FAILED:  org.apache.solr.cloud.HttpPartitionOnCommitTest.test

Error Message:
org.apache.solr.client.solrj.impl.BaseHttpSolrClient$RemoteSolrException: Error from server at http://127.0.0.1:37571/ce_/jr: Underlying core creation failed while creating collection: control_collection

Stack Trace:
org.apache.solr.client.solrj.impl.BaseHttpSolrClient$RemoteSolrException: Error from server at http://127.0.0.1:37571/ce_/jr: Underlying core creation failed while creating collection: control_collection
	at __randomizedtesting.SeedInfo.seed([8A39AA414661ABDA:26D959BE89DC622]:0)
	at app//org.apache.solr.client.solrj.impl.HttpSolrClient.executeMethod(HttpSolrClient.java:720)
	at app//org.apache.solr.client.solrj.impl.HttpSolrClient.request(HttpSolrClient.java:234)
	at app//org.apache.solr.client.solrj.impl.HttpSolrClient.request(HttpSolrClient.java:215)
	at app//org.apache.solr.client.solrj.impl.LBSolrClient.doRequest(LBSolrClient.java:405)
	at app//org.apache.solr.client.solrj.impl.LBSolrClient.request(LBSolrClient.java:371)
	at app//org.apache.solr.client.solrj.impl.CloudSolrClient.sendRequest(CloudSolrClient.java:1174)
	at app//org.apache.solr.client.solrj.impl.CloudSolrClient.requestWithRetryOnStaleState(CloudSolrClient.java:880)
	at app//org.apache.solr.client.solrj.impl.CloudSolrClient.request(CloudSolrClient.java:807)
	at app//org.apache.solr.client.solrj.SolrRequest.process(SolrRequest.java:234)
	at app//org.apache.solr.client.solrj.SolrRequest.process(SolrRequest.java:249)
	at app//org.apache.solr.cloud.AbstractFullDistribZkTestBase.createServers(AbstractFullDistribZkTestBase.java:353)
	at app//org.apache.solr.BaseDistributedSearchTestCase$ShardsRepeatRule$ShardsFixedStatement.callStatement(BaseDistributedSearchTestCase.java:1164)
	at app//org.apache.solr.BaseDistributedSearchTestCase$ShardsRepeatRule$ShardsStatement.evaluate(BaseDistributedSearchTestCase.java:1137)
	at app//com.carrotsearch.randomizedtesting.rules.SystemPropertiesRestoreRule$1.evaluate(SystemPropertiesRestoreRule.java:80)
	at app//org.junit.rules.RunRules.evaluate(RunRules.java:20)
	at app//org.apache.lucene.tests.util.TestRuleSetupTeardownChained$1.evaluate(TestRuleSetupTeardownChained.java:44)
	at app//org.apache.lucene.tests.util.AbstractBeforeAfterRule$1.evaluate(AbstractBeforeAfterRule.java:43)
	at app//org.apache.lucene.tests.util.TestRuleThreadAndTestName$1.evaluate(TestRuleThreadAndTestName.java:45)
	at app//org.apache.lucene.tests.util.TestRuleIgnoreAfterMaxFailures$1.evaluate(TestRuleIgnoreAfterMaxFailures.java:60)
	at app//org.apache.lucene.tests.util.TestRuleMarkFailure$1.evaluate(TestRuleMarkFailure.java:44)
	at app//org.junit.rules.RunRules.evaluate(RunRules.java:20)
	at app//com.carrotsearch.randomizedtesting.rules.StatementAdapter.evaluate(StatementAdapter.java:36)
	at app//com.carrotsearch.randomizedtesting.ThreadLeakControl$StatementRunner.run(ThreadLeakControl.java:390)
	at app//com.carrotsearch.randomizedtesting.ThreadLeakControl.forkTimeoutingTask(ThreadLeakControl.java:843)
	at app//com.carrotsearch.randomizedtesting.ThreadLeakControl$3.evaluate(ThreadLeakControl.java:490)
	at app//com.carrotsearch.randomizedtesting.RandomizedRunner.runSingleTest(RandomizedRunner.java:955)
	at app//com.carrotsearch.randomizedtesting.RandomizedRunner$5.evaluate(RandomizedRunner.java:840)
	at app//com.carrotsearch.randomizedtesting.RandomizedRunner$6.evaluate(RandomizedRunner.java:891)
	at app//com.carrotsearch.randomizedtesting.RandomizedRunner$7.evaluate(RandomizedRunner.java:902)
	at app//com.carrotsearch.randomizedtesting.rules.StatementAdapter.evaluate(StatementAdapter.java:36)
	at app//org.apache.lucene.tests.util.AbstractBeforeAfterRule$1.evaluate(AbstractBeforeAfterRule.java:43)
	at app//org.apache.lucene.tests.util.AbstractBeforeAfterRule$1.evaluate(AbstractBeforeAfterRule.java:43)
	at app//com.carrotsearch.randomizedtesting.rules.SystemPropertiesRestoreRule$1.evaluate(SystemPropertiesRestoreRule.java:80)
	at app//org.junit.rules.RunRules.evaluate(RunRules.java:20)
	at app//org.apache.lucene.tests.util.AbstractBeforeAfterRule$1.evaluate(AbstractBeforeAfterRule.java:43)
	at app//com.carrotsearch.randomizedtesting.rules.StatementAdapter.evaluate(StatementAdapter.java:36)
	at app//org.apache.lucene.tests.util.TestRuleStoreClassName$1.evaluate(TestRuleStoreClassName.java:38)
	at app//com.carrotsearch.randomizedtesting.rules.NoShadowingOrOverridesOnMethodsRule$1.evaluate(NoShadowingOrOverridesOnMethodsRule.java:40)
	at app//com.carrotsearch.randomizedtesting.rules.NoShadowingOrOverridesOnMethodsRule$1.evaluate(NoShadowingOrOverridesOnMethodsRule.java:40)
	at app//com.carrotsearch.randomizedtesting.rules.StatementAdapter.evaluate(StatementAdapter.java:36)
	at app//com.carrotsearch.randomizedtesting.rules.StatementAdapter.evaluate(StatementAdapter.java:36)
	at app//org.apache.lucene.tests.util.TestRuleAssertionsRequired$1.evaluate(TestRuleAssertionsRequired.java:53)
	at app//org.apache.lucene.tests.util.AbstractBeforeAfterRule$1.evaluate(AbstractBeforeAfterRule.java:43)
	at app//org.apache.lucene.tests.util.TestRuleMarkFailure$1.evaluate(TestRuleMarkFailure.java:44)
	at app//org.apache.lucene.tests.util.TestRuleIgnoreAfterMaxFailures$1.evaluate(TestRuleIgnoreAfterMaxFailures.java:60)
	at app//org.apache.lucene.tests.util.TestRuleIgnoreTestSuites$1.evaluate(TestRuleIgnoreTestSuites.java:47)
	at app//org.junit.rules.RunRules.evaluate(RunRules.java:20)
	at app//com.carrotsearch.randomizedtesting.rules.StatementAdapter.evaluate(StatementAdapter.java:36)
	at app//com.carrotsearch.randomizedtesting.ThreadLeakControl$StatementRunner.run(ThreadLeakControl.java:390)
	at app//com.carrotsearch.randomizedtesting.ThreadLeakControl.lambda$forkTimeoutingTask$0(ThreadLeakControl.java:850)
	at java.base@11.0.16/java.lang.Thread.run(Thread.java:829)




Build Log:
[...truncated 5418 lines...]
  2> ERROR: Failed to create collection 'gettingstarted' due to: Underlying core creation failed while creating collection: gettingstarted
  2> 
  2> 2420086 WARN  (TEST-SolrCloudExampleTest.testLoadDocsIntoGettingStartedCollection-seed#[8A39AA414661ABDA]-SendThread(127.0.0.1:45849)) [] o.a.z.ClientCnxn An exception was thrown while closing send thread for session 0x1012dcec10c0006.
  2>           => EndOfStreamException: Unable to read additional data from server sessionid 0x1012dcec10c0006, likely server has closed socket
  2> 	at org.apache.zookeeper.ClientCnxnSocketNIO.doIO(ClientCnxnSocketNIO.java:77)
  2> org.apache.zookeeper.ClientCnxn$EndOfStreamException: Unable to read additional data from server sessionid 0x1012dcec10c0006, likely server has closed socket
  2> 	at org.apache.zookeeper.ClientCnxnSocketNIO.doIO(ClientCnxnSocketNIO.java:77) ~[zookeeper-3.8.0.jar:3.8.0]
  2> 	at org.apache.zookeeper.ClientCnxnSocketNIO.doTransport(ClientCnxnSocketNIO.java:350) ~[zookeeper-3.8.0.jar:3.8.0]
  2> 	at org.apache.zookeeper.ClientCnxn$SendThread.run(ClientCnxn.java:1282) ~[zookeeper-3.8.0.jar:3.8.0]
  2> 2420329 INFO  (closeThreadPool-3242-thread-2) [] o.e.j.s.Server Stopped Server@5bcf06c4{STOPPING}[10.0.12,sto=0]
  2> 2420382 INFO  (closeThreadPool-3242-thread-4) [] o.e.j.s.Server Stopped Server@9c3a42a{STOPPING}[10.0.12,sto=0]
  2> 2420388 INFO  (closeThreadPool-3242-thread-5) [] o.e.j.s.Server Stopped Server@19f9c10b{STOPPING}[10.0.12,sto=0]
  2> 2420458 INFO  (closeThreadPool-3242-thread-2) [] o.e.j.s.AbstractConnector Stopped ServerConnector@331cbfed{HTTP/1.1, (http/1.1, h2c)}{127.0.0.1:0}
  2> 2420458 INFO  (closeThreadPool-3242-thread-2) [] o.e.j.s.h.ContextHandler Stopped o.e.j.s.ServletContextHandler@249b8b5b{/,file:///home/jenkins/jenkins-home/712657a4/workspace/Solr/Solr-Check-main-s390x/solr/core/build/tmp/tests-cwd/,STOPPED}
  2> 2420470 INFO  (closeThreadPool-3242-thread-5) [] o.e.j.s.AbstractConnector Stopped ServerConnector@706db322{HTTP/1.1, (http/1.1, h2c)}{127.0.0.1:0}
  2> 2420470 INFO  (closeThreadPool-3242-thread-5) [] o.e.j.s.h.ContextHandler Stopped o.e.j.s.ServletContextHandler@554916a1{/,file:///home/jenkins/jenkins-home/712657a4/workspace/Solr/Solr-Check-main-s390x/solr/core/build/tmp/tests-cwd/,STOPPED}
  2> 2420477 INFO  (closeThreadPool-3242-thread-4) [] o.e.j.s.AbstractConnector Stopped ServerConnector@6f8fb678{HTTP/1.1, (http/1.1, h2c)}{127.0.0.1:0}
  2> 2420480 INFO  (closeThreadPool-3242-thread-4) [] o.e.j.s.h.ContextHandler Stopped o.e.j.s.ServletContextHandler@2c35e2ea{/,file:///home/jenkins/jenkins-home/712657a4/workspace/Solr/Solr-Check-main-s390x/solr/core/build/tmp/tests-cwd/,STOPPED}
  2> 2422959 ERROR (qtp286233765-5950) [n:127.0.0.1:35105_ c:gettingstarted s:shard1 r:core_node7 x:gettingstarted_shard1_replica_n4] o.a.s.c.ZkController Error getting leader from zk
  2>           => java.lang.InterruptedException: sleep interrupted
  2> 	at java.base/java.lang.Thread.sleep(Native Method)
  2> java.lang.InterruptedException: sleep interrupted
  2> 	at java.lang.Thread.sleep(Native Method) ~[?:?]
  2> 	at org.apache.solr.cloud.ZkController.getLeaderProps(ZkController.java:1583) ~[main/:10.0.0-SNAPSHOT 29dbb3ec178b2d0dc436aea4ed7be9ef75bfc818 [snapshot build, details omitted]]
  2> 	at org.apache.solr.cloud.ZkController.getLeaderProps(ZkController.java:1549) ~[main/:10.0.0-SNAPSHOT 29dbb3ec178b2d0dc436aea4ed7be9ef75bfc818 [snapshot build, details omitted]]
  2> 	at org.apache.solr.cloud.ZkController.getLeader(ZkController.java:1491) ~[main/:10.0.0-SNAPSHOT 29dbb3ec178b2d0dc436aea4ed7be9ef75bfc818 [snapshot build, details omitted]]
  2> 	at org.apache.solr.cloud.ZkController.register(ZkController.java:1353) ~[main/:10.0.0-SNAPSHOT 29dbb3ec178b2d0dc436aea4ed7be9ef75bfc818 [snapshot build, details omitted]]
  2> 	at org.apache.solr.cloud.ZkController.register(ZkController.java:1264) ~[main/:10.0.0-SNAPSHOT 29dbb3ec178b2d0dc436aea4ed7be9ef75bfc818 [snapshot build, details omitted]]
  2> 	at org.apache.solr.core.ZkContainer.lambda$registerInZk$1(ZkContainer.java:217) ~[main/:?]
  2> 	at org.apache.solr.core.ZkContainer.registerInZk(ZkContainer.java:246) ~[main/:?]
  2> 	at org.apache.solr.core.CoreContainer.registerCore(CoreContainer.java:1410) ~[main/:?]
  2> 	at org.apache.solr.core.CoreContainer.createFromDescriptor(CoreContainer.java:1633) ~[main/:?]
  2> 	at org.apache.solr.core.CoreContainer.create(CoreContainer.java:1489) ~[main/:?]
  2> 	at org.apache.solr.handler.admin.CoreAdminOperation.lambda$static$0(CoreAdminOperation.java:113) ~[main/:?]
  2> 	at org.apache.solr.handler.admin.CoreAdminOperation.execute(CoreAdminOperation.java:409) ~[main/:?]
  2> 	at org.apache.solr.handler.admin.CoreAdminHandler$CallInfo.call(CoreAdminHandler.java:451) ~[main/:?]
  2> 	at org.apache.solr.handler.admin.CoreAdminHandler.handleRequestBody(CoreAdminHandler.java:234) ~[main/:?]
  2> 	at org.apache.solr.handler.RequestHandlerBase.handleRequest(RequestHandlerBase.java:224) ~[main/:?]
  2> 	at org.apache.solr.servlet.HttpSolrCall.handleAdmin(HttpSolrCall.java:915) ~[main/:?]
  2> 	at org.apache.solr.servlet.HttpSolrCall.handleAdminRequest(HttpSolrCall.java:863) ~[main/:?]
  2> 	at org.apache.solr.servlet.HttpSolrCall.call(HttpSolrCall.java:534) ~[main/:?]
  2> 	at org.apache.solr.servlet.SolrDispatchFilter.dispatch(SolrDispatchFilter.java:251) ~[main/:?]
  2> 	at org.apache.solr.servlet.SolrDispatchFilter.lambda$doFilter$0(SolrDispatchFilter.java:219) ~[main/:?]
  2> 	at org.apache.solr.servlet.ServletUtils.traceHttpRequestExecution2(ServletUtils.java:257) ~[main/:?]
  2> 	at org.apache.solr.servlet.ServletUtils.rateLimitRequest(ServletUtils.java:227) ~[main/:?]
  2> 	at org.apache.solr.servlet.SolrDispatchFilter.doFilter(SolrDispatchFilter.java:214) ~[main/:?]
  2> 	at org.apache.solr.servlet.SolrDispatchFilter.doFilter(SolrDispatchFilter.java:196) ~[main/:?]
  2> 	at org.eclipse.jetty.servlet.FilterHolder.doFilter(FilterHolder.java:202) ~[jetty-servlet-10.0.12.jar:10.0.12]
  2> 	at org.eclipse.jetty.servlet.ServletHandler$Chain.doFilter(ServletHandler.java:1635) ~[jetty-servlet-10.0.12.jar:10.0.12]
  2> 	at org.apache.solr.client.solrj.embedded.JettySolrRunner$DebugFilter.doFilter(JettySolrRunner.java:186) ~[main/:?]
  2> 	at org.eclipse.jetty.servlet.FilterHolder.doFilter(FilterHolder.java:202) ~[jetty-servlet-10.0.12.jar:10.0.12]
  2> 	at org.eclipse.jetty.servlet.ServletHandler$Chain.doFilter(ServletHandler.java:1635) ~[jetty-servlet-10.0.12.jar:10.0.12]
  2> 	at org.eclipse.jetty.servlet.ServletHandler.doHandle(ServletHandler.java:527) ~[jetty-servlet-10.0.12.jar:10.0.12]
  2> 	at org.eclipse.jetty.server.handler.ScopedHandler.nextHandle(ScopedHandler.java:221) ~[jetty-server-10.0.12.jar:10.0.12]
  2> 	at org.eclipse.jetty.server.session.SessionHandler.doHandle(SessionHandler.java:1571) ~[jetty-server-10.0.12.jar:10.0.12]
  2> 	at org.eclipse.jetty.server.handler.ScopedHandler.nextHandle(ScopedHandler.java:221) ~[jetty-server-10.0.12.jar:10.0.12]
  2> 	at org.eclipse.jetty.server.handler.ContextHandler.doHandle(ContextHandler.java:1383) ~[jetty-server-10.0.12.jar:10.0.12]
  2> 	at org.eclipse.jetty.server.handler.ScopedHandler.nextScope(ScopedHandler.java:176) ~[jetty-server-10.0.12.jar:10.0.12]
  2> 	at org.eclipse.jetty.servlet.ServletHandler.doScope(ServletHandler.java:484) ~[jetty-servlet-10.0.12.jar:10.0.12]
  2> 	at org.eclipse.jetty.server.session.SessionHandler.doScope(SessionHandler.java:1544) ~[jetty-server-10.0.12.jar:10.0.12]
  2> 	at org.eclipse.jetty.server.handler.ScopedHandler.nextScope(ScopedHandler.java:174) ~[jetty-server-10.0.12.jar:10.0.12]
  2> 	at org.eclipse.jetty.server.handler.ContextHandler.doScope(ContextHandler.java:1305) ~[jetty-server-10.0.12.jar:10.0.12]
  2> 	at org.eclipse.jetty.server.handler.ScopedHandler.handle(ScopedHandler.java:129) ~[jetty-server-10.0.12.jar:10.0.12]
  2> 	at org.eclipse.jetty.server.handler.HandlerWrapper.handle(HandlerWrapper.java:122) ~[jetty-server-10.0.12.jar:10.0.12]
  2> 	at org.eclipse.jetty.rewrite.handler.RewriteHandler.handle(RewriteHandler.java:301) ~[jetty-rewrite-10.0.12.jar:10.0.12]
  2> 	at org.eclipse.jetty.server.handler.HandlerWrapper.handle(HandlerWrapper.java:122) ~[jetty-server-10.0.12.jar:10.0.12]
  2> 	at org.eclipse.jetty.server.handler.gzip.GzipHandler.handle(GzipHandler.java:790) ~[jetty-server-10.0.12.jar:10.0.12]
  2> 	at org.eclipse.jetty.server.handler.HandlerWrapper.handle(HandlerWrapper.java:122) ~[jetty-server-10.0.12.jar:10.0.12]
  2> 	at org.eclipse.jetty.server.Server.handle(Server.java:563) ~[jetty-server-10.0.12.jar:10.0.12]
  2> 	at org.eclipse.jetty.server.HttpChannel.lambda$handle$0(HttpChannel.java:505) ~[jetty-server-10.0.12.jar:10.0.12]
  2> 	at org.eclipse.jetty.server.HttpChannel.dispatch(HttpChannel.java:762) ~[jetty-server-10.0.12.jar:10.0.12]
  2> 	at org.eclipse.jetty.server.HttpChannel.handle(HttpChannel.java:497) ~[jetty-server-10.0.12.jar:10.0.12]
  2> 	at org.eclipse.jetty.server.HttpChannel.run(HttpChannel.java:457) ~[jetty-server-10.0.12.jar:10.0.12]
  2> 	at org.eclipse.jetty.util.thread.QueuedThreadPool.runJob(QueuedThreadPool.java:933) ~[jetty-util-10.0.12.jar:10.0.12]
  2> 	at org.eclipse.jetty.util.thread.QueuedThreadPool$Runner.run(QueuedThreadPool.java:1077) ~[jetty-util-10.0.12.jar:10.0.12]
  2> 	at java.lang.Thread.run(Thread.java:829) ~[?:?]
  2> 2422960 ERROR (qtp286233765-5949) [n:127.0.0.1:35105_ c:gettingstarted s:shard2 r:core_node3 x:gettingstarted_shard2_replica_n1] o.a.s.c.ZkController Error getting leader from zk
  2>           => java.lang.InterruptedException
  2> 	at java.base/java.util.concurrent.locks.AbstractQueuedSynchronizer.doAcquireSharedNanos(AbstractQueuedSynchronizer.java:1081)
  2> java.lang.InterruptedException: null
  2> 	at java.util.concurrent.locks.AbstractQueuedSynchronizer.doAcquireSharedNanos(AbstractQueuedSynchronizer.java:1081) ~[?:?]
  2> 	at java.util.concurrent.locks.AbstractQueuedSynchronizer.tryAcquireSharedNanos(AbstractQueuedSynchronizer.java:1369) ~[?:?]
  2> 	at java.util.concurrent.CountDownLatch.await(CountDownLatch.java:278) ~[?:?]
  2> 	at org.apache.solr.common.cloud.ZkStateReader.waitForState(ZkStateReader.java:1905) ~[solr-solrj-zookeeper-10.0.0-SNAPSHOT.jar:10.0.0-SNAPSHOT 29dbb3ec178b2d0dc436aea4ed7be9ef75bfc818 [snapshot build, details omitted]]
  2> 	at org.apache.solr.common.cloud.ZkStateReader.getLeaderRetry(ZkStateReader.java:1008) ~[solr-solrj-zookeeper-10.0.0-SNAPSHOT.jar:10.0.0-SNAPSHOT 29dbb3ec178b2d0dc436aea4ed7be9ef75bfc818 [snapshot build, details omitted]]
  2> 	at org.apache.solr.common.cloud.ZkStateReader.getLeaderUrl(ZkStateReader.java:966) ~[solr-solrj-zookeeper-10.0.0-SNAPSHOT.jar:10.0.0-SNAPSHOT 29dbb3ec178b2d0dc436aea4ed7be9ef75bfc818 [snapshot build, details omitted]]
  2> 	at org.apache.solr.cloud.ZkController.getLeader(ZkController.java:1495) ~[main/:10.0.0-SNAPSHOT 29dbb3ec178b2d0dc436aea4ed7be9ef75bfc818 [snapshot build, details omitted]]
  2> 	at org.apache.solr.cloud.ZkController.register(ZkController.java:1353) ~[main/:10.0.0-SNAPSHOT 29dbb3ec178b2d0dc436aea4ed7be9ef75bfc818 [snapshot build, details omitted]]
  2> 	at org.apache.solr.cloud.ZkController.register(ZkController.java:1264) ~[main/:10.0.0-SNAPSHOT 29dbb3ec178b2d0dc436aea4ed7be9ef75bfc818 [snapshot build, details omitted]]
  2> 	at org.apache.solr.core.ZkContainer.lambda$registerInZk$1(ZkContainer.java:217) ~[main/:?]
  2> 	at org.apache.solr.core.ZkContainer.registerInZk(ZkContainer.java:246) ~[main/:?]
  2> 	at org.apache.solr.core.CoreContainer.registerCore(CoreContainer.java:1410) ~[main/:?]
  2> 	at org.apache.solr.core.CoreContainer.createFromDescriptor(CoreContainer.java:1633) ~[main/:?]
  2> 	at org.apache.solr.core.CoreContainer.create(CoreContainer.java:1489) ~[main/:?]
  2> 	at org.apache.solr.handler.admin.CoreAdminOperation.lambda$static$0(CoreAdminOperation.java:113) ~[main/:?]
  2> 	at org.apache.solr.handler.admin.CoreAdminOperation.execute(CoreAdminOperation.java:409) ~[main/:?]
  2> 	at org.apache.solr.handler.admin.CoreAdminHandler$CallInfo.call(CoreAdminHandler.java:451) ~[main/:?]
  2> 	at org.apache.solr.handler.admin.CoreAdminHandler.handleRequestBody(CoreAdminHandler.java:234) ~[main/:?]
  2> 	at org.apache.solr.handler.RequestHandlerBase.handleRequest(RequestHandlerBase.java:224) ~[main/:?]
  2> 	at org.apache.solr.servlet.HttpSolrCall.handleAdmin(HttpSolrCall.java:915) ~[main/:?]
  2> 	at org.apache.solr.servlet.HttpSolrCall.handleAdminRequest(HttpSolrCall.java:863) ~[main/:?]
  2> 	at org.apache.solr.servlet.HttpSolrCall.call(HttpSolrCall.java:534) ~[main/:?]
  2> 	at org.apache.solr.servlet.SolrDispatchFilter.dispatch(SolrDispatchFilter.java:251) ~[main/:?]
  2> 	at org.apache.solr.servlet.SolrDispatchFilter.lambda$doFilter$0(SolrDispatchFilter.java:219) ~[main/:?]
  2> 	at org.apache.solr.servlet.ServletUtils.traceHttpRequestExecution2(ServletUtils.java:257) ~[main/:?]
  2> 	at org.apache.solr.servlet.ServletUtils.rateLimitRequest(ServletUtils.java:227) ~[main/:?]
  2> 	at org.apache.solr.servlet.SolrDispatchFilter.doFilter(SolrDispatchFilter.java:214) ~[main/:?]
  2> 	at org.apache.solr.servlet.SolrDispatchFilter.doFilter(SolrDispatchFilter.java:196) ~[main/:?]
  2> 	at org.eclipse.jetty.servlet.FilterHolder.doFilter(FilterHolder.java:202) ~[jetty-servlet-10.0.12.jar:10.0.12]
  2> 	at org.eclipse.jetty.servlet.ServletHandler$Chain.doFilter(ServletHandler.java:1635) ~[jetty-servlet-10.0.12.jar:10.0.12]
  2> 	at org.apache.solr.client.solrj.embedded.JettySolrRunner$DebugFilter.doFilter(JettySolrRunner.java:186) ~[main/:?]
  2> 	at org.eclipse.jetty.servlet.FilterHolder.doFilter(FilterHolder.java:202) ~[jetty-servlet-10.0.12.jar:10.0.12]
  2> 	at org.eclipse.jetty.servlet.ServletHandler$Chain.doFilter(ServletHandler.java:1635) ~[jetty-servlet-10.0.12.jar:10.0.12]
  2> 	at org.eclipse.jetty.servlet.ServletHandler.doHandle(ServletHandler.java:527) ~[jetty-servlet-10.0.12.jar:10.0.12]
  2> 	at org.eclipse.jetty.server.handler.ScopedHandler.nextHandle(ScopedHandler.java:221) ~[jetty-server-10.0.12.jar:10.0.12]
  2> 	at org.eclipse.jetty.server.session.SessionHandler.doHandle(SessionHandler.java:1571) ~[jetty-server-10.0.12.jar:10.0.12]
  2> 	at org.eclipse.jetty.server.handler.ScopedHandler.nextHandle(ScopedHandler.java:221) ~[jetty-server-10.0.12.jar:10.0.12]
  2> 	at org.eclipse.jetty.server.handler.ContextHandler.doHandle(ContextHandler.java:1383) ~[jetty-server-10.0.12.jar:10.0.12]
  2> 	at org.eclipse.jetty.server.handler.ScopedHandler.nextScope(ScopedHandler.java:176) ~[jetty-server-10.0.12.jar:10.0.12]
  2> 	at org.eclipse.jetty.servlet.ServletHandler.doScope(ServletHandler.java:484) ~[jetty-servlet-10.0.12.jar:10.0.12]
  2> 	at org.eclipse.jetty.server.session.SessionHandler.doScope(SessionHandler.java:1544) ~[jetty-server-10.0.12.jar:10.0.12]
  2> 	at org.eclipse.jetty.server.handler.ScopedHandler.nextScope(ScopedHandler.java:174) ~[jetty-server-10.0.12.jar:10.0.12]
  2> 	at org.eclipse.jetty.server.handler.ContextHandler.doScope(ContextHandler.java:1305) ~[jetty-server-10.0.12.jar:10.0.12]
  2> 	at org.eclipse.jetty.server.handler.ScopedHandler.handle(ScopedHandler.java:129) ~[jetty-server-10.0.12.jar:10.0.12]
  2> 	at org.eclipse.jetty.server.handler.HandlerWrapper.handle(HandlerWrapper.java:122) ~[jetty-server-10.0.12.jar:10.0.12]
  2> 	at org.eclipse.jetty.rewrite.handler.RewriteHandler.handle(RewriteHandler.java:301) ~[jetty-rewrite-10.0.12.jar:10.0.12]
  2> 	at org.eclipse.jetty.server.handler.HandlerWrapper.handle(HandlerWrapper.java:122) ~[jetty-server-10.0.12.jar:10.0.12]
  2> 	at org.eclipse.jetty.server.handler.gzip.GzipHandler.handle(GzipHandler.java:790) ~[jetty-server-10.0.12.jar:10.0.12]
  2> 	at org.eclipse.jetty.server.handler.HandlerWrapper.handle(HandlerWrapper.java:122) ~[jetty-server-10.0.12.jar:10.0.12]
  2> 	at org.eclipse.jetty.server.Server.handle(Server.java:563) ~[jetty-server-10.0.12.jar:10.0.12]
  2> 	at org.eclipse.jetty.server.HttpChannel.lambda$handle$0(HttpChannel.java:505) ~[jetty-server-10.0.12.jar:10.0.12]
  2> 	at org.eclipse.jetty.server.HttpChannel.dispatch(HttpChannel.java:762) ~[jetty-server-10.0.12.jar:10.0.12]
  2> 	at org.eclipse.jetty.server.HttpChannel.handle(HttpChannel.java:497) ~[jetty-server-10.0.12.jar:10.0.12]
  2> 	at org.eclipse.jetty.server.HttpChannel.run(HttpChannel.java:457) ~[jetty-server-10.0.12.jar:10.0.12]
  2> 	at org.eclipse.jetty.util.thread.QueuedThreadPool.runJob(QueuedThreadPool.java:933) ~[jetty-util-10.0.12.jar:10.0.12]
  2> 	at org.eclipse.jetty.util.thread.QueuedThreadPool$Runner.run(QueuedThreadPool.java:1077) ~[jetty-util-10.0.12.jar:10.0.12]
  2> 	at java.lang.Thread.run(Thread.java:829) ~[?:?]
  2> 2422976 ERROR (qtp1951541616-6015) [n:127.0.0.1:41703_ c:gettingstarted s:shard2 r:core_node5 x:gettingstarted_shard2_replica_n2] o.a.s.c.ZkController Error getting leader from zk
  2>           => java.lang.InterruptedException
  2> 	at java.base/java.util.concurrent.locks.AbstractQueuedSynchronizer.doAcquireSharedNanos(AbstractQueuedSynchronizer.java:1081)
  2> java.lang.InterruptedException: null
  2> 	at java.util.concurrent.locks.AbstractQueuedSynchronizer.doAcquireSharedNanos(AbstractQueuedSynchronizer.java:1081) ~[?:?]
  2> 	at java.util.concurrent.locks.AbstractQueuedSynchronizer.tryAcquireSharedNanos(AbstractQueuedSynchronizer.java:1369) ~[?:?]
  2> 	at java.util.concurrent.CountDownLatch.await(CountDownLatch.java:278) ~[?:?]
  2> 	at org.apache.solr.common.cloud.ZkStateReader.waitForState(ZkStateReader.java:1905) ~[solr-solrj-zookeeper-10.0.0-SNAPSHOT.jar:10.0.0-SNAPSHOT 29dbb3ec178b2d0dc436aea4ed7be9ef75bfc818 [snapshot build, details omitted]]
  2> 	at org.apache.solr.common.cloud.ZkStateReader.getLeaderRetry(ZkStateReader.java:1008) ~[solr-solrj-zookeeper-10.0.0-SNAPSHOT.jar:10.0.0-SNAPSHOT 29dbb3ec178b2d0dc436aea4ed7be9ef75bfc818 [snapshot build, details omitted]]
  2> 	at org.apache.solr.common.cloud.ZkStateReader.getLeaderUrl(ZkStateReader.java:966) ~[solr-solrj-zookeeper-10.0.0-SNAPSHOT.jar:10.0.0-SNAPSHOT 29dbb3ec178b2d0dc436aea4ed7be9ef75bfc818 [snapshot build, details omitted]]
  2> 	at org.apache.solr.cloud.ZkController.getLeader(ZkController.java:1495) ~[main/:10.0.0-SNAPSHOT 29dbb3ec178b2d0dc436aea4ed7be9ef75bfc818 [snapshot build, details omitted]]
  2> 	at org.apache.solr.cloud.ZkController.register(ZkController.java:1353) ~[main/:10.0.0-SNAPSHOT 29dbb3ec178b2d0dc436aea4ed7be9ef75bfc818 [snapshot build, details omitted]]
  2> 	at org.apache.solr.cloud.ZkController.register(ZkController.java:1264) ~[main/:10.0.0-SNAPSHOT 29dbb3ec178b2d0dc436aea4ed7be9ef75bfc818 [snapshot build, details omitted]]
  2> 	at org.apache.solr.core.ZkContainer.lambda$registerInZk$1(ZkContainer.java:217) ~[main/:?]
  2> 	at org.apache.solr.core.ZkContainer.registerInZk(ZkContainer.java:246) ~[main/:?]
  2> 	at org.apache.solr.core.CoreContainer.registerCore(CoreContainer.java:1410) ~[main/:?]
  2> 	at org.apache.solr.core.CoreContainer.createFromDescriptor(CoreContainer.java:1633) ~[main/:?]
  2> 	at org.apache.solr.core.CoreContainer.create(CoreContainer.java:1489) ~[main/:?]
  2> 	at org.apache.solr.handler.admin.CoreAdminOperation.lambda$static$0(CoreAdminOperation.java:113) ~[main/:?]
  2> 	at org.apache.solr.handler.admin.CoreAdminOperation.execute(CoreAdminOperation.java:409) ~[main/:?]
  2> 	at org.apache.solr.handler.admin.CoreAdminHandler$CallInfo.call(CoreAdminHandler.java:451) ~[main/:?]
  2> 	at org.apache.solr.handler.admin.CoreAdminHandler.handleRequestBody(CoreAdminHandler.java:234) ~[main/:?]
  2> 	at org.apache.solr.handler.RequestHandlerBase.handleRequest(RequestHandlerBase.java:224) ~[main/:?]
  2> 	at org.apache.solr.servlet.HttpSolrCall.handleAdmin(HttpSolrCall.java:915) ~[main/:?]
  2> 	at org.apache.solr.servlet.HttpSolrCall.handleAdminRequest(HttpSolrCall.java:863) ~[main/:?]
  2> 	at org.apache.solr.servlet.HttpSolrCall.call(HttpSolrCall.java:534) ~[main/:?]
  2> 	at org.apache.solr.servlet.SolrDispatchFilter.dispatch(SolrDispatchFilter.java:251) ~[main/:?]
  2> 	at org.apache.solr.servlet.SolrDispatchFilter.lambda$doFilter$0(SolrDispatchFilter.java:219) ~[main/:?]
  2> 	at org.apache.solr.servlet.ServletUtils.traceHttpRequestExecution2(ServletUtils.java:257) ~[main/:?]
  2> 	at org.apache.solr.servlet.ServletUtils.rateLimitRequest(ServletUtils.java:227) ~[main/:?]
  2> 	at org.apache.solr.servlet.SolrDispatchFilter.doFilter(SolrDispatchFilter.java:214) ~[main/:?]
  2> 	at org.apache.solr.servlet.SolrDispatchFilter.doFilter(SolrDispatchFilter.java:196) ~[main/:?]
  2> 	at org.eclipse.jetty.servlet.FilterHolder.doFilter(FilterHolder.java:202) ~[jetty-servlet-10.0.12.jar:10.0.12]
  2> 	at org.eclipse.jetty.servlet.ServletHandler$Chain.doFilter(ServletHandler.java:1635) ~[jetty-servlet-10.0.12.jar:10.0.12]
  2> 	at org.apache.solr.client.solrj.embedded.JettySolrRunner$DebugFilter.doFilter(JettySolrRunner.java:186) ~[main/:?]
  2> 	at org.eclipse.jetty.servlet.FilterHolder.doFilter(FilterHolder.java:202) ~[jetty-servlet-10.0.12.jar:10.0.12]
  2> 	at org.eclipse.jetty.servlet.ServletHandler$Chain.doFilter(ServletHandler.java:1635) ~[jetty-servlet-10.0.12.jar:10.0.12]
  2> 	at org.eclipse.jetty.servlet.ServletHandler.doHandle(ServletHandler.java:527) ~[jetty-servlet-10.0.12.jar:10.0.12]
  2> 	at org.eclipse.jetty.server.handler.ScopedHandler.nextHandle(ScopedHandler.java:221) ~[jetty-server-10.0.12.jar:10.0.12]
  2> 	at org.eclipse.jetty.server.session.SessionHandler.doHandle(SessionHandler.java:1571) ~[jetty-server-10.0.12.jar:10.0.12]
  2> 	at org.eclipse.jetty.server.handler.ScopedHandler.nextHandle(ScopedHandler.java:221) ~[jetty-server-10.0.12.jar:10.0.12]
  2> 	at org.eclipse.jetty.server.handler.ContextHandler.doHandle(ContextHandler.java:1383) ~[jetty-server-10.0.12.jar:10.0.12]
  2> 	at org.eclipse.jetty.server.handler.ScopedHandler.nextScope(ScopedHandler.java:176) ~[jetty-server-10.0.12.jar:10.0.12]
  2> 	at org.eclipse.jetty.servlet.ServletHandler.doScope(ServletHandler.java:484) ~[jetty-servlet-10.0.12.jar:10.0.12]
  2> 	at org.eclipse.jetty.server.session.SessionHandler.doScope(SessionHandler.java:1544) ~[jetty-server-10.0.12.jar:10.0.12]
  2> 	at org.eclipse.jetty.server.handler.ScopedHandler.nextScope(ScopedHandler.java:174) ~[jetty-server-10.0.12.jar:10.0.12]
  2> 	at org.eclipse.jetty.server.handler.ContextHandler.doScope(ContextHandler.java:1305) ~[jetty-server-10.0.12.jar:10.0.12]
  2> 	at org.eclipse.jetty.server.handler.ScopedHandler.handle(ScopedHandler.java:129) ~[jetty-server-10.0.12.jar:10.0.12]
  2> 	at org.eclipse.jetty.server.handler.HandlerWrapper.handle(HandlerWrapper.java:122) ~[jetty-server-10.0.12.jar:10.0.12]
  2> 	at org.eclipse.jetty.rewrite.handler.RewriteHandler.handle(RewriteHandler.java:301) ~[jetty-rewrite-10.0.12.jar:10.0.12]
  2> 	at org.eclipse.jetty.server.handler.HandlerWrapper.handle(HandlerWrapper.java:122) ~[jetty-server-10.0.12.jar:10.0.12]
  2> 	at org.eclipse.jetty.server.handler.gzip.GzipHandler.handle(GzipHandler.java:790) ~[jetty-server-10.0.12.jar:10.0.12]
  2> 	at org.eclipse.jetty.server.handler.HandlerWrapper.handle(HandlerWrapper.java:122) ~[jetty-server-10.0.12.jar:10.0.12]
  2> 	at org.eclipse.jetty.server.Server.handle(Server.java:563) ~[jetty-server-10.0.12.jar:10.0.12]
  2> 	at org.eclipse.jetty.server.HttpChannel.lambda$handle$0(HttpChannel.java:505) ~[jetty-server-10.0.12.jar:10.0.12]
  2> 	at org.eclipse.jetty.server.HttpChannel.dispatch(HttpChannel.java:762) ~[jetty-server-10.0.12.jar:10.0.12]
  2> 	at org.eclipse.jetty.server.HttpChannel.handle(HttpChannel.java:497) ~[jetty-server-10.0.12.jar:10.0.12]
  2> 	at org.eclipse.jetty.server.HttpChannel.run(HttpChannel.java:457) ~[jetty-server-10.0.12.jar:10.0.12]
  2> 	at org.eclipse.jetty.util.thread.QueuedThreadPool.runJob(QueuedThreadPool.java:933) ~[jetty-util-10.0.12.jar:10.0.12]
  2> 	at org.eclipse.jetty.util.thread.QueuedThreadPool$Runner.run(QueuedThreadPool.java:1077) ~[jetty-util-10.0.12.jar:10.0.12]
  2> 	at java.lang.Thread.run(Thread.java:829) ~[?:?]
  2> 2422976 ERROR (qtp1951541616-6015) [n:127.0.0.1:41703_ c:gettingstarted s:shard2 r:core_node5 x:gettingstarted_shard2_replica_n2] o.a.s.c.ZkContainer 
  2>           => org.apache.solr.common.SolrException: Error getting leader from zk for shard shard2
  2> 	at org.apache.solr.cloud.ZkController.getLeader(ZkController.java:1534)
  2> org.apache.solr.common.SolrException: Error getting leader from zk for shard shard2
  2> 	at org.apache.solr.cloud.ZkController.getLeader(ZkController.java:1534) ~[main/:10.0.0-SNAPSHOT 29dbb3ec178b2d0dc436aea4ed7be9ef75bfc818 [snapshot build, details omitted]]
  2> 	at org.apache.solr.cloud.ZkController.register(ZkController.java:1353) ~[main/:10.0.0-SNAPSHOT 29dbb3ec178b2d0dc436aea4ed7be9ef75bfc818 [snapshot build, details omitted]]
  2> 	at org.apache.solr.cloud.ZkController.register(ZkController.java:1264) ~[main/:10.0.0-SNAPSHOT 29dbb3ec178b2d0dc436aea4ed7be9ef75bfc818 [snapshot build, details omitted]]
  2> 	at org.apache.solr.core.ZkContainer.lambda$registerInZk$1(ZkContainer.java:217) ~[main/:?]
  2> 	at org.apache.solr.core.ZkContainer.registerInZk(ZkContainer.java:246) ~[main/:?]
  2> 	at org.apache.solr.core.CoreContainer.registerCore(CoreContainer.java:1410) ~[main/:?]
  2> 	at org.apache.solr.core.CoreContainer.createFromDescriptor(CoreContainer.java:1633) ~[main/:?]
  2> 	at org.apache.solr.core.CoreContainer.create(CoreContainer.java:1489) ~[main/:?]
  2> 	at org.apache.solr.handler.admin.CoreAdminOperation.lambda$static$0(CoreAdminOperation.java:113) ~[main/:?]
  2> 	at org.apache.solr.handler.admin.CoreAdminOperation.execute(CoreAdminOperation.java:409) ~[main/:?]
  2> 	at org.apache.solr.handler.admin.CoreAdminHandler$CallInfo.call(CoreAdminHandler.java:451) ~[main/:?]
  2> 	at org.apache.solr.handler.admin.CoreAdminHandler.handleRequestBody(CoreAdminHandler.java:234) ~[main/:?]
  2> 	at org.apache.solr.handler.RequestHandlerBase.handleRequest(RequestHandlerBase.java:224) ~[main/:?]
  2> 	at org.apache.solr.servlet.HttpSolrCall.handleAdmin(HttpSolrCall.java:915) ~[main/:?]
  2> 	at org.apache.solr.servlet.HttpSolrCall.handleAdminRequest(HttpSolrCall.java:863) ~[main/:?]
  2> 	at org.apache.solr.servlet.HttpSolrCall.call(HttpSolrCall.java:534) ~[main/:?]
  2> 	at org.apache.solr.servlet.SolrDispatchFilter.dispatch(SolrDispatchFilter.java:251) ~[main/:?]
  2> 	at org.apache.solr.servlet.SolrDispatchFilter.lambda$doFilter$0(SolrDispatchFilter.java:219) ~[main/:?]
  2> 	at org.apache.solr.servlet.ServletUtils.traceHttpRequestExecution2(ServletUtils.java:257) ~[main/:?]
  2> 	at org.apache.solr.servlet.ServletUtils.rateLimitRequest(ServletUtils.java:227) ~[main/:?]
  2> 	at org.apache.solr.servlet.SolrDispatchFilter.doFilter(SolrDispatchFilter.java:214) ~[main/:?]
  2> 	at org.apache.solr.servlet.SolrDispatchFilter.doFilter(SolrDispatchFilter.java:196) ~[main/:?]
  2> 	at org.eclipse.jetty.servlet.FilterHolder.doFilter(FilterHolder.java:202) ~[jetty-servlet-10.0.12.jar:10.0.12]
  2> 	at org.eclipse.jetty.servlet.ServletHandler$Chain.doFilter(ServletHandler.java:1635) ~[jetty-servlet-10.0.12.jar:10.0.12]
  2> 	at org.apache.solr.client.solrj.embedded.JettySolrRunner$DebugFilter.doFilter(JettySolrRunner.java:186) ~[main/:?]
  2> 	at org.eclipse.jetty.servlet.FilterHolder.doFilter(FilterHolder.java:202) ~[jetty-servlet-10.0.12.jar:10.0.12]
  2> 	at org.eclipse.jetty.servlet.ServletHandler$Chain.doFilter(ServletHandler.java:1635) ~[jetty-servlet-10.0.12.jar:10.0.12]
  2> 	at org.eclipse.jetty.servlet.ServletHandler.doHandle(ServletHandler.java:527) ~[jetty-servlet-10.0.12.jar:10.0.12]
  2> 	at org.eclipse.jetty.server.handler.ScopedHandler.nextHandle(ScopedHandler.java:221) ~[jetty-server-10.0.12.jar:10.0.12]
  2> 	at org.eclipse.jetty.server.session.SessionHandler.doHandle(SessionHandler.java:1571) ~[jetty-server-10.0.12.jar:10.0.12]
  2> 	at org.eclipse.jetty.server.handler.ScopedHandler.nextHandle(ScopedHandler.java:221) ~[jetty-server-10.0.12.jar:10.0.12]
  2> 	at org.eclipse.jetty.server.handler.ContextHandler.doHandle(ContextHandler.java:1383) ~[jetty-server-10.0.12.jar:10.0.12]
  2> 	at org.eclipse.jetty.server.handler.ScopedHandler.nextScope(ScopedHandler.java:176) ~[jetty-server-10.0.12.jar:10.0.12]
  2> 	at org.eclipse.jetty.servlet.ServletHandler.doScope(ServletHandler.java:484) ~[jetty-servlet-10.0.12.jar:10.0.12]
  2> 	at org.eclipse.jetty.server.session.SessionHandler.doScope(SessionHandler.java:1544) ~[jetty-server-10.0.12.jar:10.0.12]
  2> 	at org.eclipse.jetty.server.handler.ScopedHandler.nextScope(ScopedHandler.java:174) ~[jetty-server-10.0.12.jar:10.0.12]
  2> 	at org.eclipse.jetty.server.handler.ContextHandler.doScope(ContextHandler.java:1305) ~[jetty-server-10.0.12.jar:10.0.12]
  2> 	at org.eclipse.jetty.server.handler.ScopedHandler.handle(ScopedHandler.java:129) ~[jetty-server-10.0.12.jar:10.0.12]
  2> 	at org.eclipse.jetty.server.handler.HandlerWrapper.handle(HandlerWrapper.java:122) ~[jetty-server-10.0.12.jar:10.0.12]
  2> 	at org.eclipse.jetty.rewrite.handler.RewriteHandler.handle(RewriteHandler.java:301) ~[jetty-rewrite-10.0.12.jar:10.0.12]
  2> 	at org.eclipse.jetty.server.handler.HandlerWrapper.handle(HandlerWrapper.java:122) ~[jetty-server-10.0.12.jar:10.0.12]
  2> 	at org.eclipse.jetty.server.handler.gzip.GzipHandler.handle(GzipHandler.java:790) ~[jetty-server-10.0.12.jar:10.0.12]
  2> 	at org.eclipse.jetty.server.handler.HandlerWrapper.handle(HandlerWrapper.java:122) ~[jetty-server-10.0.12.jar:10.0.12]
  2> 	at org.eclipse.jetty.server.Server.handle(Server.java:563) ~[jetty-server-10.0.12.jar:10.0.12]
  2> 	at org.eclipse.jetty.server.HttpChannel.lambda$handle$0(HttpChannel.java:505) ~[jetty-server-10.0.12.jar:10.0.12]
  2> 	at org.eclipse.jetty.server.HttpChannel.dispatch(HttpChannel.java:762) ~[jetty-server-10.0.12.jar:10.0.12]
  2> 	at org.eclipse.jetty.server.HttpChannel.handle(HttpChannel.java:497) ~[jetty-server-10.0.12.jar:10.0.12]
  2> 	at org.eclipse.jetty.server.HttpChannel.run(HttpChannel.java:457) ~[jetty-server-10.0.12.jar:10.0.12]
  2> 	at org.eclipse.jetty.util.thread.QueuedThreadPool.runJob(QueuedThreadPool.java:933) ~[jetty-util-10.0.12.jar:10.0.12]
  2> 	at org.eclipse.jetty.util.thread.QueuedThreadPool$Runner.run(QueuedThreadPool.java:1077) ~[jetty-util-10.0.12.jar:10.0.12]
  2> 	at java.lang.Thread.run(Thread.java:829) ~[?:?]
  2> Caused by: java.lang.InterruptedException
  2> 	at java.util.concurrent.locks.AbstractQueuedSynchronizer.doAcquireSharedNanos(AbstractQueuedSynchronizer.java:1081) ~[?:?]
  2> 	at java.util.concurrent.locks.AbstractQueuedSynchronizer.tryAcquireSharedNanos(AbstractQueuedSynchronizer.java:1369) ~[?:?]
  2> 	at java.util.concurrent.CountDownLatch.await(CountDownLatch.java:278) ~[?:?]
  2> 	at org.apache.solr.common.cloud.ZkStateReader.waitForState(ZkStateReader.java:1905) ~[solr-solrj-zookeeper-10.0.0-SNAPSHOT.jar:10.0.0-SNAPSHOT 29dbb3ec178b2d0dc436aea4ed7be9ef75bfc818 [snapshot build, details omitted]]
  2> 	at org.apache.solr.common.cloud.ZkStateReader.getLeaderRetry(ZkStateReader.java:1008) ~[solr-solrj-zookeeper-10.0.0-SNAPSHOT.jar:10.0.0-SNAPSHOT 29dbb3ec178b2d0dc436aea4ed7be9ef75bfc818 [snapshot build, details omitted]]
  2> 	at org.apache.solr.common.cloud.ZkStateReader.getLeaderUrl(ZkStateReader.java:966) ~[solr-solrj-zookeeper-10.0.0-SNAPSHOT.jar:10.0.0-SNAPSHOT 29dbb3ec178b2d0dc436aea4ed7be9ef75bfc818 [snapshot build, details omitted]]
  2> 	at org.apache.solr.cloud.ZkController.getLeader(ZkController.java:1495) ~[main/:10.0.0-SNAPSHOT 29dbb3ec178b2d0dc436aea4ed7be9ef75bfc818 [snapshot build, details omitted]]
  2> 	... 50 more
  2> 2422980 ERROR (qtp1806712790-6001) [n:127.0.0.1:45921_ c:gettingstarted s:shard1 r:core_node8 x:gettingstarted_shard1_replica_n6] o.a.s.c.ZkController Error getting leader from zk
  2>           => java.lang.InterruptedException: sleep interrupted
  2> 	at java.base/java.lang.Thread.sleep(Native Method)
  2> java.lang.InterruptedException: sleep interrupted
  2> 	at java.lang.Thread.sleep(Native Method) ~[?:?]
  2> 	at org.apache.solr.cloud.ZkController.getLeaderProps(ZkController.java:1583) ~[main/:10.0.0-SNAPSHOT 29dbb3ec178b2d0dc436aea4ed7be9ef75bfc818 [snapshot build, details omitted]]
  2> 	at org.apache.solr.cloud.ZkController.getLeaderProps(ZkController.java:1549) ~[main/:10.0.0-SNAPSHOT 29dbb3ec178b2d0dc436aea4ed7be9ef75bfc818 [snapshot build, details omitted]]
  2> 	at org.apache.solr.cloud.ZkController.getLeader(ZkController.java:1491) ~[main/:10.0.0-SNAPSHOT 29dbb3ec178b2d0dc436aea4ed7be9ef75bfc818 [snapshot build, details omitted]]
  2> 	at org.apache.solr.cloud.ZkController.register(ZkController.java:1353) ~[main/:10.0.0-SNAPSHOT 29dbb3ec178b2d0dc436aea4ed7be9ef75bfc818 [snapshot build, details omitted]]
  2> 	at org.apache.solr.cloud.ZkController.register(ZkController.java:1264) ~[main/:10.0.0-SNAPSHOT 29dbb3ec178b2d0dc436aea4ed7be9ef75bfc818 [snapshot build, details omitted]]
  2> 	at org.apache.solr.core.ZkContainer.lambda$registerInZk$1(ZkContainer.java:217) ~[main/:?]
  2> 	at org.apache.solr.core.ZkContainer.registerInZk(ZkContainer.java:246) ~[main/:?]
  2> 	at org.apache.solr.core.CoreContainer.registerCore(CoreContainer.java:1410) ~[main/:?]
  2> 	at org.apache.solr.core.CoreContainer.createFromDescriptor(CoreContainer.java:1633) ~[main/:?]
  2> 	at org.apache.solr.core.CoreContainer.create(CoreContainer.java:1489) ~[main/:?]
  2> 	at org.apache.solr.handler.admin.CoreAdminOperation.lambda$static$0(CoreAdminOperation.java:113) ~[main/:?]
  2> 	at org.apache.solr.handler.admin.CoreAdminOperation.execute(CoreAdminOperation.java:409) ~[main/:?]
  2> 	at org.apache.solr.handler.admin.CoreAdminHandler$CallInfo.call(CoreAdminHandler.java:451) ~[main/:?]
  2> 	at org.apache.solr.handler.admin.CoreAdminHandler.handleRequestBody(CoreAdminHandler.java:234) ~[main/:?]
  2> 	at org.apache.solr.handler.RequestHandlerBase.handleRequest(RequestHandlerBase.java:224) ~[main/:?]
  2> 	at org.apache.solr.servlet.HttpSolrCall.handleAdmin(HttpSolrCall.java:915) ~[main/:?]
  2> 	at org.apache.solr.servlet.HttpSolrCall.handleAdminRequest(HttpSolrCall.java:863) ~[main/:?]
  2> 	at org.apache.solr.servlet.HttpSolrCall.call(HttpSolrCall.java:534) ~[main/:?]
  2> 	at org.apache.solr.servlet.SolrDispatchFilter.dispatch(SolrDispatchFilter.java:251) ~[main/:?]
  2> 	at org.apache.solr.servlet.SolrDispatchFilter.lambda$doFilter$0(SolrDispatchFilter.java:219) ~[main/:?]
  2> 	at org.apache.solr.servlet.ServletUtils.traceHttpRequestExecution2(ServletUtils.java:257) ~[main/:?]
  2> 	at org.apache.solr.servlet.ServletUtils.rateLimitRequest(ServletUtils.java:227) ~[main/:?]
  2> 	at org.apache.solr.servlet.SolrDispatchFilter.doFilter(SolrDispatchFilter.java:214) ~[main/:?]
  2> 	at org.apache.solr.servlet.SolrDispatchFilter.doFilter(SolrDispatchFilter.java:196) ~[main/:?]
  2> 	at org.eclipse.jetty.servlet.FilterHolder.doFilter(FilterHolder.java:202) ~[jetty-servlet-10.0.12.jar:10.0.12]
  2> 	at org.eclipse.jetty.servlet.ServletHandler$Chain.doFilter(ServletHandler.java:1635) ~[jetty-servlet-10.0.12.jar:10.0.12]
  2> 	at org.apache.solr.client.solrj.embedded.JettySolrRunner$DebugFilter.doFilter(JettySolrRunner.java:186) ~[main/:?]
  2> 	at org.eclipse.jetty.servlet.FilterHolder.doFilter(FilterHolder.java:202) ~[jetty-servlet-10.0.12.jar:10.0.12]
  2> 	at org.eclipse.jetty.servlet.ServletHandler$Chain.doFilter(ServletHandler.java:1635) ~[jetty-servlet-10.0.12.jar:10.0.12]
  2> 	at org.eclipse.jetty.servlet.ServletHandler.doHandle(ServletHandler.java:527) ~[jetty-servlet-10.0.12.jar:10.0.12]
  2> 	at org.eclipse.jetty.server.handler.ScopedHandler.nextHandle(ScopedHandler.java:221) ~[jetty-server-10.0.12.jar:10.0.12]
  2> 	at org.eclipse.jetty.server.session.SessionHandler.doHandle(SessionHandler.java:1571) ~[jetty-server-10.0.12.jar:10.0.12]
  2> 	at org.eclipse.jetty.server.handler.ScopedHandler.nextHandle(ScopedHandler.java:221) ~[jetty-server-10.0.12.jar:10.0.12]
  2> 	at org.eclipse.jetty.server.handler.ContextHandler.doHandle(ContextHandler.java:1383) ~[jetty-server-10.0.12.jar:10.0.12]
  2> 	at org.eclipse.jetty.server.handler.ScopedHandler.nextScope(ScopedHandler.java:176) ~[jetty-server-10.0.12.jar:10.0.12]
  2> 	at org.eclipse.jetty.servlet.ServletHandler.doScope(ServletHandler.java:484) ~[jetty-servlet-10.0.12.jar:10.0.12]
  2> 	at org.eclipse.jetty.server.session.SessionHandler.doScope(SessionHandler.java:1544) ~[jetty-server-10.0.12.jar:10.0.12]
  2> 	at org.eclipse.jetty.server.handler.ScopedHandler.nextScope(ScopedHandler.java:174) ~[jetty-server-10.0.12.jar:10.0.12]
  2> 	at org.eclipse.jetty.server.handler.ContextHandler.doScope(ContextHandler.java:1305) ~[jetty-server-10.0.12.jar:10.0.12]
  2> 	at org.eclipse.jetty.server.handler.ScopedHandler.handle(ScopedHandler.java:129) ~[jetty-server-10.0.12.jar:10.0.12]
  2> 	at org.eclipse.jetty.server.handler.HandlerWrapper.handle(HandlerWrapper.java:122) ~[jetty-server-10.0.12.jar:10.0.12]
  2> 	at org.eclipse.jetty.rewrite.handler.RewriteHandler.handle(RewriteHandler.java:301) ~[jetty-rewrite-10.0.12.jar:10.0.12]
  2> 	at org.eclipse.jetty.server.handler.HandlerWrapper.handle(HandlerWrapper.java:122) ~[jetty-server-10.0.12.jar:10.0.12]
  2> 	at org.eclipse.jetty.server.handler.gzip.GzipHandler.handle(GzipHandler.java:790) ~[jetty-server-10.0.12.jar:10.0.12]
  2> 	at org.eclipse.jetty.server.handler.HandlerWrapper.handle(HandlerWrapper.java:122) ~[jetty-server-10.0.12.jar:10.0.12]
  2> 	at org.eclipse.jetty.server.Server.handle(Server.java:563) ~[jetty-server-10.0.12.jar:10.0.12]
  2> 	at org.eclipse.jetty.server.HttpChannel.lambda$handle$0(HttpChannel.java:505) ~[jetty-server-10.0.12.jar:10.0.12]
  2> 	at org.eclipse.jetty.server.HttpChannel.dispatch(HttpChannel.java:762) ~[jetty-server-10.0.12.jar:10.0.12]
  2> 	at org.eclipse.jetty.server.HttpChannel.handle(HttpChannel.java:497) ~[jetty-server-10.0.12.jar:10.0.12]
  2> 	at org.eclipse.jetty.server.HttpChannel.run(HttpChannel.java:457) ~[jetty-server-10.0.12.jar:10.0.12]
  2> 	at org.eclipse.jetty.util.thread.QueuedThreadPool.runJob(QueuedThreadPool.java:933) ~[jetty-util-10.0.12.jar:10.0.12]
  2> 	at org.eclipse.jetty.util.thread.QueuedThreadPool$Runner.run(QueuedThreadPool.java:1077) ~[jetty-util-10.0.12.jar:10.0.12]
  2> 	at java.lang.Thread.run(

[...truncated too long message...]

pendencies
> Task :solr:modules:gcs-repository:analyzeDependencies
> Task :solr:modules:gcs-repository:test
:solr:modules:gcs-repository:test (SUCCESS): 14 test(s), 1 skipped

> Task :solr:modules:gcs-repository:wipeTaskTemp
> Task :solr:modules:gcs-repository:check
> Task :solr:modules:hadoop-auth:analyzeClassesDependencies
> Task :solr:modules:hadoop-auth:analyzeTestClassesDependencies
> Task :solr:modules:hadoop-auth:analyzeDependencies
> Task :solr:modules:hadoop-auth:test
:solr:modules:hadoop-auth:test (SUCCESS): 55 test(s), 1 skipped

> Task :solr:modules:hadoop-auth:wipeTaskTemp
> Task :solr:modules:hadoop-auth:check
> Task :solr:modules:hdfs:analyzeClassesDependencies
> Task :solr:modules:hdfs:analyzeTestClassesDependencies
> Task :solr:modules:hdfs:analyzeDependencies
> Task :solr:modules:hdfs:test
:solr:modules:hdfs:test (SUCCESS): 101 test(s), 42 skipped

> Task :solr:modules:hdfs:wipeTaskTemp
> Task :solr:modules:hdfs:check
> Task :solr:modules:jaegertracer-configurator:analyzeClassesDependencies
> Task :solr:modules:jaegertracer-configurator:analyzeTestClassesDependencies
> Task :solr:modules:jaegertracer-configurator:analyzeDependencies
> Task :solr:modules:jaegertracer-configurator:test
:solr:modules:jaegertracer-configurator:test (SUCCESS): 1 test(s)

> Task :solr:modules:jaegertracer-configurator:wipeTaskTemp
> Task :solr:modules:jaegertracer-configurator:check
> Task :solr:modules:jwt-auth:analyzeClassesDependencies
> Task :solr:modules:jwt-auth:analyzeTestClassesDependencies
> Task :solr:modules:jwt-auth:analyzeDependencies
> Task :solr:modules:jwt-auth:test
:solr:modules:jwt-auth:test (SUCCESS): 58 test(s), 1 skipped

> Task :solr:modules:jwt-auth:wipeTaskTemp
> Task :solr:modules:jwt-auth:check
> Task :solr:modules:langid:analyzeClassesDependencies
> Task :solr:modules:langid:analyzeTestClassesDependencies
> Task :solr:modules:langid:analyzeDependencies
> Task :solr:modules:langid:test
:solr:modules:langid:test (SUCCESS): 43 test(s)

> Task :solr:modules:langid:wipeTaskTemp
> Task :solr:modules:langid:check
> Task :solr:modules:ltr:analyzeClassesDependencies
> Task :solr:modules:ltr:analyzeTestClassesDependencies
> Task :solr:modules:ltr:analyzeDependencies
> Task :solr:modules:ltr:test
:solr:modules:ltr:test (SUCCESS): 164 test(s)

> Task :solr:modules:ltr:wipeTaskTemp
> Task :solr:modules:ltr:check
> Task :solr:modules:s3-repository:analyzeClassesDependencies
> Task :solr:modules:s3-repository:analyzeTestClassesDependencies
> Task :solr:modules:s3-repository:analyzeDependencies
> Task :solr:modules:s3-repository:test
:solr:modules:s3-repository:test (SUCCESS): 42 test(s), 1 skipped

> Task :solr:modules:s3-repository:wipeTaskTemp
> Task :solr:modules:s3-repository:check
> Task :solr:modules:scripting:analyzeClassesDependencies
> Task :solr:modules:scripting:analyzeTestClassesDependencies
> Task :solr:modules:scripting:analyzeDependencies
> Task :solr:modules:scripting:test
:solr:modules:scripting:test (SUCCESS): 22 test(s), 1 skipped

> Task :solr:modules:scripting:wipeTaskTemp
> Task :solr:modules:scripting:check
> Task :solr:modules:sql:analyzeClassesDependencies
> Task :solr:modules:sql:analyzeTestClassesDependencies
> Task :solr:modules:sql:analyzeDependencies
> Task :solr:modules:sql:test
:solr:modules:sql:test (SUCCESS): 33 test(s)

> Task :solr:modules:sql:wipeTaskTemp
> Task :solr:modules:sql:check

ERROR: The following test(s) have failed:
  - org.apache.solr.cloud.HttpPartitionOnCommitTest.test (:solr:core)
    Test output: /home/jenkins/jenkins-home/712657a4/workspace/Solr/Solr-Check-main-s390x/solr/core/build/test-results/test/outputs/OUTPUT-org.apache.solr.cloud.HttpPartitionOnCommitTest.txt
    Reproduce with: gradlew :solr:core:test --tests "org.apache.solr.cloud.HttpPartitionOnCommitTest.test" -Ptests.jvms=4 -Ptests.haltonfailure=false "-Ptests.jvmargs=-XX:TieredStopAtLevel=1 -XX:ReservedCodeCacheSize=120m" -Ptests.seed=8A39AA414661ABDA -Ptests.multiplier=2 -Ptests.badapples=false -Ptests.file.encoding=UTF-8

  - org.apache.solr.cloud.MoveReplicaTest.testFailedMove (:solr:core)
    Test output: /home/jenkins/jenkins-home/712657a4/workspace/Solr/Solr-Check-main-s390x/solr/core/build/test-results/test/outputs/OUTPUT-org.apache.solr.cloud.MoveReplicaTest.txt
    Reproduce with: gradlew :solr:core:test --tests "org.apache.solr.cloud.MoveReplicaTest.testFailedMove" -Ptests.jvms=4 -Ptests.haltonfailure=false "-Ptests.jvmargs=-XX:TieredStopAtLevel=1 -XX:ReservedCodeCacheSize=120m" -Ptests.seed=8A39AA414661ABDA -Ptests.multiplier=2 -Ptests.badapples=false -Ptests.file.encoding=UTF-8

  - org.apache.solr.cloud.ReplicationFactorTest.test (:solr:core)
    Test output: /home/jenkins/jenkins-home/712657a4/workspace/Solr/Solr-Check-main-s390x/solr/core/build/test-results/test/outputs/OUTPUT-org.apache.solr.cloud.ReplicationFactorTest.txt
    Reproduce with: gradlew :solr:core:test --tests "org.apache.solr.cloud.ReplicationFactorTest.test" -Ptests.jvms=4 -Ptests.haltonfailure=false "-Ptests.jvmargs=-XX:TieredStopAtLevel=1 -XX:ReservedCodeCacheSize=120m" -Ptests.seed=8A39AA414661ABDA -Ptests.multiplier=2 -Ptests.badapples=false -Ptests.file.encoding=UTF-8

  - org.apache.solr.cloud.SolrCloudExampleTest.testLoadDocsIntoGettingStartedCollection (:solr:core)
    Test output: /home/jenkins/jenkins-home/712657a4/workspace/Solr/Solr-Check-main-s390x/solr/core/build/test-results/test/outputs/OUTPUT-org.apache.solr.cloud.SolrCloudExampleTest.txt
    Reproduce with: gradlew :solr:core:test --tests "org.apache.solr.cloud.SolrCloudExampleTest.testLoadDocsIntoGettingStartedCollection" -Ptests.jvms=4 -Ptests.haltonfailure=false "-Ptests.jvmargs=-XX:TieredStopAtLevel=1 -XX:ReservedCodeCacheSize=120m" -Ptests.seed=8A39AA414661ABDA -Ptests.multiplier=2 -Ptests.badapples=false -Ptests.file.encoding=UTF-8

  - org.apache.solr.cloud.OverseerTest.testReplay (:solr:core)
    Test output: /home/jenkins/jenkins-home/712657a4/workspace/Solr/Solr-Check-main-s390x/solr/core/build/test-results/test/outputs/OUTPUT-org.apache.solr.cloud.OverseerTest.txt
    Reproduce with: gradlew :solr:core:test --tests "org.apache.solr.cloud.OverseerTest.testReplay" -Ptests.jvms=4 -Ptests.haltonfailure=false "-Ptests.jvmargs=-XX:TieredStopAtLevel=1 -XX:ReservedCodeCacheSize=120m" -Ptests.seed=8A39AA414661ABDA -Ptests.multiplier=2 -Ptests.badapples=false -Ptests.file.encoding=UTF-8

  - org.apache.solr.cloud.ReplaceNodeTest.testGoodSpreadDuringAssignWithNoTarget (:solr:core)
    Test output: /home/jenkins/jenkins-home/712657a4/workspace/Solr/Solr-Check-main-s390x/solr/core/build/test-results/test/outputs/OUTPUT-org.apache.solr.cloud.ReplaceNodeTest.txt
    Reproduce with: gradlew :solr:core:test --tests "org.apache.solr.cloud.ReplaceNodeTest.testGoodSpreadDuringAssignWithNoTarget" -Ptests.jvms=4 -Ptests.haltonfailure=false "-Ptests.jvmargs=-XX:TieredStopAtLevel=1 -XX:ReservedCodeCacheSize=120m" -Ptests.seed=8A39AA414661ABDA -Ptests.multiplier=2 -Ptests.badapples=false -Ptests.file.encoding=UTF-8

  - org.apache.solr.cloud.ReplaceNodeTest.test (:solr:core)
    Test output: /home/jenkins/jenkins-home/712657a4/workspace/Solr/Solr-Check-main-s390x/solr/core/build/test-results/test/outputs/OUTPUT-org.apache.solr.cloud.ReplaceNodeTest.txt
    Reproduce with: gradlew :solr:core:test --tests "org.apache.solr.cloud.ReplaceNodeTest.test" -Ptests.jvms=4 -Ptests.haltonfailure=false "-Ptests.jvmargs=-XX:TieredStopAtLevel=1 -XX:ReservedCodeCacheSize=120m" -Ptests.seed=8A39AA414661ABDA -Ptests.multiplier=2 -Ptests.badapples=false -Ptests.file.encoding=UTF-8

  - org.apache.solr.cloud.TestRandomRequestDistribution.test (:solr:core)
    Test output: /home/jenkins/jenkins-home/712657a4/workspace/Solr/Solr-Check-main-s390x/solr/core/build/test-results/test/outputs/OUTPUT-org.apache.solr.cloud.TestRandomRequestDistribution.txt
    Reproduce with: gradlew :solr:core:test --tests "org.apache.solr.cloud.TestRandomRequestDistribution.test" -Ptests.jvms=4 -Ptests.haltonfailure=false "-Ptests.jvmargs=-XX:TieredStopAtLevel=1 -XX:ReservedCodeCacheSize=120m" -Ptests.seed=8A39AA414661ABDA -Ptests.multiplier=2 -Ptests.badapples=false -Ptests.file.encoding=UTF-8

  - org.apache.solr.search.join.CrossCollectionJoinQueryTest.classMethod (:solr:core)
    Test output: /home/jenkins/jenkins-home/712657a4/workspace/Solr/Solr-Check-main-s390x/solr/core/build/test-results/test/outputs/OUTPUT-org.apache.solr.search.join.CrossCollectionJoinQueryTest.txt
    Reproduce with: gradlew :solr:core:test --tests "org.apache.solr.search.join.CrossCollectionJoinQueryTest.classMethod" -Ptests.jvms=4 -Ptests.haltonfailure=false "-Ptests.jvmargs=-XX:TieredStopAtLevel=1 -XX:ReservedCodeCacheSize=120m" -Ptests.seed=8A39AA414661ABDA -Ptests.multiplier=2 -Ptests.badapples=false -Ptests.file.encoding=UTF-8


FAILURE: Build failed with an exception.

* Where:
Script '/home/jenkins/jenkins-home/712657a4/workspace/Solr/Solr-Check-main-s390x/gradle/validation/check-broken-links.gradle' line: 52

* What went wrong:
Execution failed for task ':solr:documentation:checkBrokenLinks'.
> java.io.IOException: Stream Closed

* Try:
> Run with --stacktrace option to get the stack trace.
> Run with --info or --debug option to get more log output.
> Run with --scan to get full insights.

* Get more help at https://help.gradle.org

Deprecated Gradle features were used in this build, making it incompatible with Gradle 8.0.

You can use '--warning-mode all' to show the individual deprecation warnings and determine if they come from your own scripts or plugins.

See https://docs.gradle.org/7.5.1/userguide/command_line_interface.html#sec:command_line_warnings

BUILD FAILED in 4h 3m 51s
609 actionable tasks: 609 executed
Build step 'Invoke Gradle script' changed build result to FAILURE
Build step 'Invoke Gradle script' marked build as failure
Archiving artifacts
Recording test results
[Checks API] No suitable checks publisher found.
Email was triggered for: Failure - Any
Sending email for trigger: Failure - Any

[JENKINS] Solr » Solr-Check-main-s390x - Build # 73 - Failure!

Posted by Apache Jenkins Server <je...@builds.apache.org>.
Build: https://ci-builds.apache.org/job/Solr/job/Solr-Check-main-s390x/73/

No tests ran.

Build Log:
[...truncated 1525 lines...]
BUILD FAILED in 10m 29s
273 actionable tasks: 273 executed
Build step 'Invoke Gradle script' changed build result to FAILURE
Build step 'Invoke Gradle script' marked build as failure
Archiving artifacts
Recording test results
ERROR: Step ‘Publish JUnit test result report’ failed: No test report files were found. Configuration error?
Email was triggered for: Failure - Any
Sending email for trigger: Failure - Any

[JENKINS] Solr » Solr-Check-main-s390x - Build # 72 - Still Unstable!

Posted by Apache Jenkins Server <je...@builds.apache.org>.
Build: https://ci-builds.apache.org/job/Solr/job/Solr-Check-main-s390x/72/

5 tests failed.
FAILED:  org.apache.solr.cloud.ReplaceNodeTest.testGoodSpreadDuringAssignWithNoTarget

Error Message:
java.lang.AssertionError: There should be no more replicas on the sourceNode after a replaceNode request. expected:<[]> but was:<[core_node11:{
  "core":"replacenodetest_coll_shard3_replica_n5",
  "leader":"true",
  "core_node_name":"core_node11",
  "node_name":"127.0.0.1:32787_solr",
  "base_url":"https://127.0.0.1:32787/solr",
  "state":"active",
  "collection":"replacenodetest_coll",
  "shard":"shard3",
  "type":"NRT",
  "force_set_state":"false"}]>

Stack Trace:
java.lang.AssertionError: There should be no more replicas on the sourceNode after a replaceNode request. expected:<[]> but was:<[core_node11:{
  "core":"replacenodetest_coll_shard3_replica_n5",
  "leader":"true",
  "core_node_name":"core_node11",
  "node_name":"127.0.0.1:32787_solr",
  "base_url":"https://127.0.0.1:32787/solr",
  "state":"active",
  "collection":"replacenodetest_coll",
  "shard":"shard3",
  "type":"NRT",
  "force_set_state":"false"}]>
	at __randomizedtesting.SeedInfo.seed([ABAD781DB7EF6349:85C6AC27828CB23D]:0)
	at org.junit.Assert.fail(Assert.java:89)
	at org.junit.Assert.failNotEquals(Assert.java:835)
	at org.junit.Assert.assertEquals(Assert.java:120)
	at org.apache.solr.cloud.ReplaceNodeTest.testGoodSpreadDuringAssignWithNoTarget(ReplaceNodeTest.java:271)
	at java.base/jdk.internal.reflect.NativeMethodAccessorImpl.invoke0(Native Method)
	at java.base/jdk.internal.reflect.NativeMethodAccessorImpl.invoke(NativeMethodAccessorImpl.java:62)
	at java.base/jdk.internal.reflect.DelegatingMethodAccessorImpl.invoke(DelegatingMethodAccessorImpl.java:43)
	at java.base/java.lang.reflect.Method.invoke(Method.java:566)
	at com.carrotsearch.randomizedtesting.RandomizedRunner.invoke(RandomizedRunner.java:1758)
	at com.carrotsearch.randomizedtesting.RandomizedRunner$8.evaluate(RandomizedRunner.java:946)
	at com.carrotsearch.randomizedtesting.RandomizedRunner$9.evaluate(RandomizedRunner.java:982)
	at com.carrotsearch.randomizedtesting.RandomizedRunner$10.evaluate(RandomizedRunner.java:996)
	at com.carrotsearch.randomizedtesting.rules.SystemPropertiesRestoreRule$1.evaluate(SystemPropertiesRestoreRule.java:80)
	at org.junit.rules.RunRules.evaluate(RunRules.java:20)
	at org.apache.lucene.tests.util.TestRuleSetupTeardownChained$1.evaluate(TestRuleSetupTeardownChained.java:44)
	at org.apache.lucene.tests.util.AbstractBeforeAfterRule$1.evaluate(AbstractBeforeAfterRule.java:43)
	at org.apache.lucene.tests.util.TestRuleThreadAndTestName$1.evaluate(TestRuleThreadAndTestName.java:45)
	at org.apache.lucene.tests.util.TestRuleIgnoreAfterMaxFailures$1.evaluate(TestRuleIgnoreAfterMaxFailures.java:60)
	at org.apache.lucene.tests.util.TestRuleMarkFailure$1.evaluate(TestRuleMarkFailure.java:44)
	at org.junit.rules.RunRules.evaluate(RunRules.java:20)
	at com.carrotsearch.randomizedtesting.rules.StatementAdapter.evaluate(StatementAdapter.java:36)
	at com.carrotsearch.randomizedtesting.ThreadLeakControl$StatementRunner.run(ThreadLeakControl.java:390)
	at com.carrotsearch.randomizedtesting.ThreadLeakControl.forkTimeoutingTask(ThreadLeakControl.java:843)
	at com.carrotsearch.randomizedtesting.ThreadLeakControl$3.evaluate(ThreadLeakControl.java:490)
	at com.carrotsearch.randomizedtesting.RandomizedRunner.runSingleTest(RandomizedRunner.java:955)
	at com.carrotsearch.randomizedtesting.RandomizedRunner$5.evaluate(RandomizedRunner.java:840)
	at com.carrotsearch.randomizedtesting.RandomizedRunner$6.evaluate(RandomizedRunner.java:891)
	at com.carrotsearch.randomizedtesting.RandomizedRunner$7.evaluate(RandomizedRunner.java:902)
	at com.carrotsearch.randomizedtesting.rules.StatementAdapter.evaluate(StatementAdapter.java:36)
	at org.apache.lucene.tests.util.AbstractBeforeAfterRule$1.evaluate(AbstractBeforeAfterRule.java:43)
	at org.apache.lucene.tests.util.AbstractBeforeAfterRule$1.evaluate(AbstractBeforeAfterRule.java:43)
	at com.carrotsearch.randomizedtesting.rules.SystemPropertiesRestoreRule$1.evaluate(SystemPropertiesRestoreRule.java:80)
	at org.junit.rules.RunRules.evaluate(RunRules.java:20)
	at org.apache.lucene.tests.util.AbstractBeforeAfterRule$1.evaluate(AbstractBeforeAfterRule.java:43)
	at com.carrotsearch.randomizedtesting.rules.StatementAdapter.evaluate(StatementAdapter.java:36)
	at org.apache.lucene.tests.util.TestRuleStoreClassName$1.evaluate(TestRuleStoreClassName.java:38)
	at com.carrotsearch.randomizedtesting.rules.NoShadowingOrOverridesOnMethodsRule$1.evaluate(NoShadowingOrOverridesOnMethodsRule.java:40)
	at com.carrotsearch.randomizedtesting.rules.NoShadowingOrOverridesOnMethodsRule$1.evaluate(NoShadowingOrOverridesOnMethodsRule.java:40)
	at com.carrotsearch.randomizedtesting.rules.StatementAdapter.evaluate(StatementAdapter.java:36)
	at com.carrotsearch.randomizedtesting.rules.StatementAdapter.evaluate(StatementAdapter.java:36)
	at org.apache.lucene.tests.util.TestRuleAssertionsRequired$1.evaluate(TestRuleAssertionsRequired.java:53)
	at org.apache.lucene.tests.util.AbstractBeforeAfterRule$1.evaluate(AbstractBeforeAfterRule.java:43)
	at org.apache.lucene.tests.util.TestRuleMarkFailure$1.evaluate(TestRuleMarkFailure.java:44)
	at org.apache.lucene.tests.util.TestRuleIgnoreAfterMaxFailures$1.evaluate(TestRuleIgnoreAfterMaxFailures.java:60)
	at org.apache.lucene.tests.util.TestRuleIgnoreTestSuites$1.evaluate(TestRuleIgnoreTestSuites.java:47)
	at org.junit.rules.RunRules.evaluate(RunRules.java:20)
	at com.carrotsearch.randomizedtesting.rules.StatementAdapter.evaluate(StatementAdapter.java:36)
	at com.carrotsearch.randomizedtesting.ThreadLeakControl$StatementRunner.run(ThreadLeakControl.java:390)
	at com.carrotsearch.randomizedtesting.ThreadLeakControl.lambda$forkTimeoutingTask$0(ThreadLeakControl.java:850)
	at java.base/java.lang.Thread.run(Thread.java:829)


FAILED:  org.apache.solr.metrics.reporters.SolrJmxReporterTest.testClosedCore

Error Message:
com.carrotsearch.randomizedtesting.UncaughtExceptionError: Captured an uncaught exception in thread: Thread[id=16159, name=TestMBeanThread, state=RUNNABLE, group=TGRP-SolrJmxReporterTest]

Stack Trace:
com.carrotsearch.randomizedtesting.UncaughtExceptionError: Captured an uncaught exception in thread: Thread[id=16159, name=TestMBeanThread, state=RUNNABLE, group=TGRP-SolrJmxReporterTest]
	at __randomizedtesting.SeedInfo.seed([ABAD781DB7EF6349:DCD0AE3D977601B9]:0)
Caused by: java.lang.AssertionError
	at __randomizedtesting.SeedInfo.seed([ABAD781DB7EF6349]:0)
	at org.junit.Assert.fail(Assert.java:87)
	at org.junit.Assert.assertTrue(Assert.java:42)
	at org.junit.Assert.assertNotNull(Assert.java:713)
	at org.junit.Assert.assertNotNull(Assert.java:723)
	at org.apache.solr.metrics.reporters.SolrJmxReporterTest.lambda$testClosedCore$3(SolrJmxReporterTest.java:239)
	at java.base/java.lang.Thread.run(Thread.java:829)


FAILED:  org.apache.solr.ltr.TestLTRQParserExplain.interleavingModelsWithOriginalRanking_shouldReturnExplainForTheModelPicked

Error Message:
java.lang.AssertionError: mismatch: '
0.07662583 = weight(title:bloomberg in 3) [SchemaSimilarity], result of:
  0.07662583 = score(freq=4.0), computed as boost * idf * tf from:
    0.105360515 = idf, computed as log(1 + (N - n + 0.5) / (n + 0.5)) from:
      4 = n, number of documents containing term
      4 = N, total number of documents with field
    0.72727275 = tf, computed as freq / (freq + k1 * (1 - b + b * dl / avgdl)) from:
      4.0 = freq, occurrences of term within document
      1.2 = k1, term saturation parameter
      0.75 = b, length normalization parameter
      4.0 = dl, length of field
      3.0 = avgdl, average length of field
'!='
0.07662583 = weight(title:bloomberg in 0) [SchemaSimilarity], result of:
  0.07662583 = score(freq=4.0), computed as boost * idf * tf from:
    0.105360515 = idf, computed as log(1 + (N - n + 0.5) / (n + 0.5)) from:
      4 = n, number of documents containing term
      4 = N, total number of documents with field
    0.72727275 = tf, computed as freq / (freq + k1 * (1 - b + b * dl / avgdl)) from:
      4.0 = freq, occurrences of term within document
      1.2 = k1, term saturation parameter
      0.75 = b, length normalization parameter
      4.0 = dl, length of field
      3.0 = avgdl, average length of field
' @ debug/explain/9

Stack Trace:
java.lang.AssertionError: mismatch: '
0.07662583 = weight(title:bloomberg in 3) [SchemaSimilarity], result of:
  0.07662583 = score(freq=4.0), computed as boost * idf * tf from:
    0.105360515 = idf, computed as log(1 + (N - n + 0.5) / (n + 0.5)) from:
      4 = n, number of documents containing term
      4 = N, total number of documents with field
    0.72727275 = tf, computed as freq / (freq + k1 * (1 - b + b * dl / avgdl)) from:
      4.0 = freq, occurrences of term within document
      1.2 = k1, term saturation parameter
      0.75 = b, length normalization parameter
      4.0 = dl, length of field
      3.0 = avgdl, average length of field
'!='
0.07662583 = weight(title:bloomberg in 0) [SchemaSimilarity], result of:
  0.07662583 = score(freq=4.0), computed as boost * idf * tf from:
    0.105360515 = idf, computed as log(1 + (N - n + 0.5) / (n + 0.5)) from:
      4 = n, number of documents containing term
      4 = N, total number of documents with field
    0.72727275 = tf, computed as freq / (freq + k1 * (1 - b + b * dl / avgdl)) from:
      4.0 = freq, occurrences of term within document
      1.2 = k1, term saturation parameter
      0.75 = b, length normalization parameter
      4.0 = dl, length of field
      3.0 = avgdl, average length of field
' @ debug/explain/9
	at __randomizedtesting.SeedInfo.seed([ABAD781DB7EF6349:8074F114E4DDFAFD]:0)
	at org.junit.Assert.fail(Assert.java:89)
	at org.apache.solr.util.RestTestBase.assertJsonMatches(RestTestBase.java:270)
	at org.apache.solr.util.RestTestBase.assertJQ(RestTestBase.java:212)
	at org.apache.solr.util.RestTestBase.assertJQ(RestTestBase.java:184)
	at org.apache.solr.ltr.TestLTRQParserExplain.interleavingModelsWithOriginalRanking_shouldReturnExplainForTheModelPicked(TestLTRQParserExplain.java:337)
	at java.base/jdk.internal.reflect.NativeMethodAccessorImpl.invoke0(Native Method)
	at java.base/jdk.internal.reflect.NativeMethodAccessorImpl.invoke(NativeMethodAccessorImpl.java:62)
	at java.base/jdk.internal.reflect.DelegatingMethodAccessorImpl.invoke(DelegatingMethodAccessorImpl.java:43)
	at java.base/java.lang.reflect.Method.invoke(Method.java:566)
	at com.carrotsearch.randomizedtesting.RandomizedRunner.invoke(RandomizedRunner.java:1758)
	at com.carrotsearch.randomizedtesting.RandomizedRunner$8.evaluate(RandomizedRunner.java:946)
	at com.carrotsearch.randomizedtesting.RandomizedRunner$9.evaluate(RandomizedRunner.java:982)
	at com.carrotsearch.randomizedtesting.RandomizedRunner$10.evaluate(RandomizedRunner.java:996)
	at com.carrotsearch.randomizedtesting.rules.SystemPropertiesRestoreRule$1.evaluate(SystemPropertiesRestoreRule.java:80)
	at org.junit.rules.RunRules.evaluate(RunRules.java:20)
	at org.apache.lucene.tests.util.TestRuleSetupTeardownChained$1.evaluate(TestRuleSetupTeardownChained.java:44)
	at org.apache.lucene.tests.util.AbstractBeforeAfterRule$1.evaluate(AbstractBeforeAfterRule.java:43)
	at org.apache.lucene.tests.util.TestRuleThreadAndTestName$1.evaluate(TestRuleThreadAndTestName.java:45)
	at org.apache.lucene.tests.util.TestRuleIgnoreAfterMaxFailures$1.evaluate(TestRuleIgnoreAfterMaxFailures.java:60)
	at org.apache.lucene.tests.util.TestRuleMarkFailure$1.evaluate(TestRuleMarkFailure.java:44)
	at org.junit.rules.RunRules.evaluate(RunRules.java:20)
	at com.carrotsearch.randomizedtesting.rules.StatementAdapter.evaluate(StatementAdapter.java:36)
	at com.carrotsearch.randomizedtesting.ThreadLeakControl$StatementRunner.run(ThreadLeakControl.java:390)
	at com.carrotsearch.randomizedtesting.ThreadLeakControl.forkTimeoutingTask(ThreadLeakControl.java:843)
	at com.carrotsearch.randomizedtesting.ThreadLeakControl$3.evaluate(ThreadLeakControl.java:490)
	at com.carrotsearch.randomizedtesting.RandomizedRunner.runSingleTest(RandomizedRunner.java:955)
	at com.carrotsearch.randomizedtesting.RandomizedRunner$5.evaluate(RandomizedRunner.java:840)
	at com.carrotsearch.randomizedtesting.RandomizedRunner$6.evaluate(RandomizedRunner.java:891)
	at com.carrotsearch.randomizedtesting.RandomizedRunner$7.evaluate(RandomizedRunner.java:902)
	at com.carrotsearch.randomizedtesting.rules.StatementAdapter.evaluate(StatementAdapter.java:36)
	at org.apache.lucene.tests.util.AbstractBeforeAfterRule$1.evaluate(AbstractBeforeAfterRule.java:43)
	at org.apache.lucene.tests.util.AbstractBeforeAfterRule$1.evaluate(AbstractBeforeAfterRule.java:43)
	at com.carrotsearch.randomizedtesting.rules.SystemPropertiesRestoreRule$1.evaluate(SystemPropertiesRestoreRule.java:80)
	at org.junit.rules.RunRules.evaluate(RunRules.java:20)
	at org.apache.lucene.tests.util.AbstractBeforeAfterRule$1.evaluate(AbstractBeforeAfterRule.java:43)
	at com.carrotsearch.randomizedtesting.rules.StatementAdapter.evaluate(StatementAdapter.java:36)
	at org.apache.lucene.tests.util.TestRuleStoreClassName$1.evaluate(TestRuleStoreClassName.java:38)
	at com.carrotsearch.randomizedtesting.rules.NoShadowingOrOverridesOnMethodsRule$1.evaluate(NoShadowingOrOverridesOnMethodsRule.java:40)
	at com.carrotsearch.randomizedtesting.rules.NoShadowingOrOverridesOnMethodsRule$1.evaluate(NoShadowingOrOverridesOnMethodsRule.java:40)
	at com.carrotsearch.randomizedtesting.rules.StatementAdapter.evaluate(StatementAdapter.java:36)
	at com.carrotsearch.randomizedtesting.rules.StatementAdapter.evaluate(StatementAdapter.java:36)
	at org.apache.lucene.tests.util.TestRuleAssertionsRequired$1.evaluate(TestRuleAssertionsRequired.java:53)
	at org.apache.lucene.tests.util.AbstractBeforeAfterRule$1.evaluate(AbstractBeforeAfterRule.java:43)
	at org.apache.lucene.tests.util.TestRuleMarkFailure$1.evaluate(TestRuleMarkFailure.java:44)
	at org.apache.lucene.tests.util.TestRuleIgnoreAfterMaxFailures$1.evaluate(TestRuleIgnoreAfterMaxFailures.java:60)
	at org.apache.lucene.tests.util.TestRuleIgnoreTestSuites$1.evaluate(TestRuleIgnoreTestSuites.java:47)
	at org.junit.rules.RunRules.evaluate(RunRules.java:20)
	at com.carrotsearch.randomizedtesting.rules.StatementAdapter.evaluate(StatementAdapter.java:36)
	at com.carrotsearch.randomizedtesting.ThreadLeakControl$StatementRunner.run(ThreadLeakControl.java:390)
	at com.carrotsearch.randomizedtesting.ThreadLeakControl.lambda$forkTimeoutingTask$0(ThreadLeakControl.java:850)
	at java.base/java.lang.Thread.run(Thread.java:829)


FAILED:  org.apache.solr.cloud.HttpPartitionOnCommitTest.test

Error Message:
org.apache.solr.client.solrj.impl.BaseHttpSolrClient$RemoteSolrException: Error from server at http://127.0.0.1:34507: Underlying core creation failed while creating collection: c8n_2x2_commits

Stack Trace:
org.apache.solr.client.solrj.impl.BaseHttpSolrClient$RemoteSolrException: Error from server at http://127.0.0.1:34507: Underlying core creation failed while creating collection: c8n_2x2_commits
	at __randomizedtesting.SeedInfo.seed([ABAD781DB7EF6349:23F947C719130EB1]:0)
	at app//org.apache.solr.client.solrj.impl.HttpSolrClient.executeMethod(HttpSolrClient.java:720)
	at app//org.apache.solr.client.solrj.impl.HttpSolrClient.request(HttpSolrClient.java:234)
	at app//org.apache.solr.client.solrj.impl.HttpSolrClient.request(HttpSolrClient.java:215)
	at app//org.apache.solr.client.solrj.SolrClient.request(SolrClient.java:1193)
	at app//org.apache.solr.cloud.AbstractBasicDistributedZkTestBase.createCollection(AbstractBasicDistributedZkTestBase.java:1172)
	at app//org.apache.solr.cloud.AbstractFullDistribZkTestBase.createCollection(AbstractFullDistribZkTestBase.java:2013)
	at app//org.apache.solr.cloud.HttpPartitionOnCommitTest.multiShardTest(HttpPartitionOnCommitTest.java:76)
	at app//org.apache.solr.cloud.HttpPartitionOnCommitTest.test(HttpPartitionOnCommitTest.java:67)
	at java.base@11.0.16/jdk.internal.reflect.NativeMethodAccessorImpl.invoke0(Native Method)
	at java.base@11.0.16/jdk.internal.reflect.NativeMethodAccessorImpl.invoke(NativeMethodAccessorImpl.java:62)
	at java.base@11.0.16/jdk.internal.reflect.DelegatingMethodAccessorImpl.invoke(DelegatingMethodAccessorImpl.java:43)
	at java.base@11.0.16/java.lang.reflect.Method.invoke(Method.java:566)
	at app//com.carrotsearch.randomizedtesting.RandomizedRunner.invoke(RandomizedRunner.java:1758)
	at app//com.carrotsearch.randomizedtesting.RandomizedRunner$8.evaluate(RandomizedRunner.java:946)
	at app//com.carrotsearch.randomizedtesting.RandomizedRunner$9.evaluate(RandomizedRunner.java:982)
	at app//com.carrotsearch.randomizedtesting.RandomizedRunner$10.evaluate(RandomizedRunner.java:996)
	at app//org.apache.solr.BaseDistributedSearchTestCase$ShardsRepeatRule$ShardsFixedStatement.callStatement(BaseDistributedSearchTestCase.java:1166)
	at app//org.apache.solr.BaseDistributedSearchTestCase$ShardsRepeatRule$ShardsStatement.evaluate(BaseDistributedSearchTestCase.java:1137)
	at app//com.carrotsearch.randomizedtesting.rules.SystemPropertiesRestoreRule$1.evaluate(SystemPropertiesRestoreRule.java:80)
	at app//org.junit.rules.RunRules.evaluate(RunRules.java:20)
	at app//org.apache.lucene.tests.util.TestRuleSetupTeardownChained$1.evaluate(TestRuleSetupTeardownChained.java:44)
	at app//org.apache.lucene.tests.util.AbstractBeforeAfterRule$1.evaluate(AbstractBeforeAfterRule.java:43)
	at app//org.apache.lucene.tests.util.TestRuleThreadAndTestName$1.evaluate(TestRuleThreadAndTestName.java:45)
	at app//org.apache.lucene.tests.util.TestRuleIgnoreAfterMaxFailures$1.evaluate(TestRuleIgnoreAfterMaxFailures.java:60)
	at app//org.apache.lucene.tests.util.TestRuleMarkFailure$1.evaluate(TestRuleMarkFailure.java:44)
	at app//org.junit.rules.RunRules.evaluate(RunRules.java:20)
	at app//com.carrotsearch.randomizedtesting.rules.StatementAdapter.evaluate(StatementAdapter.java:36)
	at app//com.carrotsearch.randomizedtesting.ThreadLeakControl$StatementRunner.run(ThreadLeakControl.java:390)
	at app//com.carrotsearch.randomizedtesting.ThreadLeakControl.forkTimeoutingTask(ThreadLeakControl.java:843)
	at app//com.carrotsearch.randomizedtesting.ThreadLeakControl$3.evaluate(ThreadLeakControl.java:490)
	at app//com.carrotsearch.randomizedtesting.RandomizedRunner.runSingleTest(RandomizedRunner.java:955)
	at app//com.carrotsearch.randomizedtesting.RandomizedRunner$5.evaluate(RandomizedRunner.java:840)
	at app//com.carrotsearch.randomizedtesting.RandomizedRunner$6.evaluate(RandomizedRunner.java:891)
	at app//com.carrotsearch.randomizedtesting.RandomizedRunner$7.evaluate(RandomizedRunner.java:902)
	at app//com.carrotsearch.randomizedtesting.rules.StatementAdapter.evaluate(StatementAdapter.java:36)
	at app//org.apache.lucene.tests.util.AbstractBeforeAfterRule$1.evaluate(AbstractBeforeAfterRule.java:43)
	at app//org.apache.lucene.tests.util.AbstractBeforeAfterRule$1.evaluate(AbstractBeforeAfterRule.java:43)
	at app//com.carrotsearch.randomizedtesting.rules.SystemPropertiesRestoreRule$1.evaluate(SystemPropertiesRestoreRule.java:80)
	at app//org.junit.rules.RunRules.evaluate(RunRules.java:20)
	at app//org.apache.lucene.tests.util.AbstractBeforeAfterRule$1.evaluate(AbstractBeforeAfterRule.java:43)
	at app//com.carrotsearch.randomizedtesting.rules.StatementAdapter.evaluate(StatementAdapter.java:36)
	at app//org.apache.lucene.tests.util.TestRuleStoreClassName$1.evaluate(TestRuleStoreClassName.java:38)
	at app//com.carrotsearch.randomizedtesting.rules.NoShadowingOrOverridesOnMethodsRule$1.evaluate(NoShadowingOrOverridesOnMethodsRule.java:40)
	at app//com.carrotsearch.randomizedtesting.rules.NoShadowingOrOverridesOnMethodsRule$1.evaluate(NoShadowingOrOverridesOnMethodsRule.java:40)
	at app//com.carrotsearch.randomizedtesting.rules.StatementAdapter.evaluate(StatementAdapter.java:36)
	at app//com.carrotsearch.randomizedtesting.rules.StatementAdapter.evaluate(StatementAdapter.java:36)
	at app//org.apache.lucene.tests.util.TestRuleAssertionsRequired$1.evaluate(TestRuleAssertionsRequired.java:53)
	at app//org.apache.lucene.tests.util.AbstractBeforeAfterRule$1.evaluate(AbstractBeforeAfterRule.java:43)
	at app//org.apache.lucene.tests.util.TestRuleMarkFailure$1.evaluate(TestRuleMarkFailure.java:44)
	at app//org.apache.lucene.tests.util.TestRuleIgnoreAfterMaxFailures$1.evaluate(TestRuleIgnoreAfterMaxFailures.java:60)
	at app//org.apache.lucene.tests.util.TestRuleIgnoreTestSuites$1.evaluate(TestRuleIgnoreTestSuites.java:47)
	at app//org.junit.rules.RunRules.evaluate(RunRules.java:20)
	at app//com.carrotsearch.randomizedtesting.rules.StatementAdapter.evaluate(StatementAdapter.java:36)
	at app//com.carrotsearch.randomizedtesting.ThreadLeakControl$StatementRunner.run(ThreadLeakControl.java:390)
	at app//com.carrotsearch.randomizedtesting.ThreadLeakControl.lambda$forkTimeoutingTask$0(ThreadLeakControl.java:850)
	at java.base@11.0.16/java.lang.Thread.run(Thread.java:829)


FAILED:  org.apache.solr.schema.TestBulkSchemaConcurrent.test

Error Message:
java.lang.AssertionError: [[field a1 not created, new type mystr1  not created, CopyField source=a1,dest=hello_lol1 not created, dynamic field *_lol1 not created], []]

Stack Trace:
java.lang.AssertionError: [[field a1 not created, new type mystr1  not created, CopyField source=a1,dest=hello_lol1 not created, dynamic field *_lol1 not created], []]
	at __randomizedtesting.SeedInfo.seed([ABAD781DB7EF6349:23F947C719130EB1]:0)
	at org.junit.Assert.fail(Assert.java:89)
	at org.junit.Assert.assertTrue(Assert.java:42)
	at org.apache.solr.schema.TestBulkSchemaConcurrent.test(TestBulkSchemaConcurrent.java:122)
	at java.base/jdk.internal.reflect.NativeMethodAccessorImpl.invoke0(Native Method)
	at java.base/jdk.internal.reflect.NativeMethodAccessorImpl.invoke(NativeMethodAccessorImpl.java:62)
	at java.base/jdk.internal.reflect.DelegatingMethodAccessorImpl.invoke(DelegatingMethodAccessorImpl.java:43)
	at java.base/java.lang.reflect.Method.invoke(Method.java:566)
	at com.carrotsearch.randomizedtesting.RandomizedRunner.invoke(RandomizedRunner.java:1758)
	at com.carrotsearch.randomizedtesting.RandomizedRunner$8.evaluate(RandomizedRunner.java:946)
	at com.carrotsearch.randomizedtesting.RandomizedRunner$9.evaluate(RandomizedRunner.java:982)
	at com.carrotsearch.randomizedtesting.RandomizedRunner$10.evaluate(RandomizedRunner.java:996)
	at org.apache.solr.BaseDistributedSearchTestCase$ShardsRepeatRule$ShardsFixedStatement.callStatement(BaseDistributedSearchTestCase.java:1166)
	at org.apache.solr.BaseDistributedSearchTestCase$ShardsRepeatRule$ShardsStatement.evaluate(BaseDistributedSearchTestCase.java:1137)
	at com.carrotsearch.randomizedtesting.rules.SystemPropertiesRestoreRule$1.evaluate(SystemPropertiesRestoreRule.java:80)
	at org.junit.rules.RunRules.evaluate(RunRules.java:20)
	at org.apache.lucene.tests.util.TestRuleSetupTeardownChained$1.evaluate(TestRuleSetupTeardownChained.java:44)
	at org.apache.lucene.tests.util.AbstractBeforeAfterRule$1.evaluate(AbstractBeforeAfterRule.java:43)
	at org.apache.lucene.tests.util.TestRuleThreadAndTestName$1.evaluate(TestRuleThreadAndTestName.java:45)
	at org.apache.lucene.tests.util.TestRuleIgnoreAfterMaxFailures$1.evaluate(TestRuleIgnoreAfterMaxFailures.java:60)
	at org.apache.lucene.tests.util.TestRuleMarkFailure$1.evaluate(TestRuleMarkFailure.java:44)
	at org.junit.rules.RunRules.evaluate(RunRules.java:20)
	at com.carrotsearch.randomizedtesting.rules.StatementAdapter.evaluate(StatementAdapter.java:36)
	at com.carrotsearch.randomizedtesting.ThreadLeakControl$StatementRunner.run(ThreadLeakControl.java:390)
	at com.carrotsearch.randomizedtesting.ThreadLeakControl.forkTimeoutingTask(ThreadLeakControl.java:843)
	at com.carrotsearch.randomizedtesting.ThreadLeakControl$3.evaluate(ThreadLeakControl.java:490)
	at com.carrotsearch.randomizedtesting.RandomizedRunner.runSingleTest(RandomizedRunner.java:955)
	at com.carrotsearch.randomizedtesting.RandomizedRunner$5.evaluate(RandomizedRunner.java:840)
	at com.carrotsearch.randomizedtesting.RandomizedRunner$6.evaluate(RandomizedRunner.java:891)
	at com.carrotsearch.randomizedtesting.RandomizedRunner$7.evaluate(RandomizedRunner.java:902)
	at com.carrotsearch.randomizedtesting.rules.StatementAdapter.evaluate(StatementAdapter.java:36)
	at org.apache.lucene.tests.util.AbstractBeforeAfterRule$1.evaluate(AbstractBeforeAfterRule.java:43)
	at org.apache.lucene.tests.util.AbstractBeforeAfterRule$1.evaluate(AbstractBeforeAfterRule.java:43)
	at com.carrotsearch.randomizedtesting.rules.SystemPropertiesRestoreRule$1.evaluate(SystemPropertiesRestoreRule.java:80)
	at org.junit.rules.RunRules.evaluate(RunRules.java:20)
	at org.apache.lucene.tests.util.AbstractBeforeAfterRule$1.evaluate(AbstractBeforeAfterRule.java:43)
	at com.carrotsearch.randomizedtesting.rules.StatementAdapter.evaluate(StatementAdapter.java:36)
	at org.apache.lucene.tests.util.TestRuleStoreClassName$1.evaluate(TestRuleStoreClassName.java:38)
	at com.carrotsearch.randomizedtesting.rules.NoShadowingOrOverridesOnMethodsRule$1.evaluate(NoShadowingOrOverridesOnMethodsRule.java:40)
	at com.carrotsearch.randomizedtesting.rules.NoShadowingOrOverridesOnMethodsRule$1.evaluate(NoShadowingOrOverridesOnMethodsRule.java:40)
	at com.carrotsearch.randomizedtesting.rules.StatementAdapter.evaluate(StatementAdapter.java:36)
	at com.carrotsearch.randomizedtesting.rules.StatementAdapter.evaluate(StatementAdapter.java:36)
	at org.apache.lucene.tests.util.TestRuleAssertionsRequired$1.evaluate(TestRuleAssertionsRequired.java:53)
	at org.apache.lucene.tests.util.AbstractBeforeAfterRule$1.evaluate(AbstractBeforeAfterRule.java:43)
	at org.apache.lucene.tests.util.TestRuleMarkFailure$1.evaluate(TestRuleMarkFailure.java:44)
	at org.apache.lucene.tests.util.TestRuleIgnoreAfterMaxFailures$1.evaluate(TestRuleIgnoreAfterMaxFailures.java:60)
	at org.apache.lucene.tests.util.TestRuleIgnoreTestSuites$1.evaluate(TestRuleIgnoreTestSuites.java:47)
	at org.junit.rules.RunRules.evaluate(RunRules.java:20)
	at com.carrotsearch.randomizedtesting.rules.StatementAdapter.evaluate(StatementAdapter.java:36)
	at com.carrotsearch.randomizedtesting.ThreadLeakControl$StatementRunner.run(ThreadLeakControl.java:390)
	at com.carrotsearch.randomizedtesting.ThreadLeakControl.lambda$forkTimeoutingTask$0(ThreadLeakControl.java:850)
	at java.base/java.lang.Thread.run(Thread.java:829)




Build Log:
[...truncated 10140 lines...]
ERROR: The following test(s) have failed:
  - org.apache.solr.ltr.TestLTRQParserExplain.interleavingModelsWithOriginalRanking_shouldReturnExplainForTheModelPicked (:solr:modules:ltr)
    Test output: /home/jenkins/jenkins-home/712657a4/workspace/Solr/Solr-Check-main-s390x/solr/modules/ltr/build/test-results/test/outputs/OUTPUT-org.apache.solr.ltr.TestLTRQParserExplain.txt
    Reproduce with: gradlew :solr:modules:ltr:test --tests "org.apache.solr.ltr.TestLTRQParserExplain.interleavingModelsWithOriginalRanking_shouldReturnExplainForTheModelPicked" -Ptests.jvms=4 -Ptests.haltonfailure=false "-Ptests.jvmargs=-XX:TieredStopAtLevel=1 -XX:ReservedCodeCacheSize=120m" -Ptests.seed=ABAD781DB7EF6349 -Ptests.multiplier=2 -Ptests.badapples=false -Ptests.file.encoding=UTF-8

  - org.apache.solr.cloud.HttpPartitionOnCommitTest.test (:solr:core)
    Test output: /home/jenkins/jenkins-home/712657a4/workspace/Solr/Solr-Check-main-s390x/solr/core/build/test-results/test/outputs/OUTPUT-org.apache.solr.cloud.HttpPartitionOnCommitTest.txt
    Reproduce with: gradlew :solr:core:test --tests "org.apache.solr.cloud.HttpPartitionOnCommitTest.test" -Ptests.jvms=4 -Ptests.haltonfailure=false "-Ptests.jvmargs=-XX:TieredStopAtLevel=1 -XX:ReservedCodeCacheSize=120m" -Ptests.seed=ABAD781DB7EF6349 -Ptests.multiplier=2 -Ptests.badapples=false -Ptests.file.encoding=UTF-8

  - org.apache.solr.cloud.ReplaceNodeTest.testGoodSpreadDuringAssignWithNoTarget (:solr:core)
    Test output: /home/jenkins/jenkins-home/712657a4/workspace/Solr/Solr-Check-main-s390x/solr/core/build/test-results/test/outputs/OUTPUT-org.apache.solr.cloud.ReplaceNodeTest.txt
    Reproduce with: gradlew :solr:core:test --tests "org.apache.solr.cloud.ReplaceNodeTest.testGoodSpreadDuringAssignWithNoTarget" -Ptests.jvms=4 -Ptests.haltonfailure=false "-Ptests.jvmargs=-XX:TieredStopAtLevel=1 -XX:ReservedCodeCacheSize=120m" -Ptests.seed=ABAD781DB7EF6349 -Ptests.multiplier=2 -Ptests.badapples=false -Ptests.file.encoding=UTF-8

  - org.apache.solr.metrics.reporters.SolrJmxReporterTest.testClosedCore (:solr:core)
    Test output: /home/jenkins/jenkins-home/712657a4/workspace/Solr/Solr-Check-main-s390x/solr/core/build/test-results/test/outputs/OUTPUT-org.apache.solr.metrics.reporters.SolrJmxReporterTest.txt
    Reproduce with: gradlew :solr:core:test --tests "org.apache.solr.metrics.reporters.SolrJmxReporterTest.testClosedCore" -Ptests.jvms=4 -Ptests.haltonfailure=false "-Ptests.jvmargs=-XX:TieredStopAtLevel=1 -XX:ReservedCodeCacheSize=120m" -Ptests.seed=ABAD781DB7EF6349 -Ptests.multiplier=2 -Ptests.badapples=false -Ptests.file.encoding=UTF-8

  - org.apache.solr.schema.TestBulkSchemaConcurrent.test (:solr:core)
    Test output: /home/jenkins/jenkins-home/712657a4/workspace/Solr/Solr-Check-main-s390x/solr/core/build/test-results/test/outputs/OUTPUT-org.apache.solr.schema.TestBulkSchemaConcurrent.txt
    Reproduce with: gradlew :solr:core:test --tests "org.apache.solr.schema.TestBulkSchemaConcurrent.test" -Ptests.jvms=4 -Ptests.haltonfailure=false "-Ptests.jvmargs=-XX:TieredStopAtLevel=1 -XX:ReservedCodeCacheSize=120m" -Ptests.seed=ABAD781DB7EF6349 -Ptests.multiplier=2 -Ptests.badapples=false -Ptests.file.encoding=UTF-8


Deprecated Gradle features were used in this build, making it incompatible with Gradle 8.0.

You can use '--warning-mode all' to show the individual deprecation warnings and determine if they come from your own scripts or plugins.

See https://docs.gradle.org/7.5.1/userguide/command_line_interface.html#sec:command_line_warnings

BUILD SUCCESSFUL in 2h 46m 3s
609 actionable tasks: 609 executed
Build step 'Invoke Gradle script' changed build result to SUCCESS
Archiving artifacts
hudson.FilePath$ValidateAntFileMask$1Cancel
	at hudson.FilePath$ValidateAntFileMask$1.isCaseSensitive(FilePath.java:3209)
	at org.apache.tools.ant.DirectoryScanner.isIncluded(DirectoryScanner.java:1370)
	at org.apache.tools.ant.DirectoryScanner.scandir(DirectoryScanner.java:1260)
	at org.apache.tools.ant.DirectoryScanner.scandir(DirectoryScanner.java:1267)
	at org.apache.tools.ant.DirectoryScanner.scandir(DirectoryScanner.java:1267)
	at org.apache.tools.ant.DirectoryScanner.scandir(DirectoryScanner.java:1267)
	at org.apache.tools.ant.DirectoryScanner.scandir(DirectoryScanner.java:1267)
	at org.apache.tools.ant.DirectoryScanner.scandir(DirectoryScanner.java:1267)
	at org.apache.tools.ant.DirectoryScanner.scandir(DirectoryScanner.java:1267)
	at org.apache.tools.ant.DirectoryScanner.scandir(DirectoryScanner.java:1267)
	at org.apache.tools.ant.DirectoryScanner.scandir(DirectoryScanner.java:1267)
	at org.apache.tools.ant.DirectoryScanner.scandir(DirectoryScanner.java:1194)
	at org.apache.tools.ant.DirectoryScanner.scandir(DirectoryScanner.java:1156)
	at org.apache.tools.ant.DirectoryScanner.checkIncludePatterns(DirectoryScanner.java:954)
	at org.apache.tools.ant.DirectoryScanner.scan(DirectoryScanner.java:912)
	at hudson.FilePath$ValidateAntFileMask.hasMatch(FilePath.java:3222)
Caused: java.lang.InterruptedException: no matches found within 10000
	at hudson.FilePath$ValidateAntFileMask.hasMatch(FilePath.java:3227)
	at hudson.FilePath$ValidateAntFileMask.invoke(FilePath.java:3105)
	at hudson.FilePath$ValidateAntFileMask.invoke(FilePath.java:3083)
	at hudson.FilePath$FileCallableWrapper.call(FilePath.java:3487)
Also:   hudson.remoting.Channel$CallSiteStackTrace: Remote call to jenkins-s390x-2
		at hudson.remoting.Channel.attachCallSiteStackTrace(Channel.java:1784)
		at hudson.remoting.UserRequest$ExceptionResponse.retrieve(UserRequest.java:356)
		at hudson.remoting.Channel.call(Channel.java:1000)
		at hudson.FilePath.act(FilePath.java:1194)
		at hudson.FilePath.act(FilePath.java:1183)
		at hudson.FilePath.validateAntFileMask(FilePath.java:3080)
		at hudson.tasks.ArtifactArchiver.perform(ArtifactArchiver.java:269)
		at hudson.tasks.BuildStepCompatibilityLayer.perform(BuildStepCompatibilityLayer.java:79)
		at hudson.tasks.BuildStepMonitor$1.perform(BuildStepMonitor.java:20)
		at hudson.model.AbstractBuild$AbstractBuildExecution.perform(AbstractBuild.java:814)
		at hudson.model.AbstractBuild$AbstractBuildExecution.performAllBuildSteps(AbstractBuild.java:763)
		at hudson.model.Build$BuildExecution.post2(Build.java:179)
		at hudson.model.AbstractBuild$AbstractBuildExecution.post(AbstractBuild.java:707)
		at hudson.model.Run.execute(Run.java:1921)
		at hudson.model.FreeStyleBuild.run(FreeStyleBuild.java:44)
		at hudson.model.ResourceController.execute(ResourceController.java:101)
		at hudson.model.Executor.run(Executor.java:442)
Caused: hudson.FilePath$TunneledInterruptedException
	at hudson.FilePath$FileCallableWrapper.call(FilePath.java:3489)
	at hudson.remoting.UserRequest.perform(UserRequest.java:211)
	at hudson.remoting.UserRequest.perform(UserRequest.java:54)
	at hudson.remoting.Request$2.run(Request.java:376)
	at hudson.remoting.InterceptingExecutorService.lambda$wrap$0(InterceptingExecutorService.java:78)
	at java.base/java.util.concurrent.FutureTask.run(FutureTask.java:264)
	at java.base/java.util.concurrent.ThreadPoolExecutor.runWorker(ThreadPoolExecutor.java:1128)
	at java.base/java.util.concurrent.ThreadPoolExecutor$Worker.run(ThreadPoolExecutor.java:628)
	at java.base/java.lang.Thread.run(Thread.java:829)
Caused: java.lang.InterruptedException: java.lang.InterruptedException: no matches found within 10000
	at hudson.FilePath.act(FilePath.java:1196)
	at hudson.FilePath.act(FilePath.java:1183)
	at hudson.FilePath.validateAntFileMask(FilePath.java:3080)
	at hudson.tasks.ArtifactArchiver.perform(ArtifactArchiver.java:269)
	at hudson.tasks.BuildStepCompatibilityLayer.perform(BuildStepCompatibilityLayer.java:79)
	at hudson.tasks.BuildStepMonitor$1.perform(BuildStepMonitor.java:20)
	at hudson.model.AbstractBuild$AbstractBuildExecution.perform(AbstractBuild.java:814)
	at hudson.model.AbstractBuild$AbstractBuildExecution.performAllBuildSteps(AbstractBuild.java:763)
	at hudson.model.Build$BuildExecution.post2(Build.java:179)
	at hudson.model.AbstractBuild$AbstractBuildExecution.post(AbstractBuild.java:707)
	at hudson.model.Run.execute(Run.java:1921)
	at hudson.model.FreeStyleBuild.run(FreeStyleBuild.java:44)
	at hudson.model.ResourceController.execute(ResourceController.java:101)
	at hudson.model.Executor.run(Executor.java:442)
No artifacts found that match the file pattern "**/*.events,heapdumps/**,**/hs_err_pid*". Configuration error?
Recording test results
[Checks API] No suitable checks publisher found.
Build step 'Publish JUnit test result report' changed build result to UNSTABLE
Email was triggered for: Unstable (Test Failures)
Sending email for trigger: Unstable (Test Failures)