You are viewing a plain text version of this content. The canonical link for it is here.
Posted to builds@solr.apache.org by Policeman Jenkins Server via builds <bu...@solr.apache.org> on 2026/04/10 15:50:34 UTC
[JENKINS] Solr-main-Linux (64bit/hotspot/jdk-23.0.2) - Build # 32733 - Unstable!
Build: https://jenkins.thetaphi.de/job/Solr-main-Linux/32733/
Java: 64bit/hotspot/jdk-23.0.2 -XX:+UseCompressedOops -XX:+UseParallelGC
2 tests failed.
FAILED: org.apache.solr.cloud.BasicDistributedZkTest.test
Error Message:
java.lang.RuntimeException: Timeout waiting for pool org.apache.solr.common.util.ExecutorUtil$MDCAwareThreadPoolExecutor@6c0265e[Shutting down, pool size = 1, active threads = 1, queued tasks = 0, completed tasks = 9] to shutdown.
Stack Trace:
java.lang.RuntimeException: Timeout waiting for pool org.apache.solr.common.util.ExecutorUtil$MDCAwareThreadPoolExecutor@6c0265e[Shutting down, pool size = 1, active threads = 1, queued tasks = 0, completed tasks = 9] to shutdown.
at __randomizedtesting.SeedInfo.seed([77911F550FCF77A7:FFC5208FA1331A5F]:0)
at org.apache.solr.common.util.ExecutorUtil.awaitTermination(ExecutorUtil.java:166)
at org.apache.solr.common.util.ExecutorUtil.awaitTermination(ExecutorUtil.java:153)
at org.apache.solr.common.util.ExecutorUtil.shutdownAndAwaitTermination(ExecutorUtil.java:119)
at org.apache.solr.BaseDistributedSearchTestCase.destroyServers(BaseDistributedSearchTestCase.java:370)
at org.apache.solr.cloud.AbstractFullDistribZkTestBase.destroyServers(AbstractFullDistribZkTestBase.java:2269)
at org.apache.solr.BaseDistributedSearchTestCase$ShardsRepeatRule$ShardsFixedStatement.callStatement(BaseDistributedSearchTestCase.java:1064)
at org.apache.solr.BaseDistributedSearchTestCase$ShardsRepeatRule$ShardsStatement.evaluate(BaseDistributedSearchTestCase.java:1033)
at com.carrotsearch.randomizedtesting.rules.SystemPropertiesRestoreRule$1.evaluate(SystemPropertiesRestoreRule.java:80)
at org.junit.rules.RunRules.evaluate(RunRules.java:20)
at org.apache.lucene.tests.util.TestRuleSetupTeardownChained$1.evaluate(TestRuleSetupTeardownChained.java:48)
at org.apache.lucene.tests.util.AbstractBeforeAfterRule$1.evaluate(AbstractBeforeAfterRule.java:43)
at org.apache.lucene.tests.util.TestRuleThreadAndTestName$1.evaluate(TestRuleThreadAndTestName.java:45)
at org.apache.lucene.tests.util.TestRuleIgnoreAfterMaxFailures$1.evaluate(TestRuleIgnoreAfterMaxFailures.java:60)
at org.apache.lucene.tests.util.TestRuleMarkFailure$1.evaluate(TestRuleMarkFailure.java:44)
at org.junit.rules.RunRules.evaluate(RunRules.java:20)
at com.carrotsearch.randomizedtesting.rules.StatementAdapter.evaluate(StatementAdapter.java:36)
at com.carrotsearch.randomizedtesting.ThreadLeakControl$StatementRunner.run(ThreadLeakControl.java:390)
at com.carrotsearch.randomizedtesting.ThreadLeakControl.forkTimeoutingTask(ThreadLeakControl.java:843)
at com.carrotsearch.randomizedtesting.ThreadLeakControl$3.evaluate(ThreadLeakControl.java:490)
at com.carrotsearch.randomizedtesting.RandomizedRunner.runSingleTest(RandomizedRunner.java:955)
at com.carrotsearch.randomizedtesting.RandomizedRunner$5.evaluate(RandomizedRunner.java:840)
at com.carrotsearch.randomizedtesting.RandomizedRunner$6.evaluate(RandomizedRunner.java:891)
at com.carrotsearch.randomizedtesting.RandomizedRunner$7.evaluate(RandomizedRunner.java:902)
at com.carrotsearch.randomizedtesting.rules.StatementAdapter.evaluate(StatementAdapter.java:36)
at com.carrotsearch.randomizedtesting.rules.StatementAdapter.evaluate(StatementAdapter.java:36)
at org.apache.lucene.tests.util.AbstractBeforeAfterRule$1.evaluate(AbstractBeforeAfterRule.java:43)
at com.carrotsearch.randomizedtesting.rules.SystemPropertiesRestoreRule$1.evaluate(SystemPropertiesRestoreRule.java:80)
at org.junit.rules.RunRules.evaluate(RunRules.java:20)
at org.apache.lucene.tests.util.AbstractBeforeAfterRule$1.evaluate(AbstractBeforeAfterRule.java:43)
at com.carrotsearch.randomizedtesting.rules.StatementAdapter.evaluate(StatementAdapter.java:36)
at org.apache.lucene.tests.util.TestRuleStoreClassName$1.evaluate(TestRuleStoreClassName.java:38)
at com.carrotsearch.randomizedtesting.rules.NoShadowingOrOverridesOnMethodsRule$1.evaluate(NoShadowingOrOverridesOnMethodsRule.java:40)
at com.carrotsearch.randomizedtesting.rules.NoShadowingOrOverridesOnMethodsRule$1.evaluate(NoShadowingOrOverridesOnMethodsRule.java:40)
at com.carrotsearch.randomizedtesting.rules.StatementAdapter.evaluate(StatementAdapter.java:36)
at com.carrotsearch.randomizedtesting.rules.StatementAdapter.evaluate(StatementAdapter.java:36)
at org.apache.lucene.tests.util.TestRuleAssertionsRequired$1.evaluate(TestRuleAssertionsRequired.java:53)
at org.apache.lucene.tests.util.AbstractBeforeAfterRule$1.evaluate(AbstractBeforeAfterRule.java:43)
at org.apache.lucene.tests.util.TestRuleMarkFailure$1.evaluate(TestRuleMarkFailure.java:44)
at org.apache.lucene.tests.util.TestRuleIgnoreAfterMaxFailures$1.evaluate(TestRuleIgnoreAfterMaxFailures.java:60)
at org.apache.lucene.tests.util.TestRuleIgnoreTestSuites$1.evaluate(TestRuleIgnoreTestSuites.java:47)
at org.junit.rules.RunRules.evaluate(RunRules.java:20)
at com.carrotsearch.randomizedtesting.rules.StatementAdapter.evaluate(StatementAdapter.java:36)
at com.carrotsearch.randomizedtesting.ThreadLeakControl$StatementRunner.run(ThreadLeakControl.java:390)
at com.carrotsearch.randomizedtesting.ThreadLeakControl.lambda$forkTimeoutingTask$0(ThreadLeakControl.java:850)
at java.base/java.lang.Thread.run(Thread.java:1575)
FAILED: org.apache.solr.cloud.BasicDistributedZkTest.test
Error Message:
java.lang.RuntimeException: Timeout waiting for pool org.apache.solr.common.util.ExecutorUtil$MDCAwareThreadPoolExecutor@21565070[Shutting down, pool size = 1, active threads = 1, queued tasks = 0, completed tasks = 9] to shutdown.
Stack Trace:
java.lang.RuntimeException: Timeout waiting for pool org.apache.solr.common.util.ExecutorUtil$MDCAwareThreadPoolExecutor@21565070[Shutting down, pool size = 1, active threads = 1, queued tasks = 0, completed tasks = 9] to shutdown.
at __randomizedtesting.SeedInfo.seed([77911F550FCF77A7:FFC5208FA1331A5F]:0)
at org.apache.solr.common.util.ExecutorUtil.awaitTermination(ExecutorUtil.java:166)
at org.apache.solr.common.util.ExecutorUtil.awaitTermination(ExecutorUtil.java:153)
at org.apache.solr.common.util.ExecutorUtil.shutdownAndAwaitTermination(ExecutorUtil.java:119)
at org.apache.solr.BaseDistributedSearchTestCase.destroyServers(BaseDistributedSearchTestCase.java:370)
at org.apache.solr.cloud.AbstractFullDistribZkTestBase.destroyServers(AbstractFullDistribZkTestBase.java:2269)
at org.apache.solr.BaseDistributedSearchTestCase$ShardsRepeatRule$ShardsFixedStatement.callStatement(BaseDistributedSearchTestCase.java:1064)
at org.apache.solr.BaseDistributedSearchTestCase$ShardsRepeatRule$ShardsStatement.evaluate(BaseDistributedSearchTestCase.java:1033)
at com.carrotsearch.randomizedtesting.rules.SystemPropertiesRestoreRule$1.evaluate(SystemPropertiesRestoreRule.java:80)
at org.junit.rules.RunRules.evaluate(RunRules.java:20)
at org.apache.lucene.tests.util.TestRuleSetupTeardownChained$1.evaluate(TestRuleSetupTeardownChained.java:48)
at org.apache.lucene.tests.util.AbstractBeforeAfterRule$1.evaluate(AbstractBeforeAfterRule.java:43)
at org.apache.lucene.tests.util.TestRuleThreadAndTestName$1.evaluate(TestRuleThreadAndTestName.java:45)
at org.apache.lucene.tests.util.TestRuleIgnoreAfterMaxFailures$1.evaluate(TestRuleIgnoreAfterMaxFailures.java:60)
at org.apache.lucene.tests.util.TestRuleMarkFailure$1.evaluate(TestRuleMarkFailure.java:44)
at org.junit.rules.RunRules.evaluate(RunRules.java:20)
at com.carrotsearch.randomizedtesting.rules.StatementAdapter.evaluate(StatementAdapter.java:36)
at com.carrotsearch.randomizedtesting.ThreadLeakControl$StatementRunner.run(ThreadLeakControl.java:390)
at com.carrotsearch.randomizedtesting.ThreadLeakControl.forkTimeoutingTask(ThreadLeakControl.java:843)
at com.carrotsearch.randomizedtesting.ThreadLeakControl$3.evaluate(ThreadLeakControl.java:490)
at com.carrotsearch.randomizedtesting.RandomizedRunner.runSingleTest(RandomizedRunner.java:955)
at com.carrotsearch.randomizedtesting.RandomizedRunner$5.evaluate(RandomizedRunner.java:840)
at com.carrotsearch.randomizedtesting.RandomizedRunner$6.evaluate(RandomizedRunner.java:891)
at com.carrotsearch.randomizedtesting.RandomizedRunner$7.evaluate(RandomizedRunner.java:902)
at com.carrotsearch.randomizedtesting.rules.StatementAdapter.evaluate(StatementAdapter.java:36)
at com.carrotsearch.randomizedtesting.rules.StatementAdapter.evaluate(StatementAdapter.java:36)
at org.apache.lucene.tests.util.AbstractBeforeAfterRule$1.evaluate(AbstractBeforeAfterRule.java:43)
at com.carrotsearch.randomizedtesting.rules.SystemPropertiesRestoreRule$1.evaluate(SystemPropertiesRestoreRule.java:80)
at org.junit.rules.RunRules.evaluate(RunRules.java:20)
at org.apache.lucene.tests.util.AbstractBeforeAfterRule$1.evaluate(AbstractBeforeAfterRule.java:43)
at com.carrotsearch.randomizedtesting.rules.StatementAdapter.evaluate(StatementAdapter.java:36)
at org.apache.lucene.tests.util.TestRuleStoreClassName$1.evaluate(TestRuleStoreClassName.java:38)
at com.carrotsearch.randomizedtesting.rules.NoShadowingOrOverridesOnMethodsRule$1.evaluate(NoShadowingOrOverridesOnMethodsRule.java:40)
at com.carrotsearch.randomizedtesting.rules.NoShadowingOrOverridesOnMethodsRule$1.evaluate(NoShadowingOrOverridesOnMethodsRule.java:40)
at com.carrotsearch.randomizedtesting.rules.StatementAdapter.evaluate(StatementAdapter.java:36)
at com.carrotsearch.randomizedtesting.rules.StatementAdapter.evaluate(StatementAdapter.java:36)
at org.apache.lucene.tests.util.TestRuleAssertionsRequired$1.evaluate(TestRuleAssertionsRequired.java:53)
at org.apache.lucene.tests.util.AbstractBeforeAfterRule$1.evaluate(AbstractBeforeAfterRule.java:43)
at org.apache.lucene.tests.util.TestRuleMarkFailure$1.evaluate(TestRuleMarkFailure.java:44)
at org.apache.lucene.tests.util.TestRuleIgnoreAfterMaxFailures$1.evaluate(TestRuleIgnoreAfterMaxFailures.java:60)
at org.apache.lucene.tests.util.TestRuleIgnoreTestSuites$1.evaluate(TestRuleIgnoreTestSuites.java:47)
at org.junit.rules.RunRules.evaluate(RunRules.java:20)
at com.carrotsearch.randomizedtesting.rules.StatementAdapter.evaluate(StatementAdapter.java:36)
at com.carrotsearch.randomizedtesting.ThreadLeakControl$StatementRunner.run(ThreadLeakControl.java:390)
at com.carrotsearch.randomizedtesting.ThreadLeakControl.lambda$forkTimeoutingTask$0(ThreadLeakControl.java:850)
at java.base/java.lang.Thread.run(Thread.java:1575)
[JENKINS] Solr-main-Linux (64bit/hotspot/jdk-23.0.2) - Build # 32735 - Still Unstable!
Posted by Policeman Jenkins Server via builds <bu...@solr.apache.org>.
Build: https://jenkins.thetaphi.de/job/Solr-main-Linux/32735/
Java: 64bit/hotspot/jdk-23.0.2 -XX:-UseCompressedOops -XX:+UseSerialGC
6 tests failed.
FAILED: org.apache.solr.gcs.GCSIncrementalBackupTest.testSkipConfigset
Error Message:
org.apache.solr.common.SolrException: Could not find a healthy node to handle the request.
Stack Trace:
org.apache.solr.common.SolrException: Could not find a healthy node to handle the request.
at __randomizedtesting.SeedInfo.seed([E8C77A28B4F34F4F:E33EE5212CB11958]:0)
at app//org.apache.solr.client.solrj.impl.CloudSolrClient.sendRequest(CloudSolrClient.java:1590)
at app//org.apache.solr.client.solrj.impl.CloudSolrClient.requestWithRetryOnStaleState(CloudSolrClient.java:1232)
at app//org.apache.solr.client.solrj.impl.CloudSolrClient.requestWithRetryOnStaleState(CloudSolrClient.java:1417)
at app//org.apache.solr.client.solrj.impl.CloudSolrClient.requestWithRetryOnStaleState(CloudSolrClient.java:1417)
at app//org.apache.solr.client.solrj.impl.CloudSolrClient.requestWithRetryOnStaleState(CloudSolrClient.java:1417)
at app//org.apache.solr.client.solrj.impl.CloudSolrClient.requestWithRetryOnStaleState(CloudSolrClient.java:1408)
at app//org.apache.solr.client.solrj.impl.CloudSolrClient.requestWithRetryOnStaleState(CloudSolrClient.java:1393)
at app//org.apache.solr.client.solrj.impl.CloudSolrClient.request(CloudSolrClient.java:1154)
at app//org.apache.solr.client.solrj.SolrRequest.process(SolrRequest.java:302)
at app//org.apache.solr.client.solrj.SolrClient.query(SolrClient.java:928)
at app//org.apache.solr.cloud.api.collections.AbstractIncrementalBackupTest.testSkipConfigset(AbstractIncrementalBackupTest.java:419)
at java.base@23.0.2/jdk.internal.reflect.DirectMethodHandleAccessor.invoke(DirectMethodHandleAccessor.java:103)
at java.base@23.0.2/java.lang.reflect.Method.invoke(Method.java:580)
at app//com.carrotsearch.randomizedtesting.RandomizedRunner.invoke(RandomizedRunner.java:1763)
at app//com.carrotsearch.randomizedtesting.RandomizedRunner$8.evaluate(RandomizedRunner.java:946)
at app//com.carrotsearch.randomizedtesting.RandomizedRunner$9.evaluate(RandomizedRunner.java:982)
at app//com.carrotsearch.randomizedtesting.RandomizedRunner$10.evaluate(RandomizedRunner.java:996)
at app//com.carrotsearch.randomizedtesting.rules.SystemPropertiesRestoreRule$1.evaluate(SystemPropertiesRestoreRule.java:80)
at app//org.junit.rules.RunRules.evaluate(RunRules.java:20)
at app//org.apache.lucene.tests.util.TestRuleSetupTeardownChained$1.evaluate(TestRuleSetupTeardownChained.java:48)
at app//org.apache.lucene.tests.util.AbstractBeforeAfterRule$1.evaluate(AbstractBeforeAfterRule.java:43)
at app//org.apache.lucene.tests.util.TestRuleThreadAndTestName$1.evaluate(TestRuleThreadAndTestName.java:45)
at app//org.apache.lucene.tests.util.TestRuleIgnoreAfterMaxFailures$1.evaluate(TestRuleIgnoreAfterMaxFailures.java:60)
at app//org.apache.lucene.tests.util.TestRuleMarkFailure$1.evaluate(TestRuleMarkFailure.java:44)
at app//org.junit.rules.RunRules.evaluate(RunRules.java:20)
at app//com.carrotsearch.randomizedtesting.rules.StatementAdapter.evaluate(StatementAdapter.java:36)
at app//com.carrotsearch.randomizedtesting.ThreadLeakControl$StatementRunner.run(ThreadLeakControl.java:390)
at app//com.carrotsearch.randomizedtesting.ThreadLeakControl.forkTimeoutingTask(ThreadLeakControl.java:843)
at app//com.carrotsearch.randomizedtesting.ThreadLeakControl$3.evaluate(ThreadLeakControl.java:490)
at app//com.carrotsearch.randomizedtesting.RandomizedRunner.runSingleTest(RandomizedRunner.java:955)
at app//com.carrotsearch.randomizedtesting.RandomizedRunner$5.evaluate(RandomizedRunner.java:840)
at app//com.carrotsearch.randomizedtesting.RandomizedRunner$6.evaluate(RandomizedRunner.java:891)
at app//com.carrotsearch.randomizedtesting.RandomizedRunner$7.evaluate(RandomizedRunner.java:902)
at app//com.carrotsearch.randomizedtesting.rules.StatementAdapter.evaluate(StatementAdapter.java:36)
at app//com.carrotsearch.randomizedtesting.rules.StatementAdapter.evaluate(StatementAdapter.java:36)
at app//org.apache.lucene.tests.util.AbstractBeforeAfterRule$1.evaluate(AbstractBeforeAfterRule.java:43)
at app//com.carrotsearch.randomizedtesting.rules.SystemPropertiesRestoreRule$1.evaluate(SystemPropertiesRestoreRule.java:80)
at app//org.junit.rules.RunRules.evaluate(RunRules.java:20)
at app//org.apache.lucene.tests.util.AbstractBeforeAfterRule$1.evaluate(AbstractBeforeAfterRule.java:43)
at app//com.carrotsearch.randomizedtesting.rules.StatementAdapter.evaluate(StatementAdapter.java:36)
at app//org.apache.lucene.tests.util.TestRuleStoreClassName$1.evaluate(TestRuleStoreClassName.java:38)
at app//com.carrotsearch.randomizedtesting.rules.NoShadowingOrOverridesOnMethodsRule$1.evaluate(NoShadowingOrOverridesOnMethodsRule.java:40)
at app//com.carrotsearch.randomizedtesting.rules.NoShadowingOrOverridesOnMethodsRule$1.evaluate(NoShadowingOrOverridesOnMethodsRule.java:40)
at app//com.carrotsearch.randomizedtesting.rules.StatementAdapter.evaluate(StatementAdapter.java:36)
at app//com.carrotsearch.randomizedtesting.rules.StatementAdapter.evaluate(StatementAdapter.java:36)
at app//org.apache.lucene.tests.util.TestRuleAssertionsRequired$1.evaluate(TestRuleAssertionsRequired.java:53)
at app//org.apache.lucene.tests.util.AbstractBeforeAfterRule$1.evaluate(AbstractBeforeAfterRule.java:43)
at app//org.apache.lucene.tests.util.TestRuleMarkFailure$1.evaluate(TestRuleMarkFailure.java:44)
at app//org.apache.lucene.tests.util.TestRuleIgnoreAfterMaxFailures$1.evaluate(TestRuleIgnoreAfterMaxFailures.java:60)
at app//org.apache.lucene.tests.util.TestRuleIgnoreTestSuites$1.evaluate(TestRuleIgnoreTestSuites.java:47)
at app//org.junit.rules.RunRules.evaluate(RunRules.java:20)
at app//com.carrotsearch.randomizedtesting.rules.StatementAdapter.evaluate(StatementAdapter.java:36)
at app//com.carrotsearch.randomizedtesting.ThreadLeakControl$StatementRunner.run(ThreadLeakControl.java:390)
at app//com.carrotsearch.randomizedtesting.ThreadLeakControl.lambda$forkTimeoutingTask$0(ThreadLeakControl.java:850)
at java.base@23.0.2/java.lang.Thread.run(Thread.java:1575)
FAILED: org.apache.solr.update.SolrIndexFingerprintTest.classMethod
Error Message:
java.lang.AssertionError: ObjectTracker found 1 object(s) that were not released!!! [MockDirectoryWrapper]
org.apache.lucene.tests.store.MockDirectoryWrapper:org.apache.solr.common.util.ObjectReleaseTracker$ObjectTrackerException: org.apache.lucene.tests.store.MockDirectoryWrapper@504309567
at org.apache.solr.common.util.ObjectReleaseTracker.track(ObjectReleaseTracker.java:57)
at org.apache.solr.core.CachingDirectoryFactory.get(CachingDirectoryFactory.java:405)
at org.apache.solr.update.SolrIndexWriter.create(SolrIndexWriter.java:115)
at org.apache.solr.core.SolrCore.initIndex(SolrCore.java:911)
at org.apache.solr.core.SolrCore.<init>(SolrCore.java:1133)
at org.apache.solr.core.SolrCore.<init>(SolrCore.java:1061)
at org.apache.solr.core.CoreContainer.createFromDescriptor(CoreContainer.java:1676)
at org.apache.solr.core.CoreContainer.lambda$loadInternal$6(CoreContainer.java:995)
at org.apache.solr.util.stats.OtelInstrumentedExecutorService$InstrumentedRunnable.run(OtelInstrumentedExecutorService.java:256)
at org.apache.solr.common.util.ExecutorUtil$MDCAwareThreadPoolExecutor.lambda$execute$0(ExecutorUtil.java:381)
at java.base/java.util.concurrent.ThreadPoolExecutor.runWorker(ThreadPoolExecutor.java:1144)
at java.base/java.util.concurrent.ThreadPoolExecutor$Worker.run(ThreadPoolExecutor.java:642)
at java.base/java.lang.Thread.run(Thread.java:1575)
Caused by: java.lang.Exception: Submitter stack trace
at org.apache.solr.common.util.ExecutorUtil$MDCAwareThreadPoolExecutor.execute(ExecutorUtil.java:348)
at org.apache.solr.util.stats.OtelInstrumentedExecutorService.execute(OtelInstrumentedExecutorService.java:156)
at org.apache.solr.core.CoreContainer.loadInternal(CoreContainer.java:984)
at org.apache.solr.core.CoreContainer.load(CoreContainer.java:753)
at org.apache.solr.util.TestHarness.<init>(TestHarness.java:171)
at org.apache.solr.util.TestHarness.<init>(TestHarness.java:139)
at org.apache.solr.util.TestHarness.<init>(TestHarness.java:147)
at org.apache.solr.util.TestHarness.<init>(TestHarness.java:91)
at org.apache.solr.SolrTestCaseJ4.createCore(SolrTestCaseJ4.java:706)
at org.apache.solr.SolrTestCaseJ4.initCore(SolrTestCaseJ4.java:696)
at org.apache.solr.SolrTestCaseJ4.initCore(SolrTestCaseJ4.java:559)
at org.apache.solr.SolrTestCaseJ4.initCore(SolrTestCaseJ4.java:546)
at org.apache.solr.update.SolrIndexFingerprintTest.beforeTests(SolrIndexFingerprintTest.java:32)
at java.base/jdk.internal.reflect.DirectMethodHandleAccessor.invoke(DirectMethodHandleAccessor.java:103)
at java.base/java.lang.reflect.Method.invoke(Method.java:580)
at com.carrotsearch.randomizedtesting.RandomizedRunner.invoke(RandomizedRunner.java:1763)
at com.carrotsearch.randomizedtesting.RandomizedRunner$6.evaluate(RandomizedRunner.java:886)
at com.carrotsearch.randomizedtesting.RandomizedRunner$7.evaluate(RandomizedRunner.java:902)
at com.carrotsearch.randomizedtesting.rules.StatementAdapter.evaluate(StatementAdapter.java:36)
at com.carrotsearch.randomizedtesting.rules.StatementAdapter.evaluate(StatementAdapter.java:36)
at org.apache.lucene.tests.util.AbstractBeforeAfterRule$1.evaluate(AbstractBeforeAfterRule.java:43)
at com.carrotsearch.randomizedtesting.rules.SystemPropertiesRestoreRule$1.evaluate(SystemPropertiesRestoreRule.java:80)
at org.junit.rules.RunRules.evaluate(RunRules.java:20)
at org.apache.lucene.tests.util.AbstractBeforeAfterRule$1.evaluate(AbstractBeforeAfterRule.java:43)
at com.carrotsearch.randomizedtesting.rules.StatementAdapter.evaluate(StatementAdapter.java:36)
at org.apache.lucene.tests.util.TestRuleStoreClassName$1.evaluate(TestRuleStoreClassName.java:38)
at com.carrotsearch.randomizedtesting.rules.NoShadowingOrOverridesOnMethodsRule$1.evaluate(NoShadowingOrOverridesOnMethodsRule.java:40)
at com.carrotsearch.randomizedtesting.rules.NoShadowingOrOverridesOnMethodsRule$1.evaluate(NoShadowingOrOverridesOnMethodsRule.java:40)
at com.carrotsearch.randomizedtesting.rules.StatementAdapter.evaluate(StatementAdapter.java:36)
at com.carrotsearch.randomizedtesting.rules.StatementAdapter.evaluate(StatementAdapter.java:36)
at org.apache.lucene.tests.util.TestRuleAssertionsRequired$1.evaluate(TestRuleAssertionsRequired.java:53)
at org.apache.lucene.tests.util.AbstractBeforeAfterRule$1.evaluate(AbstractBeforeAfterRule.java:43)
at org.apache.lucene.tests.util.TestRuleMarkFailure$1.evaluate(TestRuleMarkFailure.java:44)
at org.apache.lucene.tests.util.TestRuleIgnoreAfterMaxFailures$1.evaluate(TestRuleIgnoreAfterMaxFailures.java:60)
at org.apache.lucene.tests.util.TestRuleIgnoreTestSuites$1.evaluate(TestRuleIgnoreTestSuites.java:47)
at org.junit.rules.RunRules.evaluate(RunRules.java:20)
at com.carrotsearch.randomizedtesting.rules.StatementAdapter.evaluate(StatementAdapter.java:36)
at com.carrotsearch.randomizedtesting.ThreadLeakControl$StatementRunner.run(ThreadLeakControl.java:390)
at com.carrotsearch.randomizedtesting.ThreadLeakControl.lambda$forkTimeoutingTask$0(ThreadLeakControl.java:850)
... 1 more
expected null, but was:<ObjectTracker found 1 object(s) that were not released!!! [MockDirectoryWrapper]
org.apache.lucene.tests.store.MockDirectoryWrapper:org.apache.solr.common.util.ObjectReleaseTracker$ObjectTrackerException: org.apache.lucene.tests.store.MockDirectoryWrapper@504309567
at org.apache.solr.common.util.ObjectReleaseTracker.track(ObjectReleaseTracker.java:57)
at org.apache.solr.core.CachingDirectoryFactory.get(CachingDirectoryFactory.java:405)
at org.apache.solr.update.SolrIndexWriter.create(SolrIndexWriter.java:115)
at org.apache.solr.core.SolrCore.initIndex(SolrCore.java:911)
at org.apache.solr.core.SolrCore.<init>(SolrCore.java:1133)
at org.apache.solr.core.SolrCore.<init>(SolrCore.java:1061)
at org.apache.solr.core.CoreContainer.createFromDescriptor(CoreContainer.java:1676)
at org.apache.solr.core.CoreContainer.lambda$loadInternal$6(CoreContainer.java:995)
at org.apache.solr.util.stats.OtelInstrumentedExecutorService$InstrumentedRunnable.run(OtelInstrumentedExecutorService.java:256)
at org.apache.solr.common.util.ExecutorUtil$MDCAwareThreadPoolExecutor.lambda$execute$0(ExecutorUtil.java:381)
at java.base/java.util.concurrent.ThreadPoolExecutor.runWorker(ThreadPoolExecutor.java:1144)
at java.base/java.util.concurrent.ThreadPoolExecutor$Worker.run(ThreadPoolExecutor.java:642)
at java.base/java.lang.Thread.run(Thread.java:1575)
Caused by: java.lang.Exception: Submitter stack trace
at org.apache.solr.common.util.ExecutorUtil$MDCAwareThreadPoolExecutor.execute(ExecutorUtil.java:348)
at org.apache.solr.util.stats.OtelInstrumentedExecutorService.execute(OtelInstrumentedExecutorService.java:156)
at org.apache.solr.core.CoreContainer.loadInternal(CoreContainer.java:984)
at org.apache.solr.core.CoreContainer.load(CoreContainer.java:753)
at org.apache.solr.util.TestHarness.<init>(TestHarness.java:171)
at org.apache.solr.util.TestHarness.<init>(TestHarness.java:139)
at org.apache.solr.util.TestHarness.<init>(TestHarness.java:147)
at org.apache.solr.util.TestHarness.<init>(TestHarness.java:91)
at org.apache.solr.SolrTestCaseJ4.createCore(SolrTestCaseJ4.java:706)
at org.apache.solr.SolrTestCaseJ4.initCore(SolrTestCaseJ4.java:696)
at org.apache.solr.SolrTestCaseJ4.initCore(SolrTestCaseJ4.java:559)
at org.apache.solr.SolrTestCaseJ4.initCore(SolrTestCaseJ4.java:546)
at org.apache.solr.update.SolrIndexFingerprintTest.beforeTests(SolrIndexFingerprintTest.java:32)
at java.base/jdk.internal.reflect.DirectMethodHandleAccessor.invoke(DirectMethodHandleAccessor.java:103)
at java.base/java.lang.reflect.Method.invoke(Method.java:580)
at com.carrotsearch.randomizedtesting.RandomizedRunner.invoke(RandomizedRunner.java:1763)
at com.carrotsearch.randomizedtesting.RandomizedRunner$6.evaluate(RandomizedRunner.java:886)
at com.carrotsearch.randomizedtesting.RandomizedRunner$7.evaluate(RandomizedRunner.java:902)
at com.carrotsearch.randomizedtesting.rules.StatementAdapter.evaluate(StatementAdapter.java:36)
at com.carrotsearch.randomizedtesting.rules.StatementAdapter.evaluate(StatementAdapter.java:36)
at org.apache.lucene.tests.util.AbstractBeforeAfterRule$1.evaluate(AbstractBeforeAfterRule.java:43)
at com.carrotsearch.randomizedtesting.rules.SystemPropertiesRestoreRule$1.evaluate(SystemPropertiesRestoreRule.java:80)
at org.junit.rules.RunRules.evaluate(RunRules.java:20)
at org.apache.lucene.tests.util.AbstractBeforeAfterRule$1.evaluate(AbstractBeforeAfterRule.java:43)
at com.carrotsearch.randomizedtesting.rules.StatementAdapter.evaluate(StatementAdapter.java:36)
at org.apache.lucene.tests.util.TestRuleStoreClassName$1.evaluate(TestRuleStoreClassName.java:38)
at com.carrotsearch.randomizedtesting.rules.NoShadowingOrOverridesOnMethodsRule$1.evaluate(NoShadowingOrOverridesOnMethodsRule.java:40)
at com.carrotsearch.randomizedtesting.rules.NoShadowingOrOverridesOnMethodsRule$1.evaluate(NoShadowingOrOverridesOnMethodsRule.java:40)
at com.carrotsearch.randomizedtesting.rules.StatementAdapter.evaluate(StatementAdapter.java:36)
at com.carrotsearch.randomizedtesting.rules.StatementAdapter.evaluate(StatementAdapter.java:36)
at org.apache.lucene.tests.util.TestRuleAssertionsRequired$1.evaluate(TestRuleAssertionsRequired.java:53)
at org.apache.lucene.tests.util.AbstractBeforeAfterRule$1.evaluate(AbstractBeforeAfterRule.java:43)
at org.apache.lucene.tests.util.TestRuleMarkFailure$1.evaluate(TestRuleMarkFailure.java:44)
at org.apache.lucene.tests.util.TestRuleIgnoreAfterMaxFailures$1.evaluate(TestRuleIgnoreAfterMaxFailures.java:60)
at org.apache.lucene.tests.util.TestRuleIgnoreTestSuites$1.evaluate(TestRuleIgnoreTestSuites.java:47)
at org.junit.rules.RunRules.evaluate(RunRules.java:20)
at com.carrotsearch.randomizedtesting.rules.StatementAdapter.evaluate(StatementAdapter.java:36)
at com.carrotsearch.randomizedtesting.ThreadLeakControl$StatementRunner.run(ThreadLeakControl.java:390)
at com.carrotsearch.randomizedtesting.ThreadLeakControl.lambda$forkTimeoutingTask$0(ThreadLeakControl.java:850)
... 1 more
>
Stack Trace:
java.lang.AssertionError: ObjectTracker found 1 object(s) that were not released!!! [MockDirectoryWrapper]
org.apache.lucene.tests.store.MockDirectoryWrapper:org.apache.solr.common.util.ObjectReleaseTracker$ObjectTrackerException: org.apache.lucene.tests.store.MockDirectoryWrapper@504309567
at org.apache.solr.common.util.ObjectReleaseTracker.track(ObjectReleaseTracker.java:57)
at org.apache.solr.core.CachingDirectoryFactory.get(CachingDirectoryFactory.java:405)
at org.apache.solr.update.SolrIndexWriter.create(SolrIndexWriter.java:115)
at org.apache.solr.core.SolrCore.initIndex(SolrCore.java:911)
at org.apache.solr.core.SolrCore.<init>(SolrCore.java:1133)
at org.apache.solr.core.SolrCore.<init>(SolrCore.java:1061)
at org.apache.solr.core.CoreContainer.createFromDescriptor(CoreContainer.java:1676)
at org.apache.solr.core.CoreContainer.lambda$loadInternal$6(CoreContainer.java:995)
at org.apache.solr.util.stats.OtelInstrumentedExecutorService$InstrumentedRunnable.run(OtelInstrumentedExecutorService.java:256)
at org.apache.solr.common.util.ExecutorUtil$MDCAwareThreadPoolExecutor.lambda$execute$0(ExecutorUtil.java:381)
at java.base/java.util.concurrent.ThreadPoolExecutor.runWorker(ThreadPoolExecutor.java:1144)
at java.base/java.util.concurrent.ThreadPoolExecutor$Worker.run(ThreadPoolExecutor.java:642)
at java.base/java.lang.Thread.run(Thread.java:1575)
Caused by: java.lang.Exception: Submitter stack trace
at org.apache.solr.common.util.ExecutorUtil$MDCAwareThreadPoolExecutor.execute(ExecutorUtil.java:348)
at org.apache.solr.util.stats.OtelInstrumentedExecutorService.execute(OtelInstrumentedExecutorService.java:156)
at org.apache.solr.core.CoreContainer.loadInternal(CoreContainer.java:984)
at org.apache.solr.core.CoreContainer.load(CoreContainer.java:753)
at org.apache.solr.util.TestHarness.<init>(TestHarness.java:171)
at org.apache.solr.util.TestHarness.<init>(TestHarness.java:139)
at org.apache.solr.util.TestHarness.<init>(TestHarness.java:147)
at org.apache.solr.util.TestHarness.<init>(TestHarness.java:91)
at org.apache.solr.SolrTestCaseJ4.createCore(SolrTestCaseJ4.java:706)
at org.apache.solr.SolrTestCaseJ4.initCore(SolrTestCaseJ4.java:696)
at org.apache.solr.SolrTestCaseJ4.initCore(SolrTestCaseJ4.java:559)
at org.apache.solr.SolrTestCaseJ4.initCore(SolrTestCaseJ4.java:546)
at org.apache.solr.update.SolrIndexFingerprintTest.beforeTests(SolrIndexFingerprintTest.java:32)
at java.base/jdk.internal.reflect.DirectMethodHandleAccessor.invoke(DirectMethodHandleAccessor.java:103)
at java.base/java.lang.reflect.Method.invoke(Method.java:580)
at com.carrotsearch.randomizedtesting.RandomizedRunner.invoke(RandomizedRunner.java:1763)
at com.carrotsearch.randomizedtesting.RandomizedRunner$6.evaluate(RandomizedRunner.java:886)
at com.carrotsearch.randomizedtesting.RandomizedRunner$7.evaluate(RandomizedRunner.java:902)
at com.carrotsearch.randomizedtesting.rules.StatementAdapter.evaluate(StatementAdapter.java:36)
at com.carrotsearch.randomizedtesting.rules.StatementAdapter.evaluate(StatementAdapter.java:36)
at org.apache.lucene.tests.util.AbstractBeforeAfterRule$1.evaluate(AbstractBeforeAfterRule.java:43)
at com.carrotsearch.randomizedtesting.rules.SystemPropertiesRestoreRule$1.evaluate(SystemPropertiesRestoreRule.java:80)
at org.junit.rules.RunRules.evaluate(RunRules.java:20)
at org.apache.lucene.tests.util.AbstractBeforeAfterRule$1.evaluate(AbstractBeforeAfterRule.java:43)
at com.carrotsearch.randomizedtesting.rules.StatementAdapter.evaluate(StatementAdapter.java:36)
at org.apache.lucene.tests.util.TestRuleStoreClassName$1.evaluate(TestRuleStoreClassName.java:38)
at com.carrotsearch.randomizedtesting.rules.NoShadowingOrOverridesOnMethodsRule$1.evaluate(NoShadowingOrOverridesOnMethodsRule.java:40)
at com.carrotsearch.randomizedtesting.rules.NoShadowingOrOverridesOnMethodsRule$1.evaluate(NoShadowingOrOverridesOnMethodsRule.java:40)
at com.carrotsearch.randomizedtesting.rules.StatementAdapter.evaluate(StatementAdapter.java:36)
at com.carrotsearch.randomizedtesting.rules.StatementAdapter.evaluate(StatementAdapter.java:36)
at org.apache.lucene.tests.util.TestRuleAssertionsRequired$1.evaluate(TestRuleAssertionsRequired.java:53)
at org.apache.lucene.tests.util.AbstractBeforeAfterRule$1.evaluate(AbstractBeforeAfterRule.java:43)
at org.apache.lucene.tests.util.TestRuleMarkFailure$1.evaluate(TestRuleMarkFailure.java:44)
at org.apache.lucene.tests.util.TestRuleIgnoreAfterMaxFailures$1.evaluate(TestRuleIgnoreAfterMaxFailures.java:60)
at org.apache.lucene.tests.util.TestRuleIgnoreTestSuites$1.evaluate(TestRuleIgnoreTestSuites.java:47)
at org.junit.rules.RunRules.evaluate(RunRules.java:20)
at com.carrotsearch.randomizedtesting.rules.StatementAdapter.evaluate(StatementAdapter.java:36)
at com.carrotsearch.randomizedtesting.ThreadLeakControl$StatementRunner.run(ThreadLeakControl.java:390)
at com.carrotsearch.randomizedtesting.ThreadLeakControl.lambda$forkTimeoutingTask$0(ThreadLeakControl.java:850)
... 1 more
expected null, but was:<ObjectTracker found 1 object(s) that were not released!!! [MockDirectoryWrapper]
org.apache.lucene.tests.store.MockDirectoryWrapper:org.apache.solr.common.util.ObjectReleaseTracker$ObjectTrackerException: org.apache.lucene.tests.store.MockDirectoryWrapper@504309567
at org.apache.solr.common.util.ObjectReleaseTracker.track(ObjectReleaseTracker.java:57)
at org.apache.solr.core.CachingDirectoryFactory.get(CachingDirectoryFactory.java:405)
at org.apache.solr.update.SolrIndexWriter.create(SolrIndexWriter.java:115)
at org.apache.solr.core.SolrCore.initIndex(SolrCore.java:911)
at org.apache.solr.core.SolrCore.<init>(SolrCore.java:1133)
at org.apache.solr.core.SolrCore.<init>(SolrCore.java:1061)
at org.apache.solr.core.CoreContainer.createFromDescriptor(CoreContainer.java:1676)
at org.apache.solr.core.CoreContainer.lambda$loadInternal$6(CoreContainer.java:995)
at org.apache.solr.util.stats.OtelInstrumentedExecutorService$InstrumentedRunnable.run(OtelInstrumentedExecutorService.java:256)
at org.apache.solr.common.util.ExecutorUtil$MDCAwareThreadPoolExecutor.lambda$execute$0(ExecutorUtil.java:381)
at java.base/java.util.concurrent.ThreadPoolExecutor.runWorker(ThreadPoolExecutor.java:1144)
at java.base/java.util.concurrent.ThreadPoolExecutor$Worker.run(ThreadPoolExecutor.java:642)
at java.base/java.lang.Thread.run(Thread.java:1575)
Caused by: java.lang.Exception: Submitter stack trace
at org.apache.solr.common.util.ExecutorUtil$MDCAwareThreadPoolExecutor.execute(ExecutorUtil.java:348)
at org.apache.solr.util.stats.OtelInstrumentedExecutorService.execute(OtelInstrumentedExecutorService.java:156)
at org.apache.solr.core.CoreContainer.loadInternal(CoreContainer.java:984)
at org.apache.solr.core.CoreContainer.load(CoreContainer.java:753)
at org.apache.solr.util.TestHarness.<init>(TestHarness.java:171)
at org.apache.solr.util.TestHarness.<init>(TestHarness.java:139)
at org.apache.solr.util.TestHarness.<init>(TestHarness.java:147)
at org.apache.solr.util.TestHarness.<init>(TestHarness.java:91)
at org.apache.solr.SolrTestCaseJ4.createCore(SolrTestCaseJ4.java:706)
at org.apache.solr.SolrTestCaseJ4.initCore(SolrTestCaseJ4.java:696)
at org.apache.solr.SolrTestCaseJ4.initCore(SolrTestCaseJ4.java:559)
at org.apache.solr.SolrTestCaseJ4.initCore(SolrTestCaseJ4.java:546)
at org.apache.solr.update.SolrIndexFingerprintTest.beforeTests(SolrIndexFingerprintTest.java:32)
at java.base/jdk.internal.reflect.DirectMethodHandleAccessor.invoke(DirectMethodHandleAccessor.java:103)
at java.base/java.lang.reflect.Method.invoke(Method.java:580)
at com.carrotsearch.randomizedtesting.RandomizedRunner.invoke(RandomizedRunner.java:1763)
at com.carrotsearch.randomizedtesting.RandomizedRunner$6.evaluate(RandomizedRunner.java:886)
at com.carrotsearch.randomizedtesting.RandomizedRunner$7.evaluate(RandomizedRunner.java:902)
at com.carrotsearch.randomizedtesting.rules.StatementAdapter.evaluate(StatementAdapter.java:36)
at com.carrotsearch.randomizedtesting.rules.StatementAdapter.evaluate(StatementAdapter.java:36)
at org.apache.lucene.tests.util.AbstractBeforeAfterRule$1.evaluate(AbstractBeforeAfterRule.java:43)
at com.carrotsearch.randomizedtesting.rules.SystemPropertiesRestoreRule$1.evaluate(SystemPropertiesRestoreRule.java:80)
at org.junit.rules.RunRules.evaluate(RunRules.java:20)
at org.apache.lucene.tests.util.AbstractBeforeAfterRule$1.evaluate(AbstractBeforeAfterRule.java:43)
at com.carrotsearch.randomizedtesting.rules.StatementAdapter.evaluate(StatementAdapter.java:36)
at org.apache.lucene.tests.util.TestRuleStoreClassName$1.evaluate(TestRuleStoreClassName.java:38)
at com.carrotsearch.randomizedtesting.rules.NoShadowingOrOverridesOnMethodsRule$1.evaluate(NoShadowingOrOverridesOnMethodsRule.java:40)
at com.carrotsearch.randomizedtesting.rules.NoShadowingOrOverridesOnMethodsRule$1.evaluate(NoShadowingOrOverridesOnMethodsRule.java:40)
at com.carrotsearch.randomizedtesting.rules.StatementAdapter.evaluate(StatementAdapter.java:36)
at com.carrotsearch.randomizedtesting.rules.StatementAdapter.evaluate(StatementAdapter.java:36)
at org.apache.lucene.tests.util.TestRuleAssertionsRequired$1.evaluate(TestRuleAssertionsRequired.java:53)
at org.apache.lucene.tests.util.AbstractBeforeAfterRule$1.evaluate(AbstractBeforeAfterRule.java:43)
at org.apache.lucene.tests.util.TestRuleMarkFailure$1.evaluate(TestRuleMarkFailure.java:44)
at org.apache.lucene.tests.util.TestRuleIgnoreAfterMaxFailures$1.evaluate(TestRuleIgnoreAfterMaxFailures.java:60)
at org.apache.lucene.tests.util.TestRuleIgnoreTestSuites$1.evaluate(TestRuleIgnoreTestSuites.java:47)
at org.junit.rules.RunRules.evaluate(RunRules.java:20)
at com.carrotsearch.randomizedtesting.rules.StatementAdapter.evaluate(StatementAdapter.java:36)
at com.carrotsearch.randomizedtesting.ThreadLeakControl$StatementRunner.run(ThreadLeakControl.java:390)
at com.carrotsearch.randomizedtesting.ThreadLeakControl.lambda$forkTimeoutingTask$0(ThreadLeakControl.java:850)
... 1 more
>
at __randomizedtesting.SeedInfo.seed([E8C77A28B4F34F4F]:0)
at org.junit.Assert.fail(Assert.java:89)
at org.junit.Assert.failNotNull(Assert.java:756)
at org.junit.Assert.assertNull(Assert.java:738)
at org.apache.solr.SolrTestCase$1.afterIfSuccessful(SolrTestCase.java:101)
at com.carrotsearch.randomizedtesting.rules.TestRuleAdapter$1.afterIfSuccessful(TestRuleAdapter.java:36)
at com.carrotsearch.randomizedtesting.rules.StatementAdapter.evaluate(StatementAdapter.java:37)
at com.carrotsearch.randomizedtesting.rules.StatementAdapter.evaluate(StatementAdapter.java:36)
at org.apache.lucene.tests.util.AbstractBeforeAfterRule$1.evaluate(AbstractBeforeAfterRule.java:43)
at com.carrotsearch.randomizedtesting.rules.SystemPropertiesRestoreRule$1.evaluate(SystemPropertiesRestoreRule.java:80)
at org.junit.rules.RunRules.evaluate(RunRules.java:20)
at org.apache.lucene.tests.util.AbstractBeforeAfterRule$1.evaluate(AbstractBeforeAfterRule.java:43)
at com.carrotsearch.randomizedtesting.rules.StatementAdapter.evaluate(StatementAdapter.java:36)
at org.apache.lucene.tests.util.TestRuleStoreClassName$1.evaluate(TestRuleStoreClassName.java:38)
at com.carrotsearch.randomizedtesting.rules.NoShadowingOrOverridesOnMethodsRule$1.evaluate(NoShadowingOrOverridesOnMethodsRule.java:40)
at com.carrotsearch.randomizedtesting.rules.NoShadowingOrOverridesOnMethodsRule$1.evaluate(NoShadowingOrOverridesOnMethodsRule.java:40)
at com.carrotsearch.randomizedtesting.rules.StatementAdapter.evaluate(StatementAdapter.java:36)
at com.carrotsearch.randomizedtesting.rules.StatementAdapter.evaluate(StatementAdapter.java:36)
at org.apache.lucene.tests.util.TestRuleAssertionsRequired$1.evaluate(TestRuleAssertionsRequired.java:53)
at org.apache.lucene.tests.util.AbstractBeforeAfterRule$1.evaluate(AbstractBeforeAfterRule.java:43)
at org.apache.lucene.tests.util.TestRuleMarkFailure$1.evaluate(TestRuleMarkFailure.java:44)
at org.apache.lucene.tests.util.TestRuleIgnoreAfterMaxFailures$1.evaluate(TestRuleIgnoreAfterMaxFailures.java:60)
at org.apache.lucene.tests.util.TestRuleIgnoreTestSuites$1.evaluate(TestRuleIgnoreTestSuites.java:47)
at org.junit.rules.RunRules.evaluate(RunRules.java:20)
at com.carrotsearch.randomizedtesting.rules.StatementAdapter.evaluate(StatementAdapter.java:36)
at com.carrotsearch.randomizedtesting.ThreadLeakControl$StatementRunner.run(ThreadLeakControl.java:390)
at com.carrotsearch.randomizedtesting.ThreadLeakControl.lambda$forkTimeoutingTask$0(ThreadLeakControl.java:850)
at java.base/java.lang.Thread.run(Thread.java:1575)
FAILED: org.apache.solr.update.SolrIndexFingerprintTest.testSequentialVsParallelFingerprint
Error Message:
java.lang.OutOfMemoryError: Java heap space
Stack Trace:
java.lang.OutOfMemoryError: Java heap space
at __randomizedtesting.SeedInfo.seed([E8C77A28B4F34F4F:88B259ACE241BD52]:0)
at java.base/java.util.HashMap.resize(HashMap.java:711)
at java.base/java.util.HashMap.putVal(HashMap.java:670)
at java.base/java.util.HashMap.put(HashMap.java:619)
at java.base/java.util.HashSet.add(HashSet.java:230)
at java.base/java.util.AbstractCollection.addAll(AbstractCollection.java:338)
at org.apache.lucene.index.SegmentInfos.files(SegmentInfos.java:943)
at org.apache.lucene.index.IndexWriter.filesExist(IndexWriter.java:5580)
at org.apache.lucene.index.IndexWriter.startCommit(IndexWriter.java:5658)
at org.apache.lucene.index.IndexWriter.prepareCommitInternal(IndexWriter.java:3819)
at org.apache.lucene.index.IndexWriter.commitInternal(IndexWriter.java:4160)
at org.apache.lucene.index.IndexWriter.commit(IndexWriter.java:4122)
at org.apache.solr.update.DirectUpdateHandler2.commit(DirectUpdateHandler2.java:871)
at org.apache.solr.update.processor.RunUpdateProcessorFactory$RunUpdateProcessor.processCommit(RunUpdateProcessorFactory.java:100)
at org.apache.solr.update.processor.UpdateRequestProcessor.processCommit(UpdateRequestProcessor.java:66)
at org.apache.solr.update.processor.UpdateRequestProcessor.processCommit(UpdateRequestProcessor.java:66)
at org.apache.solr.update.processor.DistributedUpdateProcessor.doLocalCommit(DistributedUpdateProcessor.java:1174)
at org.apache.solr.update.processor.DistributedUpdateProcessor.processCommit(DistributedUpdateProcessor.java:1160)
at org.apache.solr.update.processor.LogUpdateProcessorFactory$LogUpdateProcessor.processCommit(LogUpdateProcessorFactory.java:173)
at org.apache.solr.handler.loader.XMLLoader.processUpdate(XMLLoader.java:214)
at org.apache.solr.handler.loader.XMLLoader.load(XMLLoader.java:120)
at org.apache.solr.handler.UpdateRequestHandler$1.load(UpdateRequestHandler.java:101)
at org.apache.solr.handler.ContentStreamHandlerBase.handleRequestBody(ContentStreamHandlerBase.java:99)
at org.apache.solr.handler.RequestHandlerBase.handleRequest(RequestHandlerBase.java:251)
at org.apache.solr.core.SolrCore.execute(SolrCore.java:2921)
at org.apache.solr.client.solrj.embedded.EmbeddedSolrServer.request(EmbeddedSolrServer.java:227)
at org.apache.solr.client.solrj.SolrClient.request(SolrClient.java:1195)
at org.apache.solr.util.TestHarness.update(TestHarness.java:272)
at org.apache.solr.util.BaseTestHarness.checkUpdateStatus(BaseTestHarness.java:270)
at org.apache.solr.util.BaseTestHarness.validateUpdate(BaseTestHarness.java:238)
at org.apache.solr.SolrTestCaseJ4.checkUpdateU(SolrTestCaseJ4.java:841)
at org.apache.solr.SolrTestCaseJ4.assertU(SolrTestCaseJ4.java:823)
at org.apache.solr.SolrTestCaseJ4.assertU(SolrTestCaseJ4.java:818)
FAILED: org.apache.solr.update.SolrIndexFingerprintTest.testSequentialVsParallelFingerprint
Error Message:
java.lang.OutOfMemoryError: Java heap space
Stack Trace:
java.lang.OutOfMemoryError: Java heap space
at __randomizedtesting.SeedInfo.seed([E8C77A28B4F34F4F:88B259ACE241BD52]:0)
at org.apache.lucene.index.ExitableDirectoryReader$ExitableSubReaderWrapper.wrap(ExitableDirectoryReader.java:63)
at org.apache.lucene.index.FilterDirectoryReader$SubReaderWrapper.wrap(FilterDirectoryReader.java:62)
at org.apache.lucene.index.FilterDirectoryReader.<init>(FilterDirectoryReader.java:92)
at org.apache.lucene.index.ExitableDirectoryReader.<init>(ExitableDirectoryReader.java:935)
at org.apache.lucene.index.ExitableDirectoryReader.wrap(ExitableDirectoryReader.java:952)
at org.apache.solr.search.SolrIndexSearcher.wrapReader(SolrIndexSearcher.java:235)
at org.apache.solr.search.SolrIndexSearcher.<init>(SolrIndexSearcher.java:393)
at org.apache.solr.core.SolrCore.openNewSearcher(SolrCore.java:2406)
at org.apache.solr.core.SolrCore.getSearcher(SolrCore.java:2615)
at org.apache.solr.core.SolrCore.getSearcher(SolrCore.java:2304)
at org.apache.solr.update.DirectUpdateHandler2.commit(DirectUpdateHandler2.java:900)
at org.apache.solr.update.processor.RunUpdateProcessorFactory$RunUpdateProcessor.processCommit(RunUpdateProcessorFactory.java:100)
at org.apache.solr.update.processor.UpdateRequestProcessor.processCommit(UpdateRequestProcessor.java:66)
at org.apache.solr.update.processor.UpdateRequestProcessor.processCommit(UpdateRequestProcessor.java:66)
at org.apache.solr.update.processor.DistributedUpdateProcessor.doLocalCommit(DistributedUpdateProcessor.java:1174)
at org.apache.solr.update.processor.DistributedUpdateProcessor.processCommit(DistributedUpdateProcessor.java:1160)
at org.apache.solr.update.processor.LogUpdateProcessorFactory$LogUpdateProcessor.processCommit(LogUpdateProcessorFactory.java:173)
at org.apache.solr.handler.loader.XMLLoader.processUpdate(XMLLoader.java:214)
at org.apache.solr.handler.loader.XMLLoader.load(XMLLoader.java:120)
at org.apache.solr.handler.UpdateRequestHandler$1.load(UpdateRequestHandler.java:101)
at org.apache.solr.handler.ContentStreamHandlerBase.handleRequestBody(ContentStreamHandlerBase.java:99)
at org.apache.solr.handler.RequestHandlerBase.handleRequest(RequestHandlerBase.java:251)
at org.apache.solr.core.SolrCore.execute(SolrCore.java:2921)
at org.apache.solr.client.solrj.embedded.EmbeddedSolrServer.request(EmbeddedSolrServer.java:227)
at org.apache.solr.client.solrj.SolrClient.request(SolrClient.java:1195)
at org.apache.solr.util.TestHarness.update(TestHarness.java:272)
at org.apache.solr.util.BaseTestHarness.checkUpdateStatus(BaseTestHarness.java:270)
at org.apache.solr.util.BaseTestHarness.validateUpdate(BaseTestHarness.java:238)
at org.apache.solr.SolrTestCaseJ4.checkUpdateU(SolrTestCaseJ4.java:841)
at org.apache.solr.SolrTestCaseJ4.assertU(SolrTestCaseJ4.java:823)
at org.apache.solr.SolrTestCaseJ4.assertU(SolrTestCaseJ4.java:818)
at org.apache.solr.update.SolrIndexFingerprintTest.lambda$testSequentialVsParallelFingerprint$0(SolrIndexFingerprintTest.java:46)
FAILED: org.apache.solr.update.SolrIndexFingerprintTest.testSequentialVsParallelFingerprint
Error Message:
java.lang.OutOfMemoryError: Java heap space
Stack Trace:
java.lang.OutOfMemoryError: Java heap space
at __randomizedtesting.SeedInfo.seed([E8C77A28B4F34F4F:88B259ACE241BD52]:0)
at java.base/java.util.HashMap.resize(HashMap.java:711)
at java.base/java.util.HashMap.putVal(HashMap.java:670)
at java.base/java.util.HashMap.put(HashMap.java:619)
at java.base/java.util.HashSet.add(HashSet.java:230)
at java.base/java.util.AbstractCollection.addAll(AbstractCollection.java:338)
at org.apache.lucene.index.SegmentInfos.files(SegmentInfos.java:943)
at org.apache.lucene.index.IndexWriter.filesExist(IndexWriter.java:5580)
at org.apache.lucene.index.IndexWriter.startCommit(IndexWriter.java:5658)
at org.apache.lucene.index.IndexWriter.prepareCommitInternal(IndexWriter.java:3819)
at org.apache.lucene.index.IndexWriter.commitInternal(IndexWriter.java:4160)
at org.apache.lucene.index.IndexWriter.commit(IndexWriter.java:4122)
at org.apache.solr.update.DirectUpdateHandler2.commit(DirectUpdateHandler2.java:871)
at org.apache.solr.update.processor.RunUpdateProcessorFactory$RunUpdateProcessor.processCommit(RunUpdateProcessorFactory.java:100)
at org.apache.solr.update.processor.UpdateRequestProcessor.processCommit(UpdateRequestProcessor.java:66)
at org.apache.solr.update.processor.UpdateRequestProcessor.processCommit(UpdateRequestProcessor.java:66)
at org.apache.solr.update.processor.DistributedUpdateProcessor.doLocalCommit(DistributedUpdateProcessor.java:1174)
at org.apache.solr.update.processor.DistributedUpdateProcessor.processCommit(DistributedUpdateProcessor.java:1160)
at org.apache.solr.update.processor.LogUpdateProcessorFactory$LogUpdateProcessor.processCommit(LogUpdateProcessorFactory.java:173)
at org.apache.solr.handler.loader.XMLLoader.processUpdate(XMLLoader.java:214)
at org.apache.solr.handler.loader.XMLLoader.load(XMLLoader.java:120)
at org.apache.solr.handler.UpdateRequestHandler$1.load(UpdateRequestHandler.java:101)
at org.apache.solr.handler.ContentStreamHandlerBase.handleRequestBody(ContentStreamHandlerBase.java:99)
at org.apache.solr.handler.RequestHandlerBase.handleRequest(RequestHandlerBase.java:251)
at org.apache.solr.core.SolrCore.execute(SolrCore.java:2921)
at org.apache.solr.client.solrj.embedded.EmbeddedSolrServer.request(EmbeddedSolrServer.java:227)
at org.apache.solr.client.solrj.SolrClient.request(SolrClient.java:1195)
at org.apache.solr.util.TestHarness.update(TestHarness.java:272)
at org.apache.solr.util.BaseTestHarness.checkUpdateStatus(BaseTestHarness.java:270)
at org.apache.solr.util.BaseTestHarness.validateUpdate(BaseTestHarness.java:238)
at org.apache.solr.SolrTestCaseJ4.checkUpdateU(SolrTestCaseJ4.java:841)
at org.apache.solr.SolrTestCaseJ4.assertU(SolrTestCaseJ4.java:823)
at org.apache.solr.SolrTestCaseJ4.assertU(SolrTestCaseJ4.java:818)
FAILED: org.apache.solr.update.SolrIndexFingerprintTest.testSequentialVsParallelFingerprint
Error Message:
java.lang.OutOfMemoryError: Java heap space
Stack Trace:
java.lang.OutOfMemoryError: Java heap space
at __randomizedtesting.SeedInfo.seed([E8C77A28B4F34F4F:88B259ACE241BD52]:0)
at java.base/java.util.HashMap.resize(HashMap.java:711)
at java.base/java.util.HashMap.putVal(HashMap.java:670)
at java.base/java.util.HashMap.put(HashMap.java:619)
at java.base/java.util.HashSet.add(HashSet.java:230)
at java.base/java.util.AbstractCollection.addAll(AbstractCollection.java:338)
at org.apache.lucene.index.SegmentInfos.files(SegmentInfos.java:943)
at org.apache.lucene.index.IndexWriter.filesExist(IndexWriter.java:5580)
at org.apache.lucene.index.IndexWriter.startCommit(IndexWriter.java:5658)
at org.apache.lucene.index.IndexWriter.prepareCommitInternal(IndexWriter.java:3819)
at org.apache.lucene.index.IndexWriter.commitInternal(IndexWriter.java:4160)
at org.apache.lucene.index.IndexWriter.commit(IndexWriter.java:4122)
at org.apache.solr.update.DirectUpdateHandler2.commit(DirectUpdateHandler2.java:871)
at org.apache.solr.update.processor.RunUpdateProcessorFactory$RunUpdateProcessor.processCommit(RunUpdateProcessorFactory.java:100)
at org.apache.solr.update.processor.UpdateRequestProcessor.processCommit(UpdateRequestProcessor.java:66)
at org.apache.solr.update.processor.UpdateRequestProcessor.processCommit(UpdateRequestProcessor.java:66)
at org.apache.solr.update.processor.DistributedUpdateProcessor.doLocalCommit(DistributedUpdateProcessor.java:1174)
at org.apache.solr.update.processor.DistributedUpdateProcessor.processCommit(DistributedUpdateProcessor.java:1160)
at org.apache.solr.update.processor.LogUpdateProcessorFactory$LogUpdateProcessor.processCommit(LogUpdateProcessorFactory.java:173)
at org.apache.solr.handler.loader.XMLLoader.processUpdate(XMLLoader.java:214)
at org.apache.solr.handler.loader.XMLLoader.load(XMLLoader.java:120)
at org.apache.solr.handler.UpdateRequestHandler$1.load(UpdateRequestHandler.java:101)
at org.apache.solr.handler.ContentStreamHandlerBase.handleRequestBody(ContentStreamHandlerBase.java:99)
at org.apache.solr.handler.RequestHandlerBase.handleRequest(RequestHandlerBase.java:251)
at org.apache.solr.core.SolrCore.execute(SolrCore.java:2921)
at org.apache.solr.client.solrj.embedded.EmbeddedSolrServer.request(EmbeddedSolrServer.java:227)
at org.apache.solr.client.solrj.SolrClient.request(SolrClient.java:1195)
at org.apache.solr.util.TestHarness.update(TestHarness.java:272)
at org.apache.solr.util.BaseTestHarness.checkUpdateStatus(BaseTestHarness.java:270)
at org.apache.solr.util.BaseTestHarness.validateUpdate(BaseTestHarness.java:238)
at org.apache.solr.SolrTestCaseJ4.checkUpdateU(SolrTestCaseJ4.java:841)
at org.apache.solr.SolrTestCaseJ4.assertU(SolrTestCaseJ4.java:823)
at org.apache.solr.SolrTestCaseJ4.assertU(SolrTestCaseJ4.java:818)
[JENKINS] Solr-main-Linux (64bit/hotspot/jdk-26) - Build # 32734 - Still Unstable!
Posted by Policeman Jenkins Server via builds <bu...@solr.apache.org>.
Build: https://jenkins.thetaphi.de/job/Solr-main-Linux/32734/
Java: 64bit/hotspot/jdk-26 -XX:-UseCompressedOops -XX:+UseParallelGC
2 tests failed.
FAILED: org.apache.solr.update.SolrIndexFingerprintTest.testSequentialVsParallelFingerprint
Error Message:
java.lang.OutOfMemoryError: Java heap space
Stack Trace:
java.lang.OutOfMemoryError: Java heap space
at __randomizedtesting.SeedInfo.seed([F1E3E7C8214A73FD:9196C44C77F881E0]:0)
at java.base/java.nio.HeapByteBuffer.<init>(HeapByteBuffer.java:75)
at java.base/java.nio.ByteBuffer.allocate(ByteBuffer.java:398)
at org.apache.lucene.store.ByteBuffersDataOutput$$Lambda/0x0000000040399208.apply(Unknown Source)
at org.apache.lucene.store.ByteBuffersDataOutput$ByteBufferRecycler.allocate(ByteBuffersDataOutput.java:72)
at org.apache.lucene.store.ByteBuffersDataOutput$$Lambda/0x0000000040726858.apply(Unknown Source)
at org.apache.lucene.store.ByteBuffersDataOutput.appendBlock(ByteBuffersDataOutput.java:506)
at org.apache.lucene.store.ByteBuffersDataOutput.writeByte(ByteBuffersDataOutput.java:187)
at org.apache.lucene.store.DataOutput.writeVInt(DataOutput.java:203)
at org.apache.lucene.codecs.lucene103.blocktree.Lucene103BlockTreeTermsWriter$StatsWriter.finish(Lucene103BlockTreeTermsWriter.java:539)
at org.apache.lucene.codecs.lucene103.blocktree.Lucene103BlockTreeTermsWriter$TermsWriter.writeBlock(Lucene103BlockTreeTermsWriter.java:803)
at org.apache.lucene.codecs.lucene103.blocktree.Lucene103BlockTreeTermsWriter$TermsWriter.writeBlocks(Lucene103BlockTreeTermsWriter.java:670)
at org.apache.lucene.codecs.lucene103.blocktree.Lucene103BlockTreeTermsWriter$TermsWriter.finish(Lucene103BlockTreeTermsWriter.java:1073)
at org.apache.lucene.codecs.lucene103.blocktree.Lucene103BlockTreeTermsWriter.write(Lucene103BlockTreeTermsWriter.java:396)
at org.apache.lucene.codecs.perfield.PerFieldPostingsFormat$FieldsWriter.write(PerFieldPostingsFormat.java:162)
at org.apache.lucene.index.FreqProxTermsWriter.flush(FreqProxTermsWriter.java:133)
at org.apache.lucene.index.IndexingChain.flush(IndexingChain.java:342)
at org.apache.lucene.index.DocumentsWriterPerThread.flush(DocumentsWriterPerThread.java:456)
at org.apache.lucene.index.DocumentsWriter.doFlush(DocumentsWriter.java:502)
at org.apache.lucene.index.DocumentsWriter.maybeFlush(DocumentsWriter.java:456)
at org.apache.lucene.index.DocumentsWriter.flushAllThreads(DocumentsWriter.java:649)
at org.apache.lucene.index.IndexWriter.prepareCommitInternal(IndexWriter.java:3712)
at org.apache.lucene.index.IndexWriter.commitInternal(IndexWriter.java:4160)
at org.apache.lucene.index.IndexWriter.commit(IndexWriter.java:4122)
at org.apache.solr.update.DirectUpdateHandler2.commit(DirectUpdateHandler2.java:871)
at org.apache.solr.update.processor.RunUpdateProcessorFactory$RunUpdateProcessor.processCommit(RunUpdateProcessorFactory.java:100)
at org.apache.solr.update.processor.UpdateRequestProcessor.processCommit(UpdateRequestProcessor.java:66)
at org.apache.solr.update.processor.UpdateRequestProcessor.processCommit(UpdateRequestProcessor.java:66)
at org.apache.solr.update.processor.DistributedUpdateProcessor.doLocalCommit(DistributedUpdateProcessor.java:1174)
at org.apache.solr.update.processor.DistributedUpdateProcessor.processCommit(DistributedUpdateProcessor.java:1160)
at org.apache.solr.update.processor.LogUpdateProcessorFactory$LogUpdateProcessor.processCommit(LogUpdateProcessorFactory.java:173)
at org.apache.solr.handler.loader.XMLLoader.processUpdate(XMLLoader.java:214)
at org.apache.solr.handler.loader.XMLLoader.load(XMLLoader.java:120)
FAILED: org.apache.solr.update.SolrIndexFingerprintTest.testSequentialVsParallelFingerprint
Error Message:
java.lang.OutOfMemoryError: Java heap space
Stack Trace:
java.lang.OutOfMemoryError: Java heap space
at __randomizedtesting.SeedInfo.seed([F1E3E7C8214A73FD:9196C44C77F881E0]:0)
at java.base/java.util.HashMap.resize(HashMap.java:711)
at java.base/java.util.HashMap.putVal(HashMap.java:670)
at java.base/java.util.HashMap.put(HashMap.java:619)
at java.base/java.util.HashSet.add(HashSet.java:230)
at org.apache.lucene.index.ReaderPool.noDups(ReaderPool.java:450)
at org.apache.lucene.index.ReaderPool.get(ReaderPool.java:427)
at org.apache.lucene.index.IndexWriter.getPooledInstance(IndexWriter.java:6203)
at org.apache.lucene.index.IndexWriter.openSegmentStates(IndexWriter.java:6510)
at org.apache.lucene.index.IndexWriter.forceApply(IndexWriter.java:6284)
at org.apache.lucene.index.IndexWriter.tryApply(IndexWriter.java:6218)
at org.apache.lucene.index.IndexWriter.lambda$publishFrozenUpdates$12(IndexWriter.java:2839)
at org.apache.lucene.index.IndexWriter$$Lambda/0x0000000012740648.process(Unknown Source)
at org.apache.lucene.index.IndexWriter$EventQueue.processEventsInternal(IndexWriter.java:339)
at org.apache.lucene.index.IndexWriter$EventQueue.processEvents(IndexWriter.java:328)
at org.apache.lucene.index.IndexWriter.processEvents(IndexWriter.java:6061)
at org.apache.lucene.index.IndexWriter.prepareCommitInternal(IndexWriter.java:3724)
at org.apache.lucene.index.IndexWriter.commitInternal(IndexWriter.java:4160)
at org.apache.lucene.index.IndexWriter.commit(IndexWriter.java:4122)
at org.apache.solr.update.DirectUpdateHandler2.commit(DirectUpdateHandler2.java:871)
at org.apache.solr.update.processor.RunUpdateProcessorFactory$RunUpdateProcessor.processCommit(RunUpdateProcessorFactory.java:100)
at org.apache.solr.update.processor.UpdateRequestProcessor.processCommit(UpdateRequestProcessor.java:66)
at org.apache.solr.update.processor.UpdateRequestProcessor.processCommit(UpdateRequestProcessor.java:66)
at org.apache.solr.update.processor.DistributedUpdateProcessor.doLocalCommit(DistributedUpdateProcessor.java:1174)
at org.apache.solr.update.processor.DistributedUpdateProcessor.processCommit(DistributedUpdateProcessor.java:1160)
at org.apache.solr.update.processor.LogUpdateProcessorFactory$LogUpdateProcessor.processCommit(LogUpdateProcessorFactory.java:173)
at org.apache.solr.handler.loader.XMLLoader.processUpdate(XMLLoader.java:214)
at org.apache.solr.handler.loader.XMLLoader.load(XMLLoader.java:120)
at org.apache.solr.handler.UpdateRequestHandler$1.load(UpdateRequestHandler.java:101)
at org.apache.solr.handler.ContentStreamHandlerBase.handleRequestBody(ContentStreamHandlerBase.java:99)
at org.apache.solr.handler.RequestHandlerBase.handleRequest(RequestHandlerBase.java:251)
at org.apache.solr.core.SolrCore.execute(SolrCore.java:2921)
at org.apache.solr.client.solrj.embedded.EmbeddedSolrServer.request(EmbeddedSolrServer.java:227)