You are viewing a plain text version of this content. The canonical link for it is here.
Posted to notifications@maven.apache.org by Apache Jenkins Server <je...@builds.apache.org> on 2012/11/22 15:11:52 UTC

Build failed in Jenkins: maven-plugins-ITs-m3.0.3 #63

See <https://builds.apache.org/job/maven-plugins-ITs-m3.0.3/63/changes>

Changes:

[andham] Fixed some formatting.

[andham] Fixed some incorrectly AFT-formatted links.

[andham] Added missing entries to the list of examples.

------------------------------------------
[...truncated 9805 lines...]
 T E S T S
-------------------------------------------------------
Running org.apache.maven.plugins.shade.mojo.ArtifactSelectorTest
Tests run: 1, Failures: 0, Errors: 0, Skipped: 0, Time elapsed: 0.028 sec
Running org.apache.maven.plugins.shade.mojo.ShadeMojoTest
Tests run: 4, Failures: 0, Errors: 0, Skipped: 0, Time elapsed: 2.437 sec
Running org.apache.maven.plugins.shade.mojo.RelativizePathTest
Tests run: 1, Failures: 0, Errors: 0, Skipped: 0, Time elapsed: 0.025 sec
Running org.apache.maven.plugins.shade.mojo.ArtifactIdTest
Tests run: 2, Failures: 0, Errors: 0, Skipped: 0, Time elapsed: 0.002 sec
Running org.apache.maven.plugins.shade.DefaultShaderTest
Tests run: 4, Failures: 0, Errors: 0, Skipped: 0, Time elapsed: 0.819 sec
Running org.apache.maven.plugins.shade.resource.AppendingTransformerTest
Tests run: 1, Failures: 0, Errors: 0, Skipped: 0, Time elapsed: 0.001 sec
Running org.apache.maven.plugins.shade.resource.ApacheNoticeResourceTransformerTest
Tests run: 1, Failures: 0, Errors: 0, Skipped: 0, Time elapsed: 0.001 sec
Running org.apache.maven.plugins.shade.resource.XmlAppendingTransformerTest
Tests run: 1, Failures: 0, Errors: 0, Skipped: 0, Time elapsed: 0.005 sec
Running org.apache.maven.plugins.shade.resource.ApacheLicenseResourceTransformerTest
Tests run: 1, Failures: 0, Errors: 0, Skipped: 0, Time elapsed: 0.001 sec
Running org.apache.maven.plugins.shade.resource.ComponentsXmlResourceTransformerTest
Tests run: 1, Failures: 0, Errors: 0, Skipped: 0, Time elapsed: 0.058 sec
Running org.apache.maven.plugins.shade.filter.SimpleFilterTest
Tests run: 1, Failures: 0, Errors: 0, Skipped: 0, Time elapsed: 0 sec
Running org.apache.maven.plugins.shade.relocation.SimpleRelocatorParameterTest
Tests run: 2, Failures: 0, Errors: 0, Skipped: 0, Time elapsed: 0 sec
Running org.apache.maven.plugins.shade.relocation.SimpleRelocatorTest
Tests run: 7, Failures: 0, Errors: 0, Skipped: 0, Time elapsed: 0.003 sec

Results :

Tests run: 27, Failures: 0, Errors: 0, Skipped: 0

[INFO] 
[INFO] --- maven-jar-plugin:2.4:jar (default-jar) @ maven-shade-plugin ---
[INFO] Building jar: <https://builds.apache.org/job/maven-plugins-ITs-m3.0.3/ws/maven-shade-plugin/target/maven-shade-plugin-2.0.1-SNAPSHOT.jar>
[INFO] 
[INFO] --- maven-plugin-plugin:3.2:addPluginArtifactMetadata (default-addPluginArtifactMetadata) @ maven-shade-plugin ---
[INFO] 
[INFO] --- maven-jar-plugin:2.4:test-jar (default) @ maven-shade-plugin ---
[INFO] Building jar: <https://builds.apache.org/job/maven-plugins-ITs-m3.0.3/ws/maven-shade-plugin/target/maven-shade-plugin-2.0.1-SNAPSHOT-tests.jar>
[INFO] 
[INFO] --- maven-invoker-plugin:1.6:install (integration-test) @ maven-shade-plugin ---
[INFO] Installing <https://builds.apache.org/job/maven-plugins-ITs-m3.0.3/ws/maven-shade-plugin/pom.xml> to <https://builds.apache.org/job/maven-plugins-ITs-m3.0.3/ws/maven-shade-plugin/target/local-repo/org/apache/maven/plugins/maven-shade-plugin/2.0.1-SNAPSHOT/maven-shade-plugin-2.0.1-SNAPSHOT.pom>
[INFO] Installing <https://builds.apache.org/job/maven-plugins-ITs-m3.0.3/ws/maven-shade-plugin/target/maven-shade-plugin-2.0.1-SNAPSHOT.jar> to <https://builds.apache.org/job/maven-plugins-ITs-m3.0.3/ws/maven-shade-plugin/target/local-repo/org/apache/maven/plugins/maven-shade-plugin/2.0.1-SNAPSHOT/maven-shade-plugin-2.0.1-SNAPSHOT.jar>
[INFO] Installing <https://builds.apache.org/job/maven-plugins-ITs-m3.0.3/ws/maven-shade-plugin/target/maven-shade-plugin-2.0.1-SNAPSHOT-tests.jar> to <https://builds.apache.org/job/maven-plugins-ITs-m3.0.3/ws/maven-shade-plugin/target/local-repo/org/apache/maven/plugins/maven-shade-plugin/2.0.1-SNAPSHOT/maven-shade-plugin-2.0.1-SNAPSHOT-tests.jar>
[INFO] 
[INFO] --- maven-invoker-plugin:1.6:integration-test (integration-test) @ maven-shade-plugin ---
[INFO] Building: xml-transformer-ignores-dtd/pom.xml
[INFO] run script <https://builds.apache.org/job/maven-plugins-ITs-m3.0.3/ws/maven-shade-plugin/target/it/xml-transformer-ignores-dtd/verify.bsh>
[INFO] ..SUCCESS (4.2 s)
[INFO] Building: attach-after-lifecycle-fork/pom.xml
[INFO] run script <https://builds.apache.org/job/maven-plugins-ITs-m3.0.3/ws/maven-shade-plugin/target/it/attach-after-lifecycle-fork/setup.bsh>
[INFO] run script <https://builds.apache.org/job/maven-plugins-ITs-m3.0.3/ws/maven-shade-plugin/target/it/attach-after-lifecycle-fork/verify.bsh>
[INFO] ..SUCCESS (3.2 s)
[INFO] Building: duplicate-classes-without-reloc/pom.xml
[INFO] ..SUCCESS (3.0 s)
[INFO] Building: filter-artifact-contents/pom.xml
[INFO] run script <https://builds.apache.org/job/maven-plugins-ITs-m3.0.3/ws/maven-shade-plugin/target/it/filter-artifact-contents/verify.bsh>
[INFO] ..SUCCESS (4.0 s)
[INFO] Building: component-descriptor-relocation/pom.xml
[INFO] ..SUCCESS (4.6 s)
[INFO] Building: finalNameShade/pom.xml
[INFO] run script <https://builds.apache.org/job/maven-plugins-ITs-m3.0.3/ws/maven-shade-plugin/target/it/finalNameShade/setup.bsh>
[INFO] run script <https://builds.apache.org/job/maven-plugins-ITs-m3.0.3/ws/maven-shade-plugin/target/it/finalNameShade/verify.bsh>
[INFO] ..SUCCESS (3.7 s)
[INFO] Building: manifest-retained/pom.xml
[INFO] run script <https://builds.apache.org/job/maven-plugins-ITs-m3.0.3/ws/maven-shade-plugin/target/it/manifest-retained/verify.bsh>
[INFO] ..SUCCESS (4.7 s)
[INFO] Building: manifest-transformed/pom.xml
[INFO] run script <https://builds.apache.org/job/maven-plugins-ITs-m3.0.3/ws/maven-shade-plugin/target/it/manifest-transformed/verify.bsh>
[INFO] ..SUCCESS (4.6 s)
[INFO] Building: services-resource-transformer/pom.xml
[INFO] run script <https://builds.apache.org/job/maven-plugins-ITs-m3.0.3/ws/maven-shade-plugin/target/it/services-resource-transformer/verify.bsh>
[INFO] ..SUCCESS (3.8 s)
[INFO] Building: pom-packaging/pom.xml
[INFO] run script <https://builds.apache.org/job/maven-plugins-ITs-m3.0.3/ws/maven-shade-plugin/target/it/pom-packaging/verify.bsh>
[INFO] ..SUCCESS (2.6 s)
[INFO] Building: non-runtime-scope-excluded/pom.xml
[INFO] run script <https://builds.apache.org/job/maven-plugins-ITs-m3.0.3/ws/maven-shade-plugin/target/it/non-runtime-scope-excluded/verify.bsh>
[INFO] ..SUCCESS (3.7 s)
[INFO] Building: reloc-anno/pom.xml
[INFO] ..SUCCESS (3.3 s)
[INFO] Building: mini-jar-respect-includes/pom.xml
[INFO] run script <https://builds.apache.org/job/maven-plugins-ITs-m3.0.3/ws/maven-shade-plugin/target/it/mini-jar-respect-includes/verify.bsh>
[INFO] ..SUCCESS (4.9 s)
[INFO] Building: empty-relocation-pattern/pom.xml
[INFO] ..SUCCESS (3.6 s)
[INFO] Building: finalNameBuild/pom.xml
[INFO] run script <https://builds.apache.org/job/maven-plugins-ITs-m3.0.3/ws/maven-shade-plugin/target/it/finalNameBuild/setup.bsh>
[INFO] run script <https://builds.apache.org/job/maven-plugins-ITs-m3.0.3/ws/maven-shade-plugin/target/it/finalNameBuild/verify.bsh>
[INFO] ..SUCCESS (3.7 s)
[INFO] Building: attached-artifact-type/pom.xml
[INFO] ..SUCCESS (3.0 s)
[INFO] Building: empty-relocation-shaded-pattern/pom.xml
[INFO] ..SUCCESS (3.5 s)
[INFO] Building: reloc-includes-excludes/pom.xml
[INFO] run script <https://builds.apache.org/job/maven-plugins-ITs-m3.0.3/ws/maven-shade-plugin/target/it/reloc-includes-excludes/verify.bsh>
[INFO] ..SUCCESS (4.4 s)
[INFO] Building: rerun-with-reloc/pom.xml
[INFO] ..SUCCESS (5.2 s)
[INFO] Building: implicit-inclusion-of-project-artifact/pom.xml
[INFO] run script <https://builds.apache.org/job/maven-plugins-ITs-m3.0.3/ws/maven-shade-plugin/target/it/implicit-inclusion-of-project-artifact/verify.bsh>
[INFO] ..SUCCESS (3.8 s)
[INFO] Building: duplicate-classes-with-reloc/pom.xml
[INFO] ..SUCCESS (2.9 s)
[INFO] Building: dep-reduced-pom/pom.xml
[INFO] run script <https://builds.apache.org/job/maven-plugins-ITs-m3.0.3/ws/maven-shade-plugin/target/it/dep-reduced-pom/verify.groovy>
[INFO] ..SUCCESS (3.8 s)
[INFO] Building: rerun-without-reloc/pom.xml
[INFO] ..SUCCESS (3.6 s)
[INFO] Building: finalNameBuild-attached/pom.xml
[INFO] run script <https://builds.apache.org/job/maven-plugins-ITs-m3.0.3/ws/maven-shade-plugin/target/it/finalNameBuild-attached/setup.bsh>
[INFO] run script <https://builds.apache.org/job/maven-plugins-ITs-m3.0.3/ws/maven-shade-plugin/target/it/finalNameBuild-attached/verify.bsh>
[INFO] ..SUCCESS (3.9 s)
[INFO] Building: finalNameShade-attached/pom.xml
[INFO] run script <https://builds.apache.org/job/maven-plugins-ITs-m3.0.3/ws/maven-shade-plugin/target/it/finalNameShade-attached/setup.bsh>
[INFO] run script <https://builds.apache.org/job/maven-plugins-ITs-m3.0.3/ws/maven-shade-plugin/target/it/finalNameShade-attached/verify.bsh>
[INFO] ..SUCCESS (3.8 s)
[INFO] Building: shadePomDependency/pom.xml
[INFO] ..SUCCESS (4.6 s)
[INFO] Building: artifact-includes-excludes/pom.xml
[INFO] run script <https://builds.apache.org/job/maven-plugins-ITs-m3.0.3/ws/maven-shade-plugin/target/it/artifact-includes-excludes/verify.bsh>
[INFO] ..SUCCESS (3.8 s)
[INFO] Building: reloc-enum-ref-from-anno/pom.xml
[INFO] ..SUCCESS (3.5 s)
[INFO] Building: mini-jar-package-info/pom.xml
[INFO] run script <https://builds.apache.org/job/maven-plugins-ITs-m3.0.3/ws/maven-shade-plugin/target/it/mini-jar-package-info/verify.bsh>
[INFO] ..SUCCESS (4.4 s)
[INFO] Building: project-with-reactors-included/pom.xml
[INFO] run script <https://builds.apache.org/job/maven-plugins-ITs-m3.0.3/ws/maven-shade-plugin/target/it/project-with-reactors-included/verify.bsh>
[INFO] ..SUCCESS (5.2 s)
[INFO] Building: dep-reduced-pom-with-local-parent/pom.xml
[INFO] ..SUCCESS (2.8 s)
[INFO] Building: mini-jar/pom.xml
[INFO] run script <https://builds.apache.org/job/maven-plugins-ITs-m3.0.3/ws/maven-shade-plugin/target/it/mini-jar/verify.bsh>
[INFO] ..SUCCESS (4.1 s)
[INFO] Building: dep-reduced-pom-unique/pom.xml
[INFO] run script <https://builds.apache.org/job/maven-plugins-ITs-m3.0.3/ws/maven-shade-plugin/target/it/dep-reduced-pom-unique/verify.groovy>
[INFO] ..SUCCESS (3.9 s)
[INFO] Building: mini-jar-malformed-dependencies/pom.xml
[INFO] ..SUCCESS (7.8 s)
[INFO] Building: reloc-abs-resource-path/pom.xml
[INFO] ..SUCCESS (5.7 s)
[INFO] Building: MSHADE-105/pom.xml
[INFO] run script <https://builds.apache.org/job/maven-plugins-ITs-m3.0.3/ws/maven-shade-plugin/target/it/MSHADE-105/verify.bsh>
[INFO] ..SUCCESS (6.7 s)
[INFO] Building: mshade-123/pom.xml
[INFO] ..SUCCESS (5.6 s)
[INFO] Building: reloc-class-from-string-pool/pom.xml
[INFO] ..SUCCESS (3.3 s)
[INFO] Building: users-shader-impl/pom.xml
[INFO] run script <https://builds.apache.org/job/maven-plugins-ITs-m3.0.3/ws/maven-shade-plugin/target/it/users-shader-impl/verify.groovy>
[INFO] ..SUCCESS (4.2 s)
[INFO] Building: empty-apache-notice-transform/pom.xml
[INFO] ..SUCCESS (4.4 s)
[INFO] Building: dep-reduced-pom-relocated-result/pom.xml
[INFO] ..SUCCESS (2.7 s)
[INFO] 
[INFO] --- maven-invoker-plugin:1.6:verify (integration-test) @ maven-shade-plugin ---
[INFO] -------------------------------------------------
[INFO] Build Summary:
[INFO]   Passed: 41, Failed: 0, Errors: 0, Skipped: 0
[INFO] -------------------------------------------------
[INFO] 
[INFO] --- maven-install-plugin:2.3.1:install (default-install) @ maven-shade-plugin ---
[INFO] Installing <https://builds.apache.org/job/maven-plugins-ITs-m3.0.3/ws/maven-shade-plugin/target/maven-shade-plugin-2.0.1-SNAPSHOT.jar> to /home/jenkins/.m2/repository/org/apache/maven/plugins/maven-shade-plugin/2.0.1-SNAPSHOT/maven-shade-plugin-2.0.1-SNAPSHOT.jar
[INFO] Installing <https://builds.apache.org/job/maven-plugins-ITs-m3.0.3/ws/maven-shade-plugin/pom.xml> to /home/jenkins/.m2/repository/org/apache/maven/plugins/maven-shade-plugin/2.0.1-SNAPSHOT/maven-shade-plugin-2.0.1-SNAPSHOT.pom
[INFO] Installing <https://builds.apache.org/job/maven-plugins-ITs-m3.0.3/ws/maven-shade-plugin/target/maven-shade-plugin-2.0.1-SNAPSHOT-tests.jar> to /home/jenkins/.m2/repository/org/apache/maven/plugins/maven-shade-plugin/2.0.1-SNAPSHOT/maven-shade-plugin-2.0.1-SNAPSHOT-tests.jar
[INFO]                                                                         
[INFO] ------------------------------------------------------------------------
[INFO] Building Maven Plugins Aggregator 1-SNAPSHOT
[INFO] ------------------------------------------------------------------------
[INFO] 
[INFO] --- maven-clean-plugin:2.4.1:clean (default-clean) @ maven-plugins-aggregator ---
[INFO] Deleting <https://builds.apache.org/job/maven-plugins-ITs-m3.0.3/ws/target>
[INFO] 
[INFO] --- maven-remote-resources-plugin:1.1:process (default) @ maven-plugins-aggregator ---
[INFO] 
[INFO] --- maven-install-plugin:2.3.1:install (default-install) @ maven-plugins-aggregator ---
[INFO] Installing <https://builds.apache.org/job/maven-plugins-ITs-m3.0.3/ws/pom.xml> to /home/jenkins/.m2/repository/org/apache/maven/plugins/maven-plugins-aggregator/1-SNAPSHOT/maven-plugins-aggregator-1-SNAPSHOT.pom
[INFO] ------------------------------------------------------------------------
[INFO] Reactor Summary:
[INFO] 
[INFO] Maven Plugins ..................................... SUCCESS [9.891s]
[INFO] Maven ACR Plugin .................................. SUCCESS [26.338s]
[INFO] Maven Ant Plugin .................................. SUCCESS [1:06.237s]
[INFO] Maven AntRun Plugin ............................... SUCCESS [58.769s]
[INFO] Maven Eclipse Plugin .............................. SUCCESS [7:37.790s]
[INFO] Maven Assembly Plugin ............................. SUCCESS [11:00.770s]
[INFO] Maven Changelog Plugin ............................ SUCCESS [57.534s]
[INFO] Maven Changes Report Plugin ....................... SUCCESS [1:07.348s]
[INFO] Maven Checkstyle Plugin ........................... SUCCESS [1:48.359s]
[INFO] Maven Clean Plugin ................................ SUCCESS [21.434s]
[INFO] Maven Compiler Plugin ............................. SUCCESS [1:05.433s]
[INFO] Maven Dependency Plugin ........................... FAILURE [0.555s]
[INFO] Maven Deploy Plugin ............................... SUCCESS [1:06.296s]
[INFO] Maven DOAP Plugin ................................. SUCCESS [18.373s]
[INFO] Maven Documentation Checker Plugin ................ SUCCESS [7.459s]
[INFO] Maven EAR Plugin .................................. SUCCESS [3:58.481s]
[INFO] Maven EJB Plugin .................................. SUCCESS [28.437s]
[INFO] Maven GPG Plugin .................................. SUCCESS [10.154s]
[INFO] Maven Help Plugin ................................. SUCCESS [37.509s]
[INFO] Maven IDEA Plugin ................................. SUCCESS [7.704s]
[INFO] Maven Install Plugin .............................. SUCCESS [41.638s]
[INFO] Maven JAR Plugin .................................. SUCCESS [1:14.597s]
[INFO] Maven Jarsigner Plugin ............................ SUCCESS [25.988s]
[INFO] Maven Javadoc Plugin .............................. SUCCESS [2:54.487s]
[INFO] Maven Linkcheck Plugin ............................ SUCCESS [3.383s]
[INFO] Maven One Plugin .................................. SUCCESS [1.812s]
[INFO] Maven Patch Plugin ................................ SUCCESS [14.461s]
[INFO] Maven PDF Plugin .................................. SUCCESS [34.715s]
[INFO] Maven PMD Plugin .................................. SUCCESS [41.375s]
[INFO] Maven RAR Plugin .................................. SUCCESS [11.137s]
[INFO] Maven Reactor Plugin .............................. SUCCESS [3.028s]
[INFO] Maven Repository Plugin ........................... SUCCESS [43.200s]
[INFO] Maven Resources Plugin ............................ SUCCESS [57.002s]
[INFO] Maven Site Plugin 3 ............................... SUCCESS [7:09.397s]
[INFO] Maven Source Plugin ............................... SUCCESS [50.074s]
[INFO] Maven Stage Plugin ................................ SUCCESS [3.025s]
[INFO] Maven Toolchains Plugin ........................... SUCCESS [2.003s]
[INFO] Maven Verifier Plugin ............................. SUCCESS [17.150s]
[INFO] Maven WAR Plugin .................................. SUCCESS [1:19.393s]
[INFO] SCM Publish Maven Plugin .......................... SUCCESS [54.445s]
[INFO] Maven Invoker Plugin .............................. SUCCESS [4:21.298s]
[INFO] Maven Project Info Reports Plugin ................. SUCCESS [2:36.792s]
[INFO] Maven Remote Resources Plugin ..................... SUCCESS [52.489s]
[INFO] Maven Shade Plugin ................................ SUCCESS [3:14.675s]
[INFO] Maven Plugins Aggregator .......................... SUCCESS [0.064s]
[INFO] ------------------------------------------------------------------------
[INFO] BUILD FAILURE
[INFO] ------------------------------------------------------------------------
[INFO] Total time: 1:04:04.327s
[INFO] Finished at: Thu Nov 22 14:11:20 UTC 2012
[INFO] Final Memory: 84M/317M
[INFO] ------------------------------------------------------------------------
[WARNING] The requested profile "apache.snapshots" could not be activated because it does not exist.
[ERROR] Failed to execute goal on project maven-dependency-plugin: Could not resolve dependencies for project org.apache.maven.plugins:maven-dependency-plugin:maven-plugin:2.7-SNAPSHOT: Could not find artifact org.apache.maven.shared:maven-dependency-analyzer:jar:1.3 in central (http://repo1.maven.org/maven2) -> [Help 1]
[ERROR] 
[ERROR] To see the full stack trace of the errors, re-run Maven with the -e switch.
[ERROR] Re-run Maven using the -X switch to enable full debug logging.
[ERROR] 
[ERROR] For more information about the errors and possible solutions, please read the following articles:
[ERROR] [Help 1] http://cwiki.apache.org/confluence/display/MAVEN/DependencyResolutionException
[ERROR] 
[ERROR] After correcting the problems, you can resume the build with the command
[ERROR]   mvn <goals> -rf :maven-dependency-plugin
Build step 'Invoke top-level Maven targets' marked build as failure
Recording test results

Jenkins build is back to normal : maven-plugins-ITs-m3.0.3 #74

Posted by Apache Jenkins Server <je...@builds.apache.org>.
See <https://builds.apache.org/job/maven-plugins-ITs-m3.0.3/74/changes>


Build failed in Jenkins: maven-plugins-ITs-m3.0.3 #73

Posted by Apache Jenkins Server <je...@builds.apache.org>.
See <https://builds.apache.org/job/maven-plugins-ITs-m3.0.3/73/changes>

Changes:

[Robert Scholte] [MSHADE-135] Add PluginXmlTransformer

------------------------------------------
[...truncated 9835 lines...]
Tests run: 1, Failures: 0, Errors: 0, Skipped: 0, Time elapsed: 0.028 sec
Running org.apache.maven.plugins.shade.mojo.ShadeMojoTest
Tests run: 4, Failures: 0, Errors: 0, Skipped: 0, Time elapsed: 2.411 sec
Running org.apache.maven.plugins.shade.mojo.RelativizePathTest
Tests run: 1, Failures: 0, Errors: 0, Skipped: 0, Time elapsed: 0.017 sec
Running org.apache.maven.plugins.shade.mojo.ArtifactIdTest
Tests run: 2, Failures: 0, Errors: 0, Skipped: 0, Time elapsed: 0.002 sec
Running org.apache.maven.plugins.shade.DefaultShaderTest
Tests run: 4, Failures: 0, Errors: 0, Skipped: 0, Time elapsed: 0.821 sec
Running org.apache.maven.plugins.shade.resource.AppendingTransformerTest
Tests run: 1, Failures: 0, Errors: 0, Skipped: 0, Time elapsed: 0.001 sec
Running org.apache.maven.plugins.shade.resource.ApacheNoticeResourceTransformerTest
Tests run: 1, Failures: 0, Errors: 0, Skipped: 0, Time elapsed: 0.002 sec
Running org.apache.maven.plugins.shade.resource.XmlAppendingTransformerTest
Tests run: 1, Failures: 0, Errors: 0, Skipped: 0, Time elapsed: 0.006 sec
Running org.apache.maven.plugins.shade.resource.ApacheLicenseResourceTransformerTest
Tests run: 1, Failures: 0, Errors: 0, Skipped: 0, Time elapsed: 0.001 sec
Running org.apache.maven.plugins.shade.resource.ComponentsXmlResourceTransformerTest
Tests run: 1, Failures: 0, Errors: 0, Skipped: 0, Time elapsed: 0.06 sec
Running org.apache.maven.plugins.shade.filter.SimpleFilterTest
Tests run: 1, Failures: 0, Errors: 0, Skipped: 0, Time elapsed: 0 sec
Running org.apache.maven.plugins.shade.relocation.SimpleRelocatorParameterTest
Tests run: 2, Failures: 0, Errors: 0, Skipped: 0, Time elapsed: 0 sec
Running org.apache.maven.plugins.shade.relocation.SimpleRelocatorTest
Tests run: 7, Failures: 0, Errors: 0, Skipped: 0, Time elapsed: 0.003 sec

Results :

Tests run: 27, Failures: 0, Errors: 0, Skipped: 0

[INFO] 
[INFO] --- maven-jar-plugin:2.4:jar (default-jar) @ maven-shade-plugin ---
[INFO] Building jar: <https://builds.apache.org/job/maven-plugins-ITs-m3.0.3/ws/maven-shade-plugin/target/maven-shade-plugin-3.0-SNAPSHOT.jar>
[INFO] 
[INFO] --- maven-plugin-plugin:3.2:addPluginArtifactMetadata (default-addPluginArtifactMetadata) @ maven-shade-plugin ---
[INFO] 
[INFO] --- maven-jar-plugin:2.4:test-jar (default) @ maven-shade-plugin ---
[INFO] Building jar: <https://builds.apache.org/job/maven-plugins-ITs-m3.0.3/ws/maven-shade-plugin/target/maven-shade-plugin-3.0-SNAPSHOT-tests.jar>
[INFO] 
[INFO] --- maven-invoker-plugin:1.6:install (integration-test) @ maven-shade-plugin ---
[INFO] Installing <https://builds.apache.org/job/maven-plugins-ITs-m3.0.3/ws/maven-shade-plugin/pom.xml> to <https://builds.apache.org/job/maven-plugins-ITs-m3.0.3/ws/maven-shade-plugin/target/local-repo/org/apache/maven/plugins/maven-shade-plugin/3.0-SNAPSHOT/maven-shade-plugin-3.0-SNAPSHOT.pom>
[INFO] Installing <https://builds.apache.org/job/maven-plugins-ITs-m3.0.3/ws/maven-shade-plugin/target/maven-shade-plugin-3.0-SNAPSHOT.jar> to <https://builds.apache.org/job/maven-plugins-ITs-m3.0.3/ws/maven-shade-plugin/target/local-repo/org/apache/maven/plugins/maven-shade-plugin/3.0-SNAPSHOT/maven-shade-plugin-3.0-SNAPSHOT.jar>
[INFO] Installing <https://builds.apache.org/job/maven-plugins-ITs-m3.0.3/ws/maven-shade-plugin/target/maven-shade-plugin-3.0-SNAPSHOT-tests.jar> to <https://builds.apache.org/job/maven-plugins-ITs-m3.0.3/ws/maven-shade-plugin/target/local-repo/org/apache/maven/plugins/maven-shade-plugin/3.0-SNAPSHOT/maven-shade-plugin-3.0-SNAPSHOT-tests.jar>
[INFO] 
[INFO] --- maven-invoker-plugin:1.6:integration-test (integration-test) @ maven-shade-plugin ---
[INFO] Building: xml-transformer-ignores-dtd/pom.xml
[INFO] run script <https://builds.apache.org/job/maven-plugins-ITs-m3.0.3/ws/maven-shade-plugin/target/it/xml-transformer-ignores-dtd/verify.bsh>
[INFO] ..SUCCESS (4.1 s)
[INFO] Building: attach-after-lifecycle-fork/pom.xml
[INFO] run script <https://builds.apache.org/job/maven-plugins-ITs-m3.0.3/ws/maven-shade-plugin/target/it/attach-after-lifecycle-fork/setup.bsh>
[INFO] run script <https://builds.apache.org/job/maven-plugins-ITs-m3.0.3/ws/maven-shade-plugin/target/it/attach-after-lifecycle-fork/verify.bsh>
[INFO] ..SUCCESS (3.2 s)
[INFO] Building: duplicate-classes-without-reloc/pom.xml
[INFO] ..SUCCESS (3.0 s)
[INFO] Building: filter-artifact-contents/pom.xml
[INFO] run script <https://builds.apache.org/job/maven-plugins-ITs-m3.0.3/ws/maven-shade-plugin/target/it/filter-artifact-contents/verify.bsh>
[INFO] ..SUCCESS (3.8 s)
[INFO] Building: component-descriptor-relocation/pom.xml
[INFO] ..SUCCESS (4.4 s)
[INFO] Building: finalNameShade/pom.xml
[INFO] run script <https://builds.apache.org/job/maven-plugins-ITs-m3.0.3/ws/maven-shade-plugin/target/it/finalNameShade/setup.bsh>
[INFO] run script <https://builds.apache.org/job/maven-plugins-ITs-m3.0.3/ws/maven-shade-plugin/target/it/finalNameShade/verify.bsh>
[INFO] ..SUCCESS (3.7 s)
[INFO] Building: manifest-retained/pom.xml
[INFO] run script <https://builds.apache.org/job/maven-plugins-ITs-m3.0.3/ws/maven-shade-plugin/target/it/manifest-retained/verify.bsh>
[INFO] ..SUCCESS (4.7 s)
[INFO] Building: manifest-transformed/pom.xml
[INFO] run script <https://builds.apache.org/job/maven-plugins-ITs-m3.0.3/ws/maven-shade-plugin/target/it/manifest-transformed/verify.bsh>
[INFO] ..SUCCESS (4.6 s)
[INFO] Building: services-resource-transformer/pom.xml
[INFO] run script <https://builds.apache.org/job/maven-plugins-ITs-m3.0.3/ws/maven-shade-plugin/target/it/services-resource-transformer/verify.bsh>
[INFO] ..SUCCESS (3.7 s)
[INFO] Building: plugin-descriptor-relocation/pom.xml
[INFO] run script <https://builds.apache.org/job/maven-plugins-ITs-m3.0.3/ws/maven-shade-plugin/target/it/plugin-descriptor-relocation/verify.groovy>
[INFO] ..SUCCESS (7.4 s)
[INFO] Building: pom-packaging/pom.xml
[INFO] run script <https://builds.apache.org/job/maven-plugins-ITs-m3.0.3/ws/maven-shade-plugin/target/it/pom-packaging/verify.bsh>
[INFO] ..SUCCESS (2.6 s)
[INFO] Building: non-runtime-scope-excluded/pom.xml
[INFO] run script <https://builds.apache.org/job/maven-plugins-ITs-m3.0.3/ws/maven-shade-plugin/target/it/non-runtime-scope-excluded/verify.bsh>
[INFO] ..SUCCESS (3.6 s)
[INFO] Building: reloc-anno/pom.xml
[INFO] ..SUCCESS (3.4 s)
[INFO] Building: mini-jar-respect-includes/pom.xml
[INFO] run script <https://builds.apache.org/job/maven-plugins-ITs-m3.0.3/ws/maven-shade-plugin/target/it/mini-jar-respect-includes/verify.bsh>
[INFO] ..SUCCESS (4.5 s)
[INFO] Building: empty-relocation-pattern/pom.xml
[INFO] ..SUCCESS (3.7 s)
[INFO] Building: finalNameBuild/pom.xml
[INFO] run script <https://builds.apache.org/job/maven-plugins-ITs-m3.0.3/ws/maven-shade-plugin/target/it/finalNameBuild/setup.bsh>
[INFO] run script <https://builds.apache.org/job/maven-plugins-ITs-m3.0.3/ws/maven-shade-plugin/target/it/finalNameBuild/verify.bsh>
[INFO] ..SUCCESS (3.8 s)
[INFO] Building: attached-artifact-type/pom.xml
[INFO] ..SUCCESS (3.0 s)
[INFO] Building: empty-relocation-shaded-pattern/pom.xml
[INFO] ..SUCCESS (3.7 s)
[INFO] Building: reloc-includes-excludes/pom.xml
[INFO] run script <https://builds.apache.org/job/maven-plugins-ITs-m3.0.3/ws/maven-shade-plugin/target/it/reloc-includes-excludes/verify.bsh>
[INFO] ..SUCCESS (4.5 s)
[INFO] Building: rerun-with-reloc/pom.xml
[INFO] ..SUCCESS (5.7 s)
[INFO] Building: implicit-inclusion-of-project-artifact/pom.xml
[INFO] run script <https://builds.apache.org/job/maven-plugins-ITs-m3.0.3/ws/maven-shade-plugin/target/it/implicit-inclusion-of-project-artifact/verify.bsh>
[INFO] ..SUCCESS (4.0 s)
[INFO] Building: duplicate-classes-with-reloc/pom.xml
[INFO] ..SUCCESS (2.9 s)
[INFO] Building: dep-reduced-pom/pom.xml
[INFO] run script <https://builds.apache.org/job/maven-plugins-ITs-m3.0.3/ws/maven-shade-plugin/target/it/dep-reduced-pom/verify.groovy>
[INFO] ..SUCCESS (3.9 s)
[INFO] Building: rerun-without-reloc/pom.xml
[INFO] ..SUCCESS (3.6 s)
[INFO] Building: finalNameBuild-attached/pom.xml
[INFO] run script <https://builds.apache.org/job/maven-plugins-ITs-m3.0.3/ws/maven-shade-plugin/target/it/finalNameBuild-attached/setup.bsh>
[INFO] run script <https://builds.apache.org/job/maven-plugins-ITs-m3.0.3/ws/maven-shade-plugin/target/it/finalNameBuild-attached/verify.bsh>
[INFO] ..SUCCESS (3.7 s)
[INFO] Building: finalNameShade-attached/pom.xml
[INFO] run script <https://builds.apache.org/job/maven-plugins-ITs-m3.0.3/ws/maven-shade-plugin/target/it/finalNameShade-attached/setup.bsh>
[INFO] run script <https://builds.apache.org/job/maven-plugins-ITs-m3.0.3/ws/maven-shade-plugin/target/it/finalNameShade-attached/verify.bsh>
[INFO] ..SUCCESS (3.6 s)
[INFO] Building: shadePomDependency/pom.xml
[INFO] ..SUCCESS (4.9 s)
[INFO] Building: artifact-includes-excludes/pom.xml
[INFO] run script <https://builds.apache.org/job/maven-plugins-ITs-m3.0.3/ws/maven-shade-plugin/target/it/artifact-includes-excludes/verify.bsh>
[INFO] ..SUCCESS (3.8 s)
[INFO] Building: reloc-enum-ref-from-anno/pom.xml
[INFO] ..SUCCESS (3.3 s)
[INFO] Building: mini-jar-package-info/pom.xml
[INFO] run script <https://builds.apache.org/job/maven-plugins-ITs-m3.0.3/ws/maven-shade-plugin/target/it/mini-jar-package-info/verify.bsh>
[INFO] ..SUCCESS (4.4 s)
[INFO] Building: project-with-reactors-included/pom.xml
[INFO] run script <https://builds.apache.org/job/maven-plugins-ITs-m3.0.3/ws/maven-shade-plugin/target/it/project-with-reactors-included/verify.bsh>
[INFO] ..SUCCESS (5.3 s)
[INFO] Building: dep-reduced-pom-with-local-parent/pom.xml
[INFO] ..SUCCESS (2.9 s)
[INFO] Building: mini-jar/pom.xml
[INFO] run script <https://builds.apache.org/job/maven-plugins-ITs-m3.0.3/ws/maven-shade-plugin/target/it/mini-jar/verify.bsh>
[INFO] ..SUCCESS (4.1 s)
[INFO] Building: dep-reduced-pom-unique/pom.xml
[INFO] run script <https://builds.apache.org/job/maven-plugins-ITs-m3.0.3/ws/maven-shade-plugin/target/it/dep-reduced-pom-unique/verify.groovy>
[INFO] ..SUCCESS (4.1 s)
[INFO] Building: mini-jar-malformed-dependencies/pom.xml
[INFO] ..SUCCESS (7.4 s)
[INFO] Building: reloc-abs-resource-path/pom.xml
[INFO] ..SUCCESS (5.3 s)
[INFO] Building: MSHADE-105/pom.xml
[INFO] run script <https://builds.apache.org/job/maven-plugins-ITs-m3.0.3/ws/maven-shade-plugin/target/it/MSHADE-105/verify.bsh>
[INFO] ..SUCCESS (7.0 s)
[INFO] Building: mshade-123/pom.xml
[INFO] ..SUCCESS (5.5 s)
[INFO] Building: reloc-class-from-string-pool/pom.xml
[INFO] ..SUCCESS (3.4 s)
[INFO] Building: users-shader-impl/pom.xml
[INFO] run script <https://builds.apache.org/job/maven-plugins-ITs-m3.0.3/ws/maven-shade-plugin/target/it/users-shader-impl/verify.groovy>
[INFO] ..SUCCESS (4.2 s)
[INFO] Building: empty-apache-notice-transform/pom.xml
[INFO] ..SUCCESS (4.2 s)
[INFO] Building: dep-reduced-pom-relocated-result/pom.xml
[INFO] ..SUCCESS (2.9 s)
[INFO] 
[INFO] --- maven-invoker-plugin:1.6:verify (integration-test) @ maven-shade-plugin ---
[INFO] -------------------------------------------------
[INFO] Build Summary:
[INFO]   Passed: 42, Failed: 0, Errors: 0, Skipped: 0
[INFO] -------------------------------------------------
[INFO] 
[INFO] --- maven-install-plugin:2.3.1:install (default-install) @ maven-shade-plugin ---
[INFO] Installing <https://builds.apache.org/job/maven-plugins-ITs-m3.0.3/ws/maven-shade-plugin/target/maven-shade-plugin-3.0-SNAPSHOT.jar> to /home/jenkins/.m2/repository/org/apache/maven/plugins/maven-shade-plugin/3.0-SNAPSHOT/maven-shade-plugin-3.0-SNAPSHOT.jar
[INFO] Installing <https://builds.apache.org/job/maven-plugins-ITs-m3.0.3/ws/maven-shade-plugin/pom.xml> to /home/jenkins/.m2/repository/org/apache/maven/plugins/maven-shade-plugin/3.0-SNAPSHOT/maven-shade-plugin-3.0-SNAPSHOT.pom
[INFO] Installing <https://builds.apache.org/job/maven-plugins-ITs-m3.0.3/ws/maven-shade-plugin/target/maven-shade-plugin-3.0-SNAPSHOT-tests.jar> to /home/jenkins/.m2/repository/org/apache/maven/plugins/maven-shade-plugin/3.0-SNAPSHOT/maven-shade-plugin-3.0-SNAPSHOT-tests.jar
[INFO]                                                                         
[INFO] ------------------------------------------------------------------------
[INFO] Building Maven Plugins Aggregator 1-SNAPSHOT
[INFO] ------------------------------------------------------------------------
[INFO] 
[INFO] --- maven-clean-plugin:2.4.1:clean (default-clean) @ maven-plugins-aggregator ---
[INFO] Deleting <https://builds.apache.org/job/maven-plugins-ITs-m3.0.3/ws/target>
[INFO] 
[INFO] --- maven-remote-resources-plugin:1.1:process (default) @ maven-plugins-aggregator ---
[INFO] 
[INFO] --- maven-install-plugin:2.3.1:install (default-install) @ maven-plugins-aggregator ---
[INFO] Installing <https://builds.apache.org/job/maven-plugins-ITs-m3.0.3/ws/pom.xml> to /home/jenkins/.m2/repository/org/apache/maven/plugins/maven-plugins-aggregator/1-SNAPSHOT/maven-plugins-aggregator-1-SNAPSHOT.pom
[INFO] ------------------------------------------------------------------------
[INFO] Reactor Summary:
[INFO] 
[INFO] Maven Plugins ..................................... SUCCESS [3.050s]
[INFO] Maven ACR Plugin .................................. SUCCESS [22.046s]
[INFO] Maven Ant Plugin .................................. SUCCESS [1:08.832s]
[INFO] Maven AntRun Plugin ............................... SUCCESS [53.352s]
[INFO] Maven Eclipse Plugin .............................. SUCCESS [6:50.730s]
[INFO] Maven Assembly Plugin ............................. SUCCESS [11:14.465s]
[INFO] Maven Changelog Plugin ............................ SUCCESS [52.521s]
[INFO] Maven Changes Report Plugin ....................... SUCCESS [1:05.540s]
[INFO] Maven Checkstyle Plugin ........................... SUCCESS [1:41.288s]
[INFO] Maven Clean Plugin ................................ SUCCESS [21.196s]
[INFO] Maven Compiler Plugin ............................. SUCCESS [1:05.323s]
[INFO] Maven Dependency Plugin ........................... FAILURE [0.219s]
[INFO] Maven Deploy Plugin ............................... SUCCESS [1:03.253s]
[INFO] Maven DOAP Plugin ................................. SUCCESS [18.542s]
[INFO] Maven Documentation Checker Plugin ................ SUCCESS [7.259s]
[INFO] Maven EAR Plugin .................................. SUCCESS [3:56.045s]
[INFO] Maven EJB Plugin .................................. SUCCESS [28.569s]
[INFO] Maven GPG Plugin .................................. SUCCESS [10.112s]
[INFO] Maven Help Plugin ................................. SUCCESS [35.049s]
[INFO] Maven IDEA Plugin ................................. SUCCESS [7.753s]
[INFO] Maven Install Plugin .............................. SUCCESS [40.344s]
[INFO] Maven JAR Plugin .................................. SUCCESS [1:11.784s]
[INFO] Maven Jarsigner Plugin ............................ SUCCESS [24.448s]
[INFO] Maven Javadoc Plugin .............................. SUCCESS [3:23.666s]
[INFO] Maven Linkcheck Plugin ............................ SUCCESS [2.933s]
[INFO] Maven One Plugin .................................. SUCCESS [2.837s]
[INFO] Maven Patch Plugin ................................ SUCCESS [12.940s]
[INFO] Maven PDF Plugin .................................. SUCCESS [2:31.274s]
[INFO] Maven PMD Plugin .................................. SUCCESS [44.132s]
[INFO] Maven RAR Plugin .................................. SUCCESS [11.159s]
[INFO] Maven Reactor Plugin .............................. SUCCESS [2.976s]
[INFO] Maven Repository Plugin ........................... SUCCESS [42.919s]
[INFO] Maven Resources Plugin ............................ SUCCESS [56.075s]
[INFO] Maven Site Plugin 3 ............................... SUCCESS [6:55.156s]
[INFO] Maven Source Plugin ............................... SUCCESS [46.126s]
[INFO] Maven Stage Plugin ................................ SUCCESS [2.201s]
[INFO] Maven Toolchains Plugin ........................... SUCCESS [1.978s]
[INFO] Maven Verifier Plugin ............................. SUCCESS [15.721s]
[INFO] Maven WAR Plugin .................................. SUCCESS [1:21.066s]
[INFO] SCM Publish Maven Plugin .......................... SUCCESS [53.157s]
[INFO] Maven Invoker Plugin .............................. SUCCESS [4:26.846s]
[INFO] Maven Project Info Reports Plugin ................. SUCCESS [2:43.446s]
[INFO] Maven Remote Resources Plugin ..................... SUCCESS [51.036s]
[INFO] Maven Shade Plugin ................................ SUCCESS [3:19.131s]
[INFO] Maven Plugins Aggregator .......................... SUCCESS [0.074s]
[INFO] ------------------------------------------------------------------------
[INFO] BUILD FAILURE
[INFO] ------------------------------------------------------------------------
[INFO] Total time: 1:05:10.327s
[INFO] Finished at: Sun Nov 25 21:12:36 UTC 2012
[INFO] Final Memory: 85M/315M
[INFO] ------------------------------------------------------------------------
[WARNING] The requested profile "apache.snapshots" could not be activated because it does not exist.
[ERROR] Failed to execute goal on project maven-dependency-plugin: Could not resolve dependencies for project org.apache.maven.plugins:maven-dependency-plugin:maven-plugin:2.7-SNAPSHOT: Could not find artifact org.apache.maven.shared:maven-dependency-analyzer:jar:1.3 in central (http://repo1.maven.org/maven2) -> [Help 1]
[ERROR] 
[ERROR] To see the full stack trace of the errors, re-run Maven with the -e switch.
[ERROR] Re-run Maven using the -X switch to enable full debug logging.
[ERROR] 
[ERROR] For more information about the errors and possible solutions, please read the following articles:
[ERROR] [Help 1] http://cwiki.apache.org/confluence/display/MAVEN/DependencyResolutionException
[ERROR] 
[ERROR] After correcting the problems, you can resume the build with the command
[ERROR]   mvn <goals> -rf :maven-dependency-plugin
Build step 'Invoke top-level Maven targets' marked build as failure
Recording test results

Build failed in Jenkins: maven-plugins-ITs-m3.0.3 #72

Posted by Apache Jenkins Server <je...@builds.apache.org>.
See <https://builds.apache.org/job/maven-plugins-ITs-m3.0.3/72/changes>

Changes:

[olamy] add contributor

[olamy] [MPMD-159] Threadsafety issue when used in parallel builds.
Submitted by Ryan Heinen.

------------------------------------------
[...truncated 9805 lines...]
 T E S T S
-------------------------------------------------------
Running org.apache.maven.plugins.shade.mojo.ArtifactSelectorTest
Tests run: 1, Failures: 0, Errors: 0, Skipped: 0, Time elapsed: 0.026 sec
Running org.apache.maven.plugins.shade.mojo.ShadeMojoTest
Tests run: 4, Failures: 0, Errors: 0, Skipped: 0, Time elapsed: 2.382 sec
Running org.apache.maven.plugins.shade.mojo.RelativizePathTest
Tests run: 1, Failures: 0, Errors: 0, Skipped: 0, Time elapsed: 0.031 sec
Running org.apache.maven.plugins.shade.mojo.ArtifactIdTest
Tests run: 2, Failures: 0, Errors: 0, Skipped: 0, Time elapsed: 0.004 sec
Running org.apache.maven.plugins.shade.DefaultShaderTest
Tests run: 4, Failures: 0, Errors: 0, Skipped: 0, Time elapsed: 0.84 sec
Running org.apache.maven.plugins.shade.resource.AppendingTransformerTest
Tests run: 1, Failures: 0, Errors: 0, Skipped: 0, Time elapsed: 0 sec
Running org.apache.maven.plugins.shade.resource.ApacheNoticeResourceTransformerTest
Tests run: 1, Failures: 0, Errors: 0, Skipped: 0, Time elapsed: 0.001 sec
Running org.apache.maven.plugins.shade.resource.XmlAppendingTransformerTest
Tests run: 1, Failures: 0, Errors: 0, Skipped: 0, Time elapsed: 0.005 sec
Running org.apache.maven.plugins.shade.resource.ApacheLicenseResourceTransformerTest
Tests run: 1, Failures: 0, Errors: 0, Skipped: 0, Time elapsed: 0 sec
Running org.apache.maven.plugins.shade.resource.ComponentsXmlResourceTransformerTest
Tests run: 1, Failures: 0, Errors: 0, Skipped: 0, Time elapsed: 0.06 sec
Running org.apache.maven.plugins.shade.filter.SimpleFilterTest
Tests run: 1, Failures: 0, Errors: 0, Skipped: 0, Time elapsed: 0 sec
Running org.apache.maven.plugins.shade.relocation.SimpleRelocatorParameterTest
Tests run: 2, Failures: 0, Errors: 0, Skipped: 0, Time elapsed: 0 sec
Running org.apache.maven.plugins.shade.relocation.SimpleRelocatorTest
Tests run: 7, Failures: 0, Errors: 0, Skipped: 0, Time elapsed: 0.003 sec

Results :

Tests run: 27, Failures: 0, Errors: 0, Skipped: 0

[INFO] 
[INFO] --- maven-jar-plugin:2.4:jar (default-jar) @ maven-shade-plugin ---
[INFO] Building jar: <https://builds.apache.org/job/maven-plugins-ITs-m3.0.3/ws/maven-shade-plugin/target/maven-shade-plugin-3.0-SNAPSHOT.jar>
[INFO] 
[INFO] --- maven-plugin-plugin:3.2:addPluginArtifactMetadata (default-addPluginArtifactMetadata) @ maven-shade-plugin ---
[INFO] 
[INFO] --- maven-jar-plugin:2.4:test-jar (default) @ maven-shade-plugin ---
[INFO] Building jar: <https://builds.apache.org/job/maven-plugins-ITs-m3.0.3/ws/maven-shade-plugin/target/maven-shade-plugin-3.0-SNAPSHOT-tests.jar>
[INFO] 
[INFO] --- maven-invoker-plugin:1.6:install (integration-test) @ maven-shade-plugin ---
[INFO] Installing <https://builds.apache.org/job/maven-plugins-ITs-m3.0.3/ws/maven-shade-plugin/pom.xml> to <https://builds.apache.org/job/maven-plugins-ITs-m3.0.3/ws/maven-shade-plugin/target/local-repo/org/apache/maven/plugins/maven-shade-plugin/3.0-SNAPSHOT/maven-shade-plugin-3.0-SNAPSHOT.pom>
[INFO] Installing <https://builds.apache.org/job/maven-plugins-ITs-m3.0.3/ws/maven-shade-plugin/target/maven-shade-plugin-3.0-SNAPSHOT.jar> to <https://builds.apache.org/job/maven-plugins-ITs-m3.0.3/ws/maven-shade-plugin/target/local-repo/org/apache/maven/plugins/maven-shade-plugin/3.0-SNAPSHOT/maven-shade-plugin-3.0-SNAPSHOT.jar>
[INFO] Installing <https://builds.apache.org/job/maven-plugins-ITs-m3.0.3/ws/maven-shade-plugin/target/maven-shade-plugin-3.0-SNAPSHOT-tests.jar> to <https://builds.apache.org/job/maven-plugins-ITs-m3.0.3/ws/maven-shade-plugin/target/local-repo/org/apache/maven/plugins/maven-shade-plugin/3.0-SNAPSHOT/maven-shade-plugin-3.0-SNAPSHOT-tests.jar>
[INFO] 
[INFO] --- maven-invoker-plugin:1.6:integration-test (integration-test) @ maven-shade-plugin ---
[INFO] Building: xml-transformer-ignores-dtd/pom.xml
[INFO] run script <https://builds.apache.org/job/maven-plugins-ITs-m3.0.3/ws/maven-shade-plugin/target/it/xml-transformer-ignores-dtd/verify.bsh>
[INFO] ..SUCCESS (4.2 s)
[INFO] Building: attach-after-lifecycle-fork/pom.xml
[INFO] run script <https://builds.apache.org/job/maven-plugins-ITs-m3.0.3/ws/maven-shade-plugin/target/it/attach-after-lifecycle-fork/setup.bsh>
[INFO] run script <https://builds.apache.org/job/maven-plugins-ITs-m3.0.3/ws/maven-shade-plugin/target/it/attach-after-lifecycle-fork/verify.bsh>
[INFO] ..SUCCESS (3.3 s)
[INFO] Building: duplicate-classes-without-reloc/pom.xml
[INFO] ..SUCCESS (2.9 s)
[INFO] Building: filter-artifact-contents/pom.xml
[INFO] run script <https://builds.apache.org/job/maven-plugins-ITs-m3.0.3/ws/maven-shade-plugin/target/it/filter-artifact-contents/verify.bsh>
[INFO] ..SUCCESS (3.6 s)
[INFO] Building: component-descriptor-relocation/pom.xml
[INFO] ..SUCCESS (4.2 s)
[INFO] Building: finalNameShade/pom.xml
[INFO] run script <https://builds.apache.org/job/maven-plugins-ITs-m3.0.3/ws/maven-shade-plugin/target/it/finalNameShade/setup.bsh>
[INFO] run script <https://builds.apache.org/job/maven-plugins-ITs-m3.0.3/ws/maven-shade-plugin/target/it/finalNameShade/verify.bsh>
[INFO] ..SUCCESS (3.5 s)
[INFO] Building: manifest-retained/pom.xml
[INFO] run script <https://builds.apache.org/job/maven-plugins-ITs-m3.0.3/ws/maven-shade-plugin/target/it/manifest-retained/verify.bsh>
[INFO] ..SUCCESS (4.6 s)
[INFO] Building: manifest-transformed/pom.xml
[INFO] run script <https://builds.apache.org/job/maven-plugins-ITs-m3.0.3/ws/maven-shade-plugin/target/it/manifest-transformed/verify.bsh>
[INFO] ..SUCCESS (4.8 s)
[INFO] Building: services-resource-transformer/pom.xml
[INFO] run script <https://builds.apache.org/job/maven-plugins-ITs-m3.0.3/ws/maven-shade-plugin/target/it/services-resource-transformer/verify.bsh>
[INFO] ..SUCCESS (3.8 s)
[INFO] Building: pom-packaging/pom.xml
[INFO] run script <https://builds.apache.org/job/maven-plugins-ITs-m3.0.3/ws/maven-shade-plugin/target/it/pom-packaging/verify.bsh>
[INFO] ..SUCCESS (2.6 s)
[INFO] Building: non-runtime-scope-excluded/pom.xml
[INFO] run script <https://builds.apache.org/job/maven-plugins-ITs-m3.0.3/ws/maven-shade-plugin/target/it/non-runtime-scope-excluded/verify.bsh>
[INFO] ..SUCCESS (3.7 s)
[INFO] Building: reloc-anno/pom.xml
[INFO] ..SUCCESS (3.3 s)
[INFO] Building: mini-jar-respect-includes/pom.xml
[INFO] run script <https://builds.apache.org/job/maven-plugins-ITs-m3.0.3/ws/maven-shade-plugin/target/it/mini-jar-respect-includes/verify.bsh>
[INFO] ..SUCCESS (4.4 s)
[INFO] Building: empty-relocation-pattern/pom.xml
[INFO] ..SUCCESS (3.6 s)
[INFO] Building: finalNameBuild/pom.xml
[INFO] run script <https://builds.apache.org/job/maven-plugins-ITs-m3.0.3/ws/maven-shade-plugin/target/it/finalNameBuild/setup.bsh>
[INFO] run script <https://builds.apache.org/job/maven-plugins-ITs-m3.0.3/ws/maven-shade-plugin/target/it/finalNameBuild/verify.bsh>
[INFO] ..SUCCESS (3.6 s)
[INFO] Building: attached-artifact-type/pom.xml
[INFO] ..SUCCESS (3.6 s)
[INFO] Building: empty-relocation-shaded-pattern/pom.xml
[INFO] ..SUCCESS (3.3 s)
[INFO] Building: reloc-includes-excludes/pom.xml
[INFO] run script <https://builds.apache.org/job/maven-plugins-ITs-m3.0.3/ws/maven-shade-plugin/target/it/reloc-includes-excludes/verify.bsh>
[INFO] ..SUCCESS (4.3 s)
[INFO] Building: rerun-with-reloc/pom.xml
[INFO] ..SUCCESS (4.8 s)
[INFO] Building: implicit-inclusion-of-project-artifact/pom.xml
[INFO] run script <https://builds.apache.org/job/maven-plugins-ITs-m3.0.3/ws/maven-shade-plugin/target/it/implicit-inclusion-of-project-artifact/verify.bsh>
[INFO] ..SUCCESS (3.8 s)
[INFO] Building: duplicate-classes-with-reloc/pom.xml
[INFO] ..SUCCESS (2.9 s)
[INFO] Building: dep-reduced-pom/pom.xml
[INFO] run script <https://builds.apache.org/job/maven-plugins-ITs-m3.0.3/ws/maven-shade-plugin/target/it/dep-reduced-pom/verify.groovy>
[INFO] ..SUCCESS (3.7 s)
[INFO] Building: rerun-without-reloc/pom.xml
[INFO] ..SUCCESS (3.5 s)
[INFO] Building: finalNameBuild-attached/pom.xml
[INFO] run script <https://builds.apache.org/job/maven-plugins-ITs-m3.0.3/ws/maven-shade-plugin/target/it/finalNameBuild-attached/setup.bsh>
[INFO] run script <https://builds.apache.org/job/maven-plugins-ITs-m3.0.3/ws/maven-shade-plugin/target/it/finalNameBuild-attached/verify.bsh>
[INFO] ..SUCCESS (3.7 s)
[INFO] Building: finalNameShade-attached/pom.xml
[INFO] run script <https://builds.apache.org/job/maven-plugins-ITs-m3.0.3/ws/maven-shade-plugin/target/it/finalNameShade-attached/setup.bsh>
[INFO] run script <https://builds.apache.org/job/maven-plugins-ITs-m3.0.3/ws/maven-shade-plugin/target/it/finalNameShade-attached/verify.bsh>
[INFO] ..SUCCESS (3.6 s)
[INFO] Building: shadePomDependency/pom.xml
[INFO] ..SUCCESS (4.3 s)
[INFO] Building: artifact-includes-excludes/pom.xml
[INFO] run script <https://builds.apache.org/job/maven-plugins-ITs-m3.0.3/ws/maven-shade-plugin/target/it/artifact-includes-excludes/verify.bsh>
[INFO] ..SUCCESS (3.9 s)
[INFO] Building: reloc-enum-ref-from-anno/pom.xml
[INFO] ..SUCCESS (3.3 s)
[INFO] Building: mini-jar-package-info/pom.xml
[INFO] run script <https://builds.apache.org/job/maven-plugins-ITs-m3.0.3/ws/maven-shade-plugin/target/it/mini-jar-package-info/verify.bsh>
[INFO] ..SUCCESS (4.5 s)
[INFO] Building: project-with-reactors-included/pom.xml
[INFO] run script <https://builds.apache.org/job/maven-plugins-ITs-m3.0.3/ws/maven-shade-plugin/target/it/project-with-reactors-included/verify.bsh>
[INFO] ..SUCCESS (5.5 s)
[INFO] Building: dep-reduced-pom-with-local-parent/pom.xml
[INFO] ..SUCCESS (2.7 s)
[INFO] Building: mini-jar/pom.xml
[INFO] run script <https://builds.apache.org/job/maven-plugins-ITs-m3.0.3/ws/maven-shade-plugin/target/it/mini-jar/verify.bsh>
[INFO] ..SUCCESS (3.9 s)
[INFO] Building: dep-reduced-pom-unique/pom.xml
[INFO] run script <https://builds.apache.org/job/maven-plugins-ITs-m3.0.3/ws/maven-shade-plugin/target/it/dep-reduced-pom-unique/verify.groovy>
[INFO] ..SUCCESS (4.0 s)
[INFO] Building: mini-jar-malformed-dependencies/pom.xml
[INFO] ..SUCCESS (7.3 s)
[INFO] Building: reloc-abs-resource-path/pom.xml
[INFO] ..SUCCESS (6.3 s)
[INFO] Building: MSHADE-105/pom.xml
[INFO] run script <https://builds.apache.org/job/maven-plugins-ITs-m3.0.3/ws/maven-shade-plugin/target/it/MSHADE-105/verify.bsh>
[INFO] ..SUCCESS (17.3 s)
[INFO] Building: mshade-123/pom.xml
[INFO] ..SUCCESS (6.6 s)
[INFO] Building: reloc-class-from-string-pool/pom.xml
[INFO] ..SUCCESS (3.4 s)
[INFO] Building: users-shader-impl/pom.xml
[INFO] run script <https://builds.apache.org/job/maven-plugins-ITs-m3.0.3/ws/maven-shade-plugin/target/it/users-shader-impl/verify.groovy>
[INFO] ..SUCCESS (4.3 s)
[INFO] Building: empty-apache-notice-transform/pom.xml
[INFO] ..SUCCESS (4.5 s)
[INFO] Building: dep-reduced-pom-relocated-result/pom.xml
[INFO] ..SUCCESS (2.8 s)
[INFO] 
[INFO] --- maven-invoker-plugin:1.6:verify (integration-test) @ maven-shade-plugin ---
[INFO] -------------------------------------------------
[INFO] Build Summary:
[INFO]   Passed: 41, Failed: 0, Errors: 0, Skipped: 0
[INFO] -------------------------------------------------
[INFO] 
[INFO] --- maven-install-plugin:2.3.1:install (default-install) @ maven-shade-plugin ---
[INFO] Installing <https://builds.apache.org/job/maven-plugins-ITs-m3.0.3/ws/maven-shade-plugin/target/maven-shade-plugin-3.0-SNAPSHOT.jar> to /home/jenkins/.m2/repository/org/apache/maven/plugins/maven-shade-plugin/3.0-SNAPSHOT/maven-shade-plugin-3.0-SNAPSHOT.jar
[INFO] Installing <https://builds.apache.org/job/maven-plugins-ITs-m3.0.3/ws/maven-shade-plugin/pom.xml> to /home/jenkins/.m2/repository/org/apache/maven/plugins/maven-shade-plugin/3.0-SNAPSHOT/maven-shade-plugin-3.0-SNAPSHOT.pom
[INFO] Installing <https://builds.apache.org/job/maven-plugins-ITs-m3.0.3/ws/maven-shade-plugin/target/maven-shade-plugin-3.0-SNAPSHOT-tests.jar> to /home/jenkins/.m2/repository/org/apache/maven/plugins/maven-shade-plugin/3.0-SNAPSHOT/maven-shade-plugin-3.0-SNAPSHOT-tests.jar
[INFO]                                                                         
[INFO] ------------------------------------------------------------------------
[INFO] Building Maven Plugins Aggregator 1-SNAPSHOT
[INFO] ------------------------------------------------------------------------
[INFO] 
[INFO] --- maven-clean-plugin:2.4.1:clean (default-clean) @ maven-plugins-aggregator ---
[INFO] Deleting <https://builds.apache.org/job/maven-plugins-ITs-m3.0.3/ws/target>
[INFO] 
[INFO] --- maven-remote-resources-plugin:1.1:process (default) @ maven-plugins-aggregator ---
[INFO] 
[INFO] --- maven-install-plugin:2.3.1:install (default-install) @ maven-plugins-aggregator ---
[INFO] Installing <https://builds.apache.org/job/maven-plugins-ITs-m3.0.3/ws/pom.xml> to /home/jenkins/.m2/repository/org/apache/maven/plugins/maven-plugins-aggregator/1-SNAPSHOT/maven-plugins-aggregator-1-SNAPSHOT.pom
[INFO] ------------------------------------------------------------------------
[INFO] Reactor Summary:
[INFO] 
[INFO] Maven Plugins ..................................... SUCCESS [2.855s]
[INFO] Maven ACR Plugin .................................. SUCCESS [20.888s]
[INFO] Maven Ant Plugin .................................. SUCCESS [1:05.076s]
[INFO] Maven AntRun Plugin ............................... SUCCESS [52.820s]
[INFO] Maven Eclipse Plugin .............................. SUCCESS [6:23.676s]
[INFO] Maven Assembly Plugin ............................. SUCCESS [11:02.932s]
[INFO] Maven Changelog Plugin ............................ SUCCESS [51.520s]
[INFO] Maven Changes Report Plugin ....................... SUCCESS [1:02.972s]
[INFO] Maven Checkstyle Plugin ........................... SUCCESS [1:39.185s]
[INFO] Maven Clean Plugin ................................ SUCCESS [21.584s]
[INFO] Maven Compiler Plugin ............................. SUCCESS [1:06.018s]
[INFO] Maven Dependency Plugin ........................... FAILURE [0.257s]
[INFO] Maven Deploy Plugin ............................... SUCCESS [1:03.129s]
[INFO] Maven DOAP Plugin ................................. SUCCESS [19.797s]
[INFO] Maven Documentation Checker Plugin ................ SUCCESS [6.109s]
[INFO] Maven EAR Plugin .................................. SUCCESS [3:56.983s]
[INFO] Maven EJB Plugin .................................. SUCCESS [29.014s]
[INFO] Maven GPG Plugin .................................. SUCCESS [10.572s]
[INFO] Maven Help Plugin ................................. SUCCESS [35.267s]
[INFO] Maven IDEA Plugin ................................. SUCCESS [7.512s]
[INFO] Maven Install Plugin .............................. SUCCESS [41.187s]
[INFO] Maven JAR Plugin .................................. SUCCESS [1:13.757s]
[INFO] Maven Jarsigner Plugin ............................ SUCCESS [24.530s]
[INFO] Maven Javadoc Plugin .............................. SUCCESS [2:54.794s]
[INFO] Maven Linkcheck Plugin ............................ SUCCESS [3.197s]
[INFO] Maven One Plugin .................................. SUCCESS [2.030s]
[INFO] Maven Patch Plugin ................................ SUCCESS [14.112s]
[INFO] Maven PDF Plugin .................................. SUCCESS [44.759s]
[INFO] Maven PMD Plugin .................................. SUCCESS [55.529s]
[INFO] Maven RAR Plugin .................................. SUCCESS [10.936s]
[INFO] Maven Reactor Plugin .............................. SUCCESS [3.168s]
[INFO] Maven Repository Plugin ........................... SUCCESS [45.080s]
[INFO] Maven Resources Plugin ............................ SUCCESS [1:03.307s]
[INFO] Maven Site Plugin 3 ............................... SUCCESS [6:33.573s]
[INFO] Maven Source Plugin ............................... SUCCESS [49.641s]
[INFO] Maven Stage Plugin ................................ SUCCESS [2.445s]
[INFO] Maven Toolchains Plugin ........................... SUCCESS [2.084s]
[INFO] Maven Verifier Plugin ............................. SUCCESS [17.566s]
[INFO] Maven WAR Plugin .................................. SUCCESS [1:21.865s]
[INFO] SCM Publish Maven Plugin .......................... SUCCESS [53.042s]
[INFO] Maven Invoker Plugin .............................. SUCCESS [4:23.466s]
[INFO] Maven Project Info Reports Plugin ................. SUCCESS [2:39.970s]
[INFO] Maven Remote Resources Plugin ..................... SUCCESS [49.901s]
[INFO] Maven Shade Plugin ................................ SUCCESS [3:25.252s]
[INFO] Maven Plugins Aggregator .......................... SUCCESS [0.070s]
[INFO] ------------------------------------------------------------------------
[INFO] BUILD FAILURE
[INFO] ------------------------------------------------------------------------
[INFO] Total time: 1:02:14.865s
[INFO] Finished at: Sat Nov 24 23:13:29 UTC 2012
[INFO] Final Memory: 85M/308M
[INFO] ------------------------------------------------------------------------
[WARNING] The requested profile "apache.snapshots" could not be activated because it does not exist.
[ERROR] Failed to execute goal on project maven-dependency-plugin: Could not resolve dependencies for project org.apache.maven.plugins:maven-dependency-plugin:maven-plugin:2.7-SNAPSHOT: Could not find artifact org.apache.maven.shared:maven-dependency-analyzer:jar:1.3 in central (http://repo1.maven.org/maven2) -> [Help 1]
[ERROR] 
[ERROR] To see the full stack trace of the errors, re-run Maven with the -e switch.
[ERROR] Re-run Maven using the -X switch to enable full debug logging.
[ERROR] 
[ERROR] For more information about the errors and possible solutions, please read the following articles:
[ERROR] [Help 1] http://cwiki.apache.org/confluence/display/MAVEN/DependencyResolutionException
[ERROR] 
[ERROR] After correcting the problems, you can resume the build with the command
[ERROR]   mvn <goals> -rf :maven-dependency-plugin
Build step 'Invoke top-level Maven targets' marked build as failure
Recording test results

Build failed in Jenkins: maven-plugins-ITs-m3.0.3 #71

Posted by Apache Jenkins Server <je...@builds.apache.org>.
See <https://builds.apache.org/job/maven-plugins-ITs-m3.0.3/71/changes>

Changes:

[bimargulies] (no JIRA): update pom version to 3.0-SNAPSHOT to prep for fixing fight with
incremental use of JAR plugin.

[olamy] [MEAR-164] support for useJvmChmod in archiver and true per default

------------------------------------------
[...truncated 9806 lines...]
 T E S T S
-------------------------------------------------------
Running org.apache.maven.plugins.shade.DefaultShaderTest
Tests run: 4, Failures: 0, Errors: 0, Skipped: 0, Time elapsed: 1.423 sec
Running org.apache.maven.plugins.shade.resource.ApacheLicenseResourceTransformerTest
Tests run: 1, Failures: 0, Errors: 0, Skipped: 0, Time elapsed: 0.003 sec
Running org.apache.maven.plugins.shade.resource.XmlAppendingTransformerTest
Tests run: 1, Failures: 0, Errors: 0, Skipped: 0, Time elapsed: 0.005 sec
Running org.apache.maven.plugins.shade.resource.AppendingTransformerTest
Tests run: 1, Failures: 0, Errors: 0, Skipped: 0, Time elapsed: 0 sec
Running org.apache.maven.plugins.shade.resource.ApacheNoticeResourceTransformerTest
Tests run: 1, Failures: 0, Errors: 0, Skipped: 0, Time elapsed: 0.001 sec
Running org.apache.maven.plugins.shade.resource.ComponentsXmlResourceTransformerTest
Tests run: 1, Failures: 0, Errors: 0, Skipped: 0, Time elapsed: 0.06 sec
Running org.apache.maven.plugins.shade.mojo.ShadeMojoTest
Tests run: 4, Failures: 0, Errors: 0, Skipped: 0, Time elapsed: 1.471 sec
Running org.apache.maven.plugins.shade.mojo.RelativizePathTest
Tests run: 1, Failures: 0, Errors: 0, Skipped: 0, Time elapsed: 0.016 sec
Running org.apache.maven.plugins.shade.mojo.ArtifactSelectorTest
Tests run: 1, Failures: 0, Errors: 0, Skipped: 0, Time elapsed: 0.001 sec
Running org.apache.maven.plugins.shade.mojo.ArtifactIdTest
Tests run: 2, Failures: 0, Errors: 0, Skipped: 0, Time elapsed: 0.001 sec
Running org.apache.maven.plugins.shade.filter.SimpleFilterTest
Tests run: 1, Failures: 0, Errors: 0, Skipped: 0, Time elapsed: 0 sec
Running org.apache.maven.plugins.shade.relocation.SimpleRelocatorTest
Tests run: 7, Failures: 0, Errors: 0, Skipped: 0, Time elapsed: 0.002 sec
Running org.apache.maven.plugins.shade.relocation.SimpleRelocatorParameterTest
Tests run: 2, Failures: 0, Errors: 0, Skipped: 0, Time elapsed: 0 sec

Results :

Tests run: 27, Failures: 0, Errors: 0, Skipped: 0

[INFO] 
[INFO] --- maven-jar-plugin:2.4:jar (default-jar) @ maven-shade-plugin ---
[INFO] Building jar: <https://builds.apache.org/job/maven-plugins-ITs-m3.0.3/ws/maven-shade-plugin/target/maven-shade-plugin-3.0-SNAPSHOT.jar>
[INFO] 
[INFO] --- maven-plugin-plugin:3.2:addPluginArtifactMetadata (default-addPluginArtifactMetadata) @ maven-shade-plugin ---
[INFO] 
[INFO] --- maven-jar-plugin:2.4:test-jar (default) @ maven-shade-plugin ---
[INFO] Building jar: <https://builds.apache.org/job/maven-plugins-ITs-m3.0.3/ws/maven-shade-plugin/target/maven-shade-plugin-3.0-SNAPSHOT-tests.jar>
[INFO] 
[INFO] --- maven-invoker-plugin:1.6:install (integration-test) @ maven-shade-plugin ---
[INFO] Installing <https://builds.apache.org/job/maven-plugins-ITs-m3.0.3/ws/maven-shade-plugin/pom.xml> to <https://builds.apache.org/job/maven-plugins-ITs-m3.0.3/ws/maven-shade-plugin/target/local-repo/org/apache/maven/plugins/maven-shade-plugin/3.0-SNAPSHOT/maven-shade-plugin-3.0-SNAPSHOT.pom>
[INFO] Installing <https://builds.apache.org/job/maven-plugins-ITs-m3.0.3/ws/maven-shade-plugin/target/maven-shade-plugin-3.0-SNAPSHOT.jar> to <https://builds.apache.org/job/maven-plugins-ITs-m3.0.3/ws/maven-shade-plugin/target/local-repo/org/apache/maven/plugins/maven-shade-plugin/3.0-SNAPSHOT/maven-shade-plugin-3.0-SNAPSHOT.jar>
[INFO] Installing <https://builds.apache.org/job/maven-plugins-ITs-m3.0.3/ws/maven-shade-plugin/target/maven-shade-plugin-3.0-SNAPSHOT-tests.jar> to <https://builds.apache.org/job/maven-plugins-ITs-m3.0.3/ws/maven-shade-plugin/target/local-repo/org/apache/maven/plugins/maven-shade-plugin/3.0-SNAPSHOT/maven-shade-plugin-3.0-SNAPSHOT-tests.jar>
[INFO] 
[INFO] --- maven-invoker-plugin:1.6:integration-test (integration-test) @ maven-shade-plugin ---
[INFO] Building: artifact-includes-excludes/pom.xml
[INFO] run script <https://builds.apache.org/job/maven-plugins-ITs-m3.0.3/ws/maven-shade-plugin/target/it/artifact-includes-excludes/verify.bsh>
[INFO] ..SUCCESS (4.3 s)
[INFO] Building: dep-reduced-pom-with-local-parent/pom.xml
[INFO] ..SUCCESS (3.2 s)
[INFO] Building: implicit-inclusion-of-project-artifact/pom.xml
[INFO] run script <https://builds.apache.org/job/maven-plugins-ITs-m3.0.3/ws/maven-shade-plugin/target/it/implicit-inclusion-of-project-artifact/verify.bsh>
[INFO] ..SUCCESS (3.8 s)
[INFO] Building: reloc-class-from-string-pool/pom.xml
[INFO] ..SUCCESS (3.3 s)
[INFO] Building: dep-reduced-pom-unique/pom.xml
[INFO] run script <https://builds.apache.org/job/maven-plugins-ITs-m3.0.3/ws/maven-shade-plugin/target/it/dep-reduced-pom-unique/verify.groovy>
[INFO] ..SUCCESS (3.9 s)
[INFO] Building: non-runtime-scope-excluded/pom.xml
[INFO] run script <https://builds.apache.org/job/maven-plugins-ITs-m3.0.3/ws/maven-shade-plugin/target/it/non-runtime-scope-excluded/verify.bsh>
[INFO] ..SUCCESS (3.9 s)
[INFO] Building: manifest-transformed/pom.xml
[INFO] run script <https://builds.apache.org/job/maven-plugins-ITs-m3.0.3/ws/maven-shade-plugin/target/it/manifest-transformed/verify.bsh>
[INFO] ..SUCCESS (4.8 s)
[INFO] Building: duplicate-classes-without-reloc/pom.xml
[INFO] ..SUCCESS (2.8 s)
[INFO] Building: mini-jar-respect-includes/pom.xml
[INFO] run script <https://builds.apache.org/job/maven-plugins-ITs-m3.0.3/ws/maven-shade-plugin/target/it/mini-jar-respect-includes/verify.bsh>
[INFO] ..SUCCESS (4.8 s)
[INFO] Building: pom-packaging/pom.xml
[INFO] run script <https://builds.apache.org/job/maven-plugins-ITs-m3.0.3/ws/maven-shade-plugin/target/it/pom-packaging/verify.bsh>
[INFO] ..SUCCESS (2.5 s)
[INFO] Building: xml-transformer-ignores-dtd/pom.xml
[INFO] run script <https://builds.apache.org/job/maven-plugins-ITs-m3.0.3/ws/maven-shade-plugin/target/it/xml-transformer-ignores-dtd/verify.bsh>
[INFO] ..SUCCESS (3.8 s)
[INFO] Building: empty-relocation-shaded-pattern/pom.xml
[INFO] ..SUCCESS (3.6 s)
[INFO] Building: mshade-123/pom.xml
[INFO] ..SUCCESS (5.7 s)
[INFO] Building: manifest-retained/pom.xml
[INFO] run script <https://builds.apache.org/job/maven-plugins-ITs-m3.0.3/ws/maven-shade-plugin/target/it/manifest-retained/verify.bsh>
[INFO] ..SUCCESS (4.5 s)
[INFO] Building: finalNameBuild/pom.xml
[INFO] run script <https://builds.apache.org/job/maven-plugins-ITs-m3.0.3/ws/maven-shade-plugin/target/it/finalNameBuild/setup.bsh>
[INFO] run script <https://builds.apache.org/job/maven-plugins-ITs-m3.0.3/ws/maven-shade-plugin/target/it/finalNameBuild/verify.bsh>
[INFO] ..SUCCESS (3.5 s)
[INFO] Building: finalNameShade/pom.xml
[INFO] run script <https://builds.apache.org/job/maven-plugins-ITs-m3.0.3/ws/maven-shade-plugin/target/it/finalNameShade/setup.bsh>
[INFO] run script <https://builds.apache.org/job/maven-plugins-ITs-m3.0.3/ws/maven-shade-plugin/target/it/finalNameShade/verify.bsh>
[INFO] ..SUCCESS (3.8 s)
[INFO] Building: reloc-abs-resource-path/pom.xml
[INFO] ..SUCCESS (5.5 s)
[INFO] Building: empty-apache-notice-transform/pom.xml
[INFO] ..SUCCESS (4.3 s)
[INFO] Building: services-resource-transformer/pom.xml
[INFO] run script <https://builds.apache.org/job/maven-plugins-ITs-m3.0.3/ws/maven-shade-plugin/target/it/services-resource-transformer/verify.bsh>
[INFO] ..SUCCESS (3.6 s)
[INFO] Building: mini-jar-package-info/pom.xml
[INFO] run script <https://builds.apache.org/job/maven-plugins-ITs-m3.0.3/ws/maven-shade-plugin/target/it/mini-jar-package-info/verify.bsh>
[INFO] ..SUCCESS (4.3 s)
[INFO] Building: rerun-without-reloc/pom.xml
[INFO] ..SUCCESS (3.6 s)
[INFO] Building: shadePomDependency/pom.xml
[INFO] ..SUCCESS (4.3 s)
[INFO] Building: reloc-includes-excludes/pom.xml
[INFO] run script <https://builds.apache.org/job/maven-plugins-ITs-m3.0.3/ws/maven-shade-plugin/target/it/reloc-includes-excludes/verify.bsh>
[INFO] ..SUCCESS (4.3 s)
[INFO] Building: finalNameShade-attached/pom.xml
[INFO] run script <https://builds.apache.org/job/maven-plugins-ITs-m3.0.3/ws/maven-shade-plugin/target/it/finalNameShade-attached/setup.bsh>
[INFO] run script <https://builds.apache.org/job/maven-plugins-ITs-m3.0.3/ws/maven-shade-plugin/target/it/finalNameShade-attached/verify.bsh>
[INFO] ..SUCCESS (3.7 s)
[INFO] Building: component-descriptor-relocation/pom.xml
[INFO] ..SUCCESS (4.4 s)
[INFO] Building: users-shader-impl/pom.xml
[INFO] run script <https://builds.apache.org/job/maven-plugins-ITs-m3.0.3/ws/maven-shade-plugin/target/it/users-shader-impl/verify.groovy>
[INFO] ..SUCCESS (4.5 s)
[INFO] Building: mini-jar-malformed-dependencies/pom.xml
[INFO] ..SUCCESS (6.2 s)
[INFO] Building: finalNameBuild-attached/pom.xml
[INFO] run script <https://builds.apache.org/job/maven-plugins-ITs-m3.0.3/ws/maven-shade-plugin/target/it/finalNameBuild-attached/setup.bsh>
[INFO] run script <https://builds.apache.org/job/maven-plugins-ITs-m3.0.3/ws/maven-shade-plugin/target/it/finalNameBuild-attached/verify.bsh>
[INFO] ..SUCCESS (3.6 s)
[INFO] Building: attach-after-lifecycle-fork/pom.xml
[INFO] run script <https://builds.apache.org/job/maven-plugins-ITs-m3.0.3/ws/maven-shade-plugin/target/it/attach-after-lifecycle-fork/setup.bsh>
[INFO] run script <https://builds.apache.org/job/maven-plugins-ITs-m3.0.3/ws/maven-shade-plugin/target/it/attach-after-lifecycle-fork/verify.bsh>
[INFO] ..SUCCESS (3.0 s)
[INFO] Building: empty-relocation-pattern/pom.xml
[INFO] ..SUCCESS (3.7 s)
[INFO] Building: mini-jar/pom.xml
[INFO] run script <https://builds.apache.org/job/maven-plugins-ITs-m3.0.3/ws/maven-shade-plugin/target/it/mini-jar/verify.bsh>
[INFO] ..SUCCESS (4.1 s)
[INFO] Building: reloc-anno/pom.xml
[INFO] ..SUCCESS (3.3 s)
[INFO] Building: MSHADE-105/pom.xml
[INFO] run script <https://builds.apache.org/job/maven-plugins-ITs-m3.0.3/ws/maven-shade-plugin/target/it/MSHADE-105/verify.bsh>
[INFO] ..SUCCESS (7.2 s)
[INFO] Building: dep-reduced-pom-relocated-result/pom.xml
[INFO] ..SUCCESS (2.7 s)
[INFO] Building: attached-artifact-type/pom.xml
[INFO] ..SUCCESS (3.0 s)
[INFO] Building: dep-reduced-pom/pom.xml
[INFO] run script <https://builds.apache.org/job/maven-plugins-ITs-m3.0.3/ws/maven-shade-plugin/target/it/dep-reduced-pom/verify.groovy>
[INFO] ..SUCCESS (3.6 s)
[INFO] Building: rerun-with-reloc/pom.xml
[INFO] ..SUCCESS (5.0 s)
[INFO] Building: duplicate-classes-with-reloc/pom.xml
[INFO] ..SUCCESS (2.9 s)
[INFO] Building: filter-artifact-contents/pom.xml
[INFO] run script <https://builds.apache.org/job/maven-plugins-ITs-m3.0.3/ws/maven-shade-plugin/target/it/filter-artifact-contents/verify.bsh>
[INFO] ..SUCCESS (3.7 s)
[INFO] Building: project-with-reactors-included/pom.xml
[INFO] run script <https://builds.apache.org/job/maven-plugins-ITs-m3.0.3/ws/maven-shade-plugin/target/it/project-with-reactors-included/verify.bsh>
[INFO] ..SUCCESS (5.2 s)
[INFO] Building: reloc-enum-ref-from-anno/pom.xml
[INFO] ..SUCCESS (3.4 s)
[INFO] 
[INFO] --- maven-invoker-plugin:1.6:verify (integration-test) @ maven-shade-plugin ---
[INFO] -------------------------------------------------
[INFO] Build Summary:
[INFO]   Passed: 41, Failed: 0, Errors: 0, Skipped: 0
[INFO] -------------------------------------------------
[INFO] 
[INFO] --- maven-install-plugin:2.3.1:install (default-install) @ maven-shade-plugin ---
[INFO] Installing <https://builds.apache.org/job/maven-plugins-ITs-m3.0.3/ws/maven-shade-plugin/target/maven-shade-plugin-3.0-SNAPSHOT.jar> to /home/jenkins/.m2/repository/org/apache/maven/plugins/maven-shade-plugin/3.0-SNAPSHOT/maven-shade-plugin-3.0-SNAPSHOT.jar
[INFO] Installing <https://builds.apache.org/job/maven-plugins-ITs-m3.0.3/ws/maven-shade-plugin/pom.xml> to /home/jenkins/.m2/repository/org/apache/maven/plugins/maven-shade-plugin/3.0-SNAPSHOT/maven-shade-plugin-3.0-SNAPSHOT.pom
[INFO] Installing <https://builds.apache.org/job/maven-plugins-ITs-m3.0.3/ws/maven-shade-plugin/target/maven-shade-plugin-3.0-SNAPSHOT-tests.jar> to /home/jenkins/.m2/repository/org/apache/maven/plugins/maven-shade-plugin/3.0-SNAPSHOT/maven-shade-plugin-3.0-SNAPSHOT-tests.jar
[INFO]                                                                         
[INFO] ------------------------------------------------------------------------
[INFO] Building Maven Plugins Aggregator 1-SNAPSHOT
[INFO] ------------------------------------------------------------------------
[INFO] 
[INFO] --- maven-clean-plugin:2.4.1:clean (default-clean) @ maven-plugins-aggregator ---
[INFO] Deleting <https://builds.apache.org/job/maven-plugins-ITs-m3.0.3/ws/target>
[INFO] 
[INFO] --- maven-remote-resources-plugin:1.1:process (default) @ maven-plugins-aggregator ---
[INFO] 
[INFO] --- maven-install-plugin:2.3.1:install (default-install) @ maven-plugins-aggregator ---
[INFO] Installing <https://builds.apache.org/job/maven-plugins-ITs-m3.0.3/ws/pom.xml> to /home/jenkins/.m2/repository/org/apache/maven/plugins/maven-plugins-aggregator/1-SNAPSHOT/maven-plugins-aggregator-1-SNAPSHOT.pom
[INFO] ------------------------------------------------------------------------
[INFO] Reactor Summary:
[INFO] 
[INFO] Maven Plugins ..................................... SUCCESS [15.690s]
[INFO] Maven ACR Plugin .................................. SUCCESS [41.177s]
[INFO] Maven Ant Plugin .................................. SUCCESS [1:10.067s]
[INFO] Maven AntRun Plugin ............................... SUCCESS [58.222s]
[INFO] Maven Eclipse Plugin .............................. SUCCESS [6:35.497s]
[INFO] Maven Assembly Plugin ............................. SUCCESS [11:46.312s]
[INFO] Maven Changelog Plugin ............................ SUCCESS [49.339s]
[INFO] Maven Changes Report Plugin ....................... SUCCESS [1:10.950s]
[INFO] Maven Checkstyle Plugin ........................... SUCCESS [1:42.954s]
[INFO] Maven Clean Plugin ................................ SUCCESS [23.866s]
[INFO] Maven Compiler Plugin ............................. SUCCESS [1:08.059s]
[INFO] Maven Dependency Plugin ........................... FAILURE [1.430s]
[INFO] Maven Deploy Plugin ............................... SUCCESS [1:10.807s]
[INFO] Maven DOAP Plugin ................................. SUCCESS [18.624s]
[INFO] Maven Documentation Checker Plugin ................ SUCCESS [5.856s]
[INFO] Maven EAR Plugin .................................. SUCCESS [3:57.401s]
[INFO] Maven EJB Plugin .................................. SUCCESS [27.043s]
[INFO] Maven GPG Plugin .................................. SUCCESS [10.330s]
[INFO] Maven Help Plugin ................................. SUCCESS [34.358s]
[INFO] Maven IDEA Plugin ................................. SUCCESS [8.506s]
[INFO] Maven Install Plugin .............................. SUCCESS [39.875s]
[INFO] Maven JAR Plugin .................................. SUCCESS [1:06.881s]
[INFO] Maven Jarsigner Plugin ............................ SUCCESS [24.272s]
[INFO] Maven Javadoc Plugin .............................. SUCCESS [3:03.204s]
[INFO] Maven Linkcheck Plugin ............................ SUCCESS [3.261s]
[INFO] Maven One Plugin .................................. SUCCESS [1.867s]
[INFO] Maven Patch Plugin ................................ SUCCESS [12.433s]
[INFO] Maven PDF Plugin .................................. SUCCESS [34.944s]
[INFO] Maven PMD Plugin .................................. SUCCESS [39.746s]
[INFO] Maven RAR Plugin .................................. SUCCESS [12.343s]
[INFO] Maven Reactor Plugin .............................. SUCCESS [2.994s]
[INFO] Maven Repository Plugin ........................... SUCCESS [39.683s]
[INFO] Maven Resources Plugin ............................ SUCCESS [56.238s]
[INFO] Maven Site Plugin 3 ............................... SUCCESS [6:32.529s]
[INFO] Maven Source Plugin ............................... SUCCESS [43.769s]
[INFO] Maven Stage Plugin ................................ SUCCESS [2.451s]
[INFO] Maven Toolchains Plugin ........................... SUCCESS [2.088s]
[INFO] Maven Verifier Plugin ............................. SUCCESS [15.438s]
[INFO] Maven WAR Plugin .................................. SUCCESS [1:16.493s]
[INFO] SCM Publish Maven Plugin .......................... SUCCESS [1:17.660s]
[INFO] Maven Invoker Plugin .............................. SUCCESS [4:25.102s]
[INFO] Maven Project Info Reports Plugin ................. SUCCESS [2:24.515s]
[INFO] Maven Remote Resources Plugin ..................... SUCCESS [57.755s]
[INFO] Maven Shade Plugin ................................ SUCCESS [3:02.780s]
[INFO] Maven Plugins Aggregator .......................... SUCCESS [0.103s]
[INFO] ------------------------------------------------------------------------
[INFO] BUILD FAILURE
[INFO] ------------------------------------------------------------------------
[INFO] Total time: 1:03:20.941s
[INFO] Finished at: Sat Nov 24 20:38:55 UTC 2012
[INFO] Final Memory: 101M/421M
[INFO] ------------------------------------------------------------------------
[WARNING] The requested profile "apache.snapshots" could not be activated because it does not exist.
[ERROR] Failed to execute goal on project maven-dependency-plugin: Could not resolve dependencies for project org.apache.maven.plugins:maven-dependency-plugin:maven-plugin:2.7-SNAPSHOT: Could not find artifact org.apache.maven.shared:maven-dependency-analyzer:jar:1.3 in central (http://repo1.maven.org/maven2) -> [Help 1]
[ERROR] 
[ERROR] To see the full stack trace of the errors, re-run Maven with the -e switch.
[ERROR] Re-run Maven using the -X switch to enable full debug logging.
[ERROR] 
[ERROR] For more information about the errors and possible solutions, please read the following articles:
[ERROR] [Help 1] http://cwiki.apache.org/confluence/display/MAVEN/DependencyResolutionException
[ERROR] 
[ERROR] After correcting the problems, you can resume the build with the command
[ERROR]   mvn <goals> -rf :maven-dependency-plugin
Build step 'Invoke top-level Maven targets' marked build as failure
Recording test results

Build failed in Jenkins: maven-plugins-ITs-m3.0.3 #70

Posted by Apache Jenkins Server <je...@builds.apache.org>.
See <https://builds.apache.org/job/maven-plugins-ITs-m3.0.3/70/changes>

Changes:

[olamy] add @since

[olamy] add contributor

[olamy] [MEAR-164] support for useJvmChmod in archiver
Submitted by Seth Rife.

------------------------------------------
[...truncated 9807 lines...]
 T E S T S
-------------------------------------------------------
Running org.apache.maven.plugins.shade.mojo.ArtifactSelectorTest
Tests run: 1, Failures: 0, Errors: 0, Skipped: 0, Time elapsed: 0.028 sec
Running org.apache.maven.plugins.shade.mojo.ShadeMojoTest
Tests run: 4, Failures: 0, Errors: 0, Skipped: 0, Time elapsed: 2.369 sec
Running org.apache.maven.plugins.shade.mojo.RelativizePathTest
Tests run: 1, Failures: 0, Errors: 0, Skipped: 0, Time elapsed: 0.02 sec
Running org.apache.maven.plugins.shade.mojo.ArtifactIdTest
Tests run: 2, Failures: 0, Errors: 0, Skipped: 0, Time elapsed: 0.002 sec
Running org.apache.maven.plugins.shade.DefaultShaderTest
Tests run: 4, Failures: 0, Errors: 0, Skipped: 0, Time elapsed: 0.793 sec
Running org.apache.maven.plugins.shade.resource.AppendingTransformerTest
Tests run: 1, Failures: 0, Errors: 0, Skipped: 0, Time elapsed: 0.001 sec
Running org.apache.maven.plugins.shade.resource.ApacheNoticeResourceTransformerTest
Tests run: 1, Failures: 0, Errors: 0, Skipped: 0, Time elapsed: 0.001 sec
Running org.apache.maven.plugins.shade.resource.XmlAppendingTransformerTest
Tests run: 1, Failures: 0, Errors: 0, Skipped: 0, Time elapsed: 0.005 sec
Running org.apache.maven.plugins.shade.resource.ApacheLicenseResourceTransformerTest
Tests run: 1, Failures: 0, Errors: 0, Skipped: 0, Time elapsed: 0 sec
Running org.apache.maven.plugins.shade.resource.ComponentsXmlResourceTransformerTest
Tests run: 1, Failures: 0, Errors: 0, Skipped: 0, Time elapsed: 0.06 sec
Running org.apache.maven.plugins.shade.filter.SimpleFilterTest
Tests run: 1, Failures: 0, Errors: 0, Skipped: 0, Time elapsed: 0 sec
Running org.apache.maven.plugins.shade.relocation.SimpleRelocatorParameterTest
Tests run: 2, Failures: 0, Errors: 0, Skipped: 0, Time elapsed: 0.001 sec
Running org.apache.maven.plugins.shade.relocation.SimpleRelocatorTest
Tests run: 7, Failures: 0, Errors: 0, Skipped: 0, Time elapsed: 0.003 sec

Results :

Tests run: 27, Failures: 0, Errors: 0, Skipped: 0

[INFO] 
[INFO] --- maven-jar-plugin:2.4:jar (default-jar) @ maven-shade-plugin ---
[INFO] Building jar: <https://builds.apache.org/job/maven-plugins-ITs-m3.0.3/ws/maven-shade-plugin/target/maven-shade-plugin-2.0.1-SNAPSHOT.jar>
[INFO] 
[INFO] --- maven-plugin-plugin:3.2:addPluginArtifactMetadata (default-addPluginArtifactMetadata) @ maven-shade-plugin ---
[INFO] 
[INFO] --- maven-jar-plugin:2.4:test-jar (default) @ maven-shade-plugin ---
[INFO] Building jar: <https://builds.apache.org/job/maven-plugins-ITs-m3.0.3/ws/maven-shade-plugin/target/maven-shade-plugin-2.0.1-SNAPSHOT-tests.jar>
[INFO] 
[INFO] --- maven-invoker-plugin:1.6:install (integration-test) @ maven-shade-plugin ---
[INFO] Installing <https://builds.apache.org/job/maven-plugins-ITs-m3.0.3/ws/maven-shade-plugin/pom.xml> to <https://builds.apache.org/job/maven-plugins-ITs-m3.0.3/ws/maven-shade-plugin/target/local-repo/org/apache/maven/plugins/maven-shade-plugin/2.0.1-SNAPSHOT/maven-shade-plugin-2.0.1-SNAPSHOT.pom>
[INFO] Installing <https://builds.apache.org/job/maven-plugins-ITs-m3.0.3/ws/maven-shade-plugin/target/maven-shade-plugin-2.0.1-SNAPSHOT.jar> to <https://builds.apache.org/job/maven-plugins-ITs-m3.0.3/ws/maven-shade-plugin/target/local-repo/org/apache/maven/plugins/maven-shade-plugin/2.0.1-SNAPSHOT/maven-shade-plugin-2.0.1-SNAPSHOT.jar>
[INFO] Installing <https://builds.apache.org/job/maven-plugins-ITs-m3.0.3/ws/maven-shade-plugin/target/maven-shade-plugin-2.0.1-SNAPSHOT-tests.jar> to <https://builds.apache.org/job/maven-plugins-ITs-m3.0.3/ws/maven-shade-plugin/target/local-repo/org/apache/maven/plugins/maven-shade-plugin/2.0.1-SNAPSHOT/maven-shade-plugin-2.0.1-SNAPSHOT-tests.jar>
[INFO] 
[INFO] --- maven-invoker-plugin:1.6:integration-test (integration-test) @ maven-shade-plugin ---
[INFO] Building: xml-transformer-ignores-dtd/pom.xml
[INFO] run script <https://builds.apache.org/job/maven-plugins-ITs-m3.0.3/ws/maven-shade-plugin/target/it/xml-transformer-ignores-dtd/verify.bsh>
[INFO] ..SUCCESS (4.4 s)
[INFO] Building: attach-after-lifecycle-fork/pom.xml
[INFO] run script <https://builds.apache.org/job/maven-plugins-ITs-m3.0.3/ws/maven-shade-plugin/target/it/attach-after-lifecycle-fork/setup.bsh>
[INFO] run script <https://builds.apache.org/job/maven-plugins-ITs-m3.0.3/ws/maven-shade-plugin/target/it/attach-after-lifecycle-fork/verify.bsh>
[INFO] ..SUCCESS (3.7 s)
[INFO] Building: duplicate-classes-without-reloc/pom.xml
[INFO] ..SUCCESS (2.9 s)
[INFO] Building: filter-artifact-contents/pom.xml
[INFO] run script <https://builds.apache.org/job/maven-plugins-ITs-m3.0.3/ws/maven-shade-plugin/target/it/filter-artifact-contents/verify.bsh>
[INFO] ..SUCCESS (3.7 s)
[INFO] Building: component-descriptor-relocation/pom.xml
[INFO] ..SUCCESS (4.7 s)
[INFO] Building: finalNameShade/pom.xml
[INFO] run script <https://builds.apache.org/job/maven-plugins-ITs-m3.0.3/ws/maven-shade-plugin/target/it/finalNameShade/setup.bsh>
[INFO] run script <https://builds.apache.org/job/maven-plugins-ITs-m3.0.3/ws/maven-shade-plugin/target/it/finalNameShade/verify.bsh>
[INFO] ..SUCCESS (3.7 s)
[INFO] Building: manifest-retained/pom.xml
[INFO] run script <https://builds.apache.org/job/maven-plugins-ITs-m3.0.3/ws/maven-shade-plugin/target/it/manifest-retained/verify.bsh>
[INFO] ..SUCCESS (4.7 s)
[INFO] Building: manifest-transformed/pom.xml
[INFO] run script <https://builds.apache.org/job/maven-plugins-ITs-m3.0.3/ws/maven-shade-plugin/target/it/manifest-transformed/verify.bsh>
[INFO] ..SUCCESS (4.6 s)
[INFO] Building: services-resource-transformer/pom.xml
[INFO] run script <https://builds.apache.org/job/maven-plugins-ITs-m3.0.3/ws/maven-shade-plugin/target/it/services-resource-transformer/verify.bsh>
[INFO] ..SUCCESS (3.8 s)
[INFO] Building: pom-packaging/pom.xml
[INFO] run script <https://builds.apache.org/job/maven-plugins-ITs-m3.0.3/ws/maven-shade-plugin/target/it/pom-packaging/verify.bsh>
[INFO] ..SUCCESS (2.5 s)
[INFO] Building: non-runtime-scope-excluded/pom.xml
[INFO] run script <https://builds.apache.org/job/maven-plugins-ITs-m3.0.3/ws/maven-shade-plugin/target/it/non-runtime-scope-excluded/verify.bsh>
[INFO] ..SUCCESS (3.8 s)
[INFO] Building: reloc-anno/pom.xml
[INFO] ..SUCCESS (3.4 s)
[INFO] Building: mini-jar-respect-includes/pom.xml
[INFO] run script <https://builds.apache.org/job/maven-plugins-ITs-m3.0.3/ws/maven-shade-plugin/target/it/mini-jar-respect-includes/verify.bsh>
[INFO] ..SUCCESS (4.2 s)
[INFO] Building: empty-relocation-pattern/pom.xml
[INFO] ..SUCCESS (3.7 s)
[INFO] Building: finalNameBuild/pom.xml
[INFO] run script <https://builds.apache.org/job/maven-plugins-ITs-m3.0.3/ws/maven-shade-plugin/target/it/finalNameBuild/setup.bsh>
[INFO] run script <https://builds.apache.org/job/maven-plugins-ITs-m3.0.3/ws/maven-shade-plugin/target/it/finalNameBuild/verify.bsh>
[INFO] ..SUCCESS (3.7 s)
[INFO] Building: attached-artifact-type/pom.xml
[INFO] ..SUCCESS (3.0 s)
[INFO] Building: empty-relocation-shaded-pattern/pom.xml
[INFO] ..SUCCESS (3.6 s)
[INFO] Building: reloc-includes-excludes/pom.xml
[INFO] run script <https://builds.apache.org/job/maven-plugins-ITs-m3.0.3/ws/maven-shade-plugin/target/it/reloc-includes-excludes/verify.bsh>
[INFO] ..SUCCESS (4.3 s)
[INFO] Building: rerun-with-reloc/pom.xml
[INFO] ..SUCCESS (5.9 s)
[INFO] Building: implicit-inclusion-of-project-artifact/pom.xml
[INFO] run script <https://builds.apache.org/job/maven-plugins-ITs-m3.0.3/ws/maven-shade-plugin/target/it/implicit-inclusion-of-project-artifact/verify.bsh>
[INFO] ..SUCCESS (3.8 s)
[INFO] Building: duplicate-classes-with-reloc/pom.xml
[INFO] ..SUCCESS (2.8 s)
[INFO] Building: dep-reduced-pom/pom.xml
[INFO] run script <https://builds.apache.org/job/maven-plugins-ITs-m3.0.3/ws/maven-shade-plugin/target/it/dep-reduced-pom/verify.groovy>
[INFO] ..SUCCESS (3.8 s)
[INFO] Building: rerun-without-reloc/pom.xml
[INFO] ..SUCCESS (3.6 s)
[INFO] Building: finalNameBuild-attached/pom.xml
[INFO] run script <https://builds.apache.org/job/maven-plugins-ITs-m3.0.3/ws/maven-shade-plugin/target/it/finalNameBuild-attached/setup.bsh>
[INFO] run script <https://builds.apache.org/job/maven-plugins-ITs-m3.0.3/ws/maven-shade-plugin/target/it/finalNameBuild-attached/verify.bsh>
[INFO] ..SUCCESS (3.7 s)
[INFO] Building: finalNameShade-attached/pom.xml
[INFO] run script <https://builds.apache.org/job/maven-plugins-ITs-m3.0.3/ws/maven-shade-plugin/target/it/finalNameShade-attached/setup.bsh>
[INFO] run script <https://builds.apache.org/job/maven-plugins-ITs-m3.0.3/ws/maven-shade-plugin/target/it/finalNameShade-attached/verify.bsh>
[INFO] ..SUCCESS (3.6 s)
[INFO] Building: shadePomDependency/pom.xml
[INFO] ..SUCCESS (4.4 s)
[INFO] Building: artifact-includes-excludes/pom.xml
[INFO] run script <https://builds.apache.org/job/maven-plugins-ITs-m3.0.3/ws/maven-shade-plugin/target/it/artifact-includes-excludes/verify.bsh>
[INFO] ..SUCCESS (3.7 s)
[INFO] Building: reloc-enum-ref-from-anno/pom.xml
[INFO] ..SUCCESS (3.3 s)
[INFO] Building: mini-jar-package-info/pom.xml
[INFO] run script <https://builds.apache.org/job/maven-plugins-ITs-m3.0.3/ws/maven-shade-plugin/target/it/mini-jar-package-info/verify.bsh>
[INFO] ..SUCCESS (4.5 s)
[INFO] Building: project-with-reactors-included/pom.xml
[INFO] run script <https://builds.apache.org/job/maven-plugins-ITs-m3.0.3/ws/maven-shade-plugin/target/it/project-with-reactors-included/verify.bsh>
[INFO] ..SUCCESS (5.2 s)
[INFO] Building: dep-reduced-pom-with-local-parent/pom.xml
[INFO] ..SUCCESS (2.8 s)
[INFO] Building: mini-jar/pom.xml
[INFO] run script <https://builds.apache.org/job/maven-plugins-ITs-m3.0.3/ws/maven-shade-plugin/target/it/mini-jar/verify.bsh>
[INFO] ..SUCCESS (4.0 s)
[INFO] Building: dep-reduced-pom-unique/pom.xml
[INFO] run script <https://builds.apache.org/job/maven-plugins-ITs-m3.0.3/ws/maven-shade-plugin/target/it/dep-reduced-pom-unique/verify.groovy>
[INFO] ..SUCCESS (3.9 s)
[INFO] Building: mini-jar-malformed-dependencies/pom.xml
[INFO] ..SUCCESS (6.9 s)
[INFO] Building: reloc-abs-resource-path/pom.xml
[INFO] ..SUCCESS (5.3 s)
[INFO] Building: MSHADE-105/pom.xml
[INFO] run script <https://builds.apache.org/job/maven-plugins-ITs-m3.0.3/ws/maven-shade-plugin/target/it/MSHADE-105/verify.bsh>
[INFO] ..SUCCESS (6.8 s)
[INFO] Building: mshade-123/pom.xml
[INFO] ..SUCCESS (5.2 s)
[INFO] Building: reloc-class-from-string-pool/pom.xml
[INFO] ..SUCCESS (3.3 s)
[INFO] Building: users-shader-impl/pom.xml
[INFO] run script <https://builds.apache.org/job/maven-plugins-ITs-m3.0.3/ws/maven-shade-plugin/target/it/users-shader-impl/verify.groovy>
[INFO] ..SUCCESS (4.0 s)
[INFO] Building: empty-apache-notice-transform/pom.xml
[INFO] ..SUCCESS (4.2 s)
[INFO] Building: dep-reduced-pom-relocated-result/pom.xml
[INFO] ..SUCCESS (2.7 s)
[INFO] 
[INFO] --- maven-invoker-plugin:1.6:verify (integration-test) @ maven-shade-plugin ---
[INFO] -------------------------------------------------
[INFO] Build Summary:
[INFO]   Passed: 41, Failed: 0, Errors: 0, Skipped: 0
[INFO] -------------------------------------------------
[INFO] 
[INFO] --- maven-install-plugin:2.3.1:install (default-install) @ maven-shade-plugin ---
[INFO] Installing <https://builds.apache.org/job/maven-plugins-ITs-m3.0.3/ws/maven-shade-plugin/target/maven-shade-plugin-2.0.1-SNAPSHOT.jar> to /home/jenkins/.m2/repository/org/apache/maven/plugins/maven-shade-plugin/2.0.1-SNAPSHOT/maven-shade-plugin-2.0.1-SNAPSHOT.jar
[INFO] Installing <https://builds.apache.org/job/maven-plugins-ITs-m3.0.3/ws/maven-shade-plugin/pom.xml> to /home/jenkins/.m2/repository/org/apache/maven/plugins/maven-shade-plugin/2.0.1-SNAPSHOT/maven-shade-plugin-2.0.1-SNAPSHOT.pom
[INFO] Installing <https://builds.apache.org/job/maven-plugins-ITs-m3.0.3/ws/maven-shade-plugin/target/maven-shade-plugin-2.0.1-SNAPSHOT-tests.jar> to /home/jenkins/.m2/repository/org/apache/maven/plugins/maven-shade-plugin/2.0.1-SNAPSHOT/maven-shade-plugin-2.0.1-SNAPSHOT-tests.jar
[INFO]                                                                         
[INFO] ------------------------------------------------------------------------
[INFO] Building Maven Plugins Aggregator 1-SNAPSHOT
[INFO] ------------------------------------------------------------------------
[INFO] 
[INFO] --- maven-clean-plugin:2.4.1:clean (default-clean) @ maven-plugins-aggregator ---
[INFO] Deleting <https://builds.apache.org/job/maven-plugins-ITs-m3.0.3/ws/target>
[INFO] 
[INFO] --- maven-remote-resources-plugin:1.1:process (default) @ maven-plugins-aggregator ---
[INFO] 
[INFO] --- maven-install-plugin:2.3.1:install (default-install) @ maven-plugins-aggregator ---
[INFO] Installing <https://builds.apache.org/job/maven-plugins-ITs-m3.0.3/ws/pom.xml> to /home/jenkins/.m2/repository/org/apache/maven/plugins/maven-plugins-aggregator/1-SNAPSHOT/maven-plugins-aggregator-1-SNAPSHOT.pom
[INFO] ------------------------------------------------------------------------
[INFO] Reactor Summary:
[INFO] 
[INFO] Maven Plugins ..................................... SUCCESS [3.249s]
[INFO] Maven ACR Plugin .................................. SUCCESS [21.984s]
[INFO] Maven Ant Plugin .................................. SUCCESS [1:12.756s]
[INFO] Maven AntRun Plugin ............................... SUCCESS [53.793s]
[INFO] Maven Eclipse Plugin .............................. SUCCESS [6:05.002s]
[INFO] Maven Assembly Plugin ............................. SUCCESS [10:43.718s]
[INFO] Maven Changelog Plugin ............................ SUCCESS [54.168s]
[INFO] Maven Changes Report Plugin ....................... SUCCESS [1:04.270s]
[INFO] Maven Checkstyle Plugin ........................... SUCCESS [1:37.759s]
[INFO] Maven Clean Plugin ................................ SUCCESS [21.685s]
[INFO] Maven Compiler Plugin ............................. SUCCESS [1:04.143s]
[INFO] Maven Dependency Plugin ........................... FAILURE [0.110s]
[INFO] Maven Deploy Plugin ............................... SUCCESS [1:02.239s]
[INFO] Maven DOAP Plugin ................................. SUCCESS [17.327s]
[INFO] Maven Documentation Checker Plugin ................ SUCCESS [6.113s]
[INFO] Maven EAR Plugin .................................. SUCCESS [3:50.352s]
[INFO] Maven EJB Plugin .................................. SUCCESS [27.946s]
[INFO] Maven GPG Plugin .................................. SUCCESS [9.762s]
[INFO] Maven Help Plugin ................................. SUCCESS [35.528s]
[INFO] Maven IDEA Plugin ................................. SUCCESS [7.412s]
[INFO] Maven Install Plugin .............................. SUCCESS [40.560s]
[INFO] Maven JAR Plugin .................................. SUCCESS [1:12.993s]
[INFO] Maven Jarsigner Plugin ............................ SUCCESS [23.869s]
[INFO] Maven Javadoc Plugin .............................. SUCCESS [3:08.704s]
[INFO] Maven Linkcheck Plugin ............................ SUCCESS [3.047s]
[INFO] Maven One Plugin .................................. SUCCESS [1.828s]
[INFO] Maven Patch Plugin ................................ SUCCESS [13.605s]
[INFO] Maven PDF Plugin .................................. SUCCESS [32.449s]
[INFO] Maven PMD Plugin .................................. SUCCESS [39.522s]
[INFO] Maven RAR Plugin .................................. SUCCESS [11.400s]
[INFO] Maven Reactor Plugin .............................. SUCCESS [2.955s]
[INFO] Maven Repository Plugin ........................... SUCCESS [40.713s]
[INFO] Maven Resources Plugin ............................ SUCCESS [54.998s]
[INFO] Maven Site Plugin 3 ............................... SUCCESS [7:20.156s]
[INFO] Maven Source Plugin ............................... SUCCESS [47.936s]
[INFO] Maven Stage Plugin ................................ SUCCESS [2.766s]
[INFO] Maven Toolchains Plugin ........................... SUCCESS [2.070s]
[INFO] Maven Verifier Plugin ............................. SUCCESS [16.462s]
[INFO] Maven WAR Plugin .................................. SUCCESS [1:19.644s]
[INFO] SCM Publish Maven Plugin .......................... SUCCESS [52.965s]
[INFO] Maven Invoker Plugin .............................. SUCCESS [4:18.619s]
[INFO] Maven Project Info Reports Plugin ................. SUCCESS [2:32.232s]
[INFO] Maven Remote Resources Plugin ..................... SUCCESS [50.725s]
[INFO] Maven Shade Plugin ................................ SUCCESS [3:13.942s]
[INFO] Maven Plugins Aggregator .......................... SUCCESS [0.062s]
[INFO] ------------------------------------------------------------------------
[INFO] BUILD FAILURE
[INFO] ------------------------------------------------------------------------
[INFO] Total time: 1:01:25.041s
[INFO] Finished at: Sat Nov 24 18:10:04 UTC 2012
[INFO] Final Memory: 85M/312M
[INFO] ------------------------------------------------------------------------
[WARNING] The requested profile "apache.snapshots" could not be activated because it does not exist.
[ERROR] Failed to execute goal on project maven-dependency-plugin: Could not resolve dependencies for project org.apache.maven.plugins:maven-dependency-plugin:maven-plugin:2.7-SNAPSHOT: Could not find artifact org.apache.maven.shared:maven-dependency-analyzer:jar:1.3 in central (http://repo1.maven.org/maven2) -> [Help 1]
[ERROR] 
[ERROR] To see the full stack trace of the errors, re-run Maven with the -e switch.
[ERROR] Re-run Maven using the -X switch to enable full debug logging.
[ERROR] 
[ERROR] For more information about the errors and possible solutions, please read the following articles:
[ERROR] [Help 1] http://cwiki.apache.org/confluence/display/MAVEN/DependencyResolutionException
[ERROR] 
[ERROR] After correcting the problems, you can resume the build with the command
[ERROR]   mvn <goals> -rf :maven-dependency-plugin
Build step 'Invoke top-level Maven targets' marked build as failure
Recording test results

Build failed in Jenkins: maven-plugins-ITs-m3.0.3 #69

Posted by Apache Jenkins Server <je...@builds.apache.org>.
See <https://builds.apache.org/job/maven-plugins-ITs-m3.0.3/69/changes>

Changes:

[olamy] use last plexus-utils 3.0.9

[olamy] test with last site plugin version

[olamy] fix ci url

[olamy] use last plexus utils 3.0.9

------------------------------------------
[...truncated 9821 lines...]
 T E S T S
-------------------------------------------------------
Running org.apache.maven.plugins.shade.DefaultShaderTest
Tests run: 4, Failures: 0, Errors: 0, Skipped: 0, Time elapsed: 1.422 sec
Running org.apache.maven.plugins.shade.resource.ApacheLicenseResourceTransformerTest
Tests run: 1, Failures: 0, Errors: 0, Skipped: 0, Time elapsed: 0.003 sec
Running org.apache.maven.plugins.shade.resource.XmlAppendingTransformerTest
Tests run: 1, Failures: 0, Errors: 0, Skipped: 0, Time elapsed: 0.005 sec
Running org.apache.maven.plugins.shade.resource.AppendingTransformerTest
Tests run: 1, Failures: 0, Errors: 0, Skipped: 0, Time elapsed: 0 sec
Running org.apache.maven.plugins.shade.resource.ApacheNoticeResourceTransformerTest
Tests run: 1, Failures: 0, Errors: 0, Skipped: 0, Time elapsed: 0.001 sec
Running org.apache.maven.plugins.shade.resource.ComponentsXmlResourceTransformerTest
Tests run: 1, Failures: 0, Errors: 0, Skipped: 0, Time elapsed: 0.081 sec
Running org.apache.maven.plugins.shade.mojo.ShadeMojoTest
Tests run: 4, Failures: 0, Errors: 0, Skipped: 0, Time elapsed: 1.648 sec
Running org.apache.maven.plugins.shade.mojo.RelativizePathTest
Tests run: 1, Failures: 0, Errors: 0, Skipped: 0, Time elapsed: 0.016 sec
Running org.apache.maven.plugins.shade.mojo.ArtifactSelectorTest
Tests run: 1, Failures: 0, Errors: 0, Skipped: 0, Time elapsed: 0.001 sec
Running org.apache.maven.plugins.shade.mojo.ArtifactIdTest
Tests run: 2, Failures: 0, Errors: 0, Skipped: 0, Time elapsed: 0.002 sec
Running org.apache.maven.plugins.shade.filter.SimpleFilterTest
Tests run: 1, Failures: 0, Errors: 0, Skipped: 0, Time elapsed: 0.001 sec
Running org.apache.maven.plugins.shade.relocation.SimpleRelocatorTest
Tests run: 7, Failures: 0, Errors: 0, Skipped: 0, Time elapsed: 0.003 sec
Running org.apache.maven.plugins.shade.relocation.SimpleRelocatorParameterTest
Tests run: 2, Failures: 0, Errors: 0, Skipped: 0, Time elapsed: 0 sec

Results :

Tests run: 27, Failures: 0, Errors: 0, Skipped: 0

[INFO] 
[INFO] --- maven-jar-plugin:2.4:jar (default-jar) @ maven-shade-plugin ---
[INFO] Building jar: <https://builds.apache.org/job/maven-plugins-ITs-m3.0.3/ws/maven-shade-plugin/target/maven-shade-plugin-2.0.1-SNAPSHOT.jar>
[INFO] 
[INFO] --- maven-plugin-plugin:3.2:addPluginArtifactMetadata (default-addPluginArtifactMetadata) @ maven-shade-plugin ---
[INFO] 
[INFO] --- maven-jar-plugin:2.4:test-jar (default) @ maven-shade-plugin ---
[INFO] Building jar: <https://builds.apache.org/job/maven-plugins-ITs-m3.0.3/ws/maven-shade-plugin/target/maven-shade-plugin-2.0.1-SNAPSHOT-tests.jar>
[INFO] 
[INFO] --- maven-invoker-plugin:1.6:install (integration-test) @ maven-shade-plugin ---
[INFO] Installing <https://builds.apache.org/job/maven-plugins-ITs-m3.0.3/ws/maven-shade-plugin/pom.xml> to <https://builds.apache.org/job/maven-plugins-ITs-m3.0.3/ws/maven-shade-plugin/target/local-repo/org/apache/maven/plugins/maven-shade-plugin/2.0.1-SNAPSHOT/maven-shade-plugin-2.0.1-SNAPSHOT.pom>
[INFO] Installing <https://builds.apache.org/job/maven-plugins-ITs-m3.0.3/ws/maven-shade-plugin/target/maven-shade-plugin-2.0.1-SNAPSHOT.jar> to <https://builds.apache.org/job/maven-plugins-ITs-m3.0.3/ws/maven-shade-plugin/target/local-repo/org/apache/maven/plugins/maven-shade-plugin/2.0.1-SNAPSHOT/maven-shade-plugin-2.0.1-SNAPSHOT.jar>
[INFO] Installing <https://builds.apache.org/job/maven-plugins-ITs-m3.0.3/ws/maven-shade-plugin/target/maven-shade-plugin-2.0.1-SNAPSHOT-tests.jar> to <https://builds.apache.org/job/maven-plugins-ITs-m3.0.3/ws/maven-shade-plugin/target/local-repo/org/apache/maven/plugins/maven-shade-plugin/2.0.1-SNAPSHOT/maven-shade-plugin-2.0.1-SNAPSHOT-tests.jar>
[INFO] 
[INFO] --- maven-invoker-plugin:1.6:integration-test (integration-test) @ maven-shade-plugin ---
[INFO] Building: artifact-includes-excludes/pom.xml
[INFO] run script <https://builds.apache.org/job/maven-plugins-ITs-m3.0.3/ws/maven-shade-plugin/target/it/artifact-includes-excludes/verify.bsh>
[INFO] ..SUCCESS (4.4 s)
[INFO] Building: dep-reduced-pom-with-local-parent/pom.xml
[INFO] ..SUCCESS (3.2 s)
[INFO] Building: implicit-inclusion-of-project-artifact/pom.xml
[INFO] run script <https://builds.apache.org/job/maven-plugins-ITs-m3.0.3/ws/maven-shade-plugin/target/it/implicit-inclusion-of-project-artifact/verify.bsh>
[INFO] ..SUCCESS (4.1 s)
[INFO] Building: reloc-class-from-string-pool/pom.xml
[INFO] ..SUCCESS (3.6 s)
[INFO] Building: dep-reduced-pom-unique/pom.xml
[INFO] run script <https://builds.apache.org/job/maven-plugins-ITs-m3.0.3/ws/maven-shade-plugin/target/it/dep-reduced-pom-unique/verify.groovy>
[INFO] ..SUCCESS (3.8 s)
[INFO] Building: non-runtime-scope-excluded/pom.xml
[INFO] run script <https://builds.apache.org/job/maven-plugins-ITs-m3.0.3/ws/maven-shade-plugin/target/it/non-runtime-scope-excluded/verify.bsh>
[INFO] ..SUCCESS (3.8 s)
[INFO] Building: manifest-transformed/pom.xml
[INFO] run script <https://builds.apache.org/job/maven-plugins-ITs-m3.0.3/ws/maven-shade-plugin/target/it/manifest-transformed/verify.bsh>
[INFO] ..SUCCESS (4.9 s)
[INFO] Building: duplicate-classes-without-reloc/pom.xml
[INFO] ..SUCCESS (3.0 s)
[INFO] Building: mini-jar-respect-includes/pom.xml
[INFO] run script <https://builds.apache.org/job/maven-plugins-ITs-m3.0.3/ws/maven-shade-plugin/target/it/mini-jar-respect-includes/verify.bsh>
[INFO] ..SUCCESS (4.6 s)
[INFO] Building: pom-packaging/pom.xml
[INFO] run script <https://builds.apache.org/job/maven-plugins-ITs-m3.0.3/ws/maven-shade-plugin/target/it/pom-packaging/verify.bsh>
[INFO] ..SUCCESS (2.6 s)
[INFO] Building: xml-transformer-ignores-dtd/pom.xml
[INFO] run script <https://builds.apache.org/job/maven-plugins-ITs-m3.0.3/ws/maven-shade-plugin/target/it/xml-transformer-ignores-dtd/verify.bsh>
[INFO] ..SUCCESS (3.9 s)
[INFO] Building: empty-relocation-shaded-pattern/pom.xml
[INFO] ..SUCCESS (3.7 s)
[INFO] Building: mshade-123/pom.xml
[INFO] ..SUCCESS (6.1 s)
[INFO] Building: manifest-retained/pom.xml
[INFO] run script <https://builds.apache.org/job/maven-plugins-ITs-m3.0.3/ws/maven-shade-plugin/target/it/manifest-retained/verify.bsh>
[INFO] ..SUCCESS (4.7 s)
[INFO] Building: finalNameBuild/pom.xml
[INFO] run script <https://builds.apache.org/job/maven-plugins-ITs-m3.0.3/ws/maven-shade-plugin/target/it/finalNameBuild/setup.bsh>
[INFO] run script <https://builds.apache.org/job/maven-plugins-ITs-m3.0.3/ws/maven-shade-plugin/target/it/finalNameBuild/verify.bsh>
[INFO] ..SUCCESS (3.8 s)
[INFO] Building: finalNameShade/pom.xml
[INFO] run script <https://builds.apache.org/job/maven-plugins-ITs-m3.0.3/ws/maven-shade-plugin/target/it/finalNameShade/setup.bsh>
[INFO] run script <https://builds.apache.org/job/maven-plugins-ITs-m3.0.3/ws/maven-shade-plugin/target/it/finalNameShade/verify.bsh>
[INFO] ..SUCCESS (3.8 s)
[INFO] Building: reloc-abs-resource-path/pom.xml
[INFO] ..SUCCESS (5.9 s)
[INFO] Building: empty-apache-notice-transform/pom.xml
[INFO] ..SUCCESS (4.2 s)
[INFO] Building: services-resource-transformer/pom.xml
[INFO] run script <https://builds.apache.org/job/maven-plugins-ITs-m3.0.3/ws/maven-shade-plugin/target/it/services-resource-transformer/verify.bsh>
[INFO] ..SUCCESS (3.9 s)
[INFO] Building: mini-jar-package-info/pom.xml
[INFO] run script <https://builds.apache.org/job/maven-plugins-ITs-m3.0.3/ws/maven-shade-plugin/target/it/mini-jar-package-info/verify.bsh>
[INFO] ..SUCCESS (4.5 s)
[INFO] Building: rerun-without-reloc/pom.xml
[INFO] ..SUCCESS (3.7 s)
[INFO] Building: shadePomDependency/pom.xml
[INFO] ..SUCCESS (4.7 s)
[INFO] Building: reloc-includes-excludes/pom.xml
[INFO] run script <https://builds.apache.org/job/maven-plugins-ITs-m3.0.3/ws/maven-shade-plugin/target/it/reloc-includes-excludes/verify.bsh>
[INFO] ..SUCCESS (4.2 s)
[INFO] Building: finalNameShade-attached/pom.xml
[INFO] run script <https://builds.apache.org/job/maven-plugins-ITs-m3.0.3/ws/maven-shade-plugin/target/it/finalNameShade-attached/setup.bsh>
[INFO] run script <https://builds.apache.org/job/maven-plugins-ITs-m3.0.3/ws/maven-shade-plugin/target/it/finalNameShade-attached/verify.bsh>
[INFO] ..SUCCESS (3.8 s)
[INFO] Building: component-descriptor-relocation/pom.xml
[INFO] ..SUCCESS (4.5 s)
[INFO] Building: users-shader-impl/pom.xml
[INFO] run script <https://builds.apache.org/job/maven-plugins-ITs-m3.0.3/ws/maven-shade-plugin/target/it/users-shader-impl/verify.groovy>
[INFO] ..SUCCESS (4.6 s)
[INFO] Building: mini-jar-malformed-dependencies/pom.xml
[INFO] ..SUCCESS (7.0 s)
[INFO] Building: finalNameBuild-attached/pom.xml
[INFO] run script <https://builds.apache.org/job/maven-plugins-ITs-m3.0.3/ws/maven-shade-plugin/target/it/finalNameBuild-attached/setup.bsh>
[INFO] run script <https://builds.apache.org/job/maven-plugins-ITs-m3.0.3/ws/maven-shade-plugin/target/it/finalNameBuild-attached/verify.bsh>
[INFO] ..SUCCESS (4.0 s)
[INFO] Building: attach-after-lifecycle-fork/pom.xml
[INFO] run script <https://builds.apache.org/job/maven-plugins-ITs-m3.0.3/ws/maven-shade-plugin/target/it/attach-after-lifecycle-fork/setup.bsh>
[INFO] run script <https://builds.apache.org/job/maven-plugins-ITs-m3.0.3/ws/maven-shade-plugin/target/it/attach-after-lifecycle-fork/verify.bsh>
[INFO] ..SUCCESS (3.0 s)
[INFO] Building: empty-relocation-pattern/pom.xml
[INFO] ..SUCCESS (3.6 s)
[INFO] Building: mini-jar/pom.xml
[INFO] run script <https://builds.apache.org/job/maven-plugins-ITs-m3.0.3/ws/maven-shade-plugin/target/it/mini-jar/verify.bsh>
[INFO] ..SUCCESS (4.4 s)
[INFO] Building: reloc-anno/pom.xml
[INFO] ..SUCCESS (3.5 s)
[INFO] Building: MSHADE-105/pom.xml
[INFO] run script <https://builds.apache.org/job/maven-plugins-ITs-m3.0.3/ws/maven-shade-plugin/target/it/MSHADE-105/verify.bsh>
[INFO] ..SUCCESS (7.3 s)
[INFO] Building: dep-reduced-pom-relocated-result/pom.xml
[INFO] ..SUCCESS (3.0 s)
[INFO] Building: attached-artifact-type/pom.xml
[INFO] ..SUCCESS (3.4 s)
[INFO] Building: dep-reduced-pom/pom.xml
[INFO] run script <https://builds.apache.org/job/maven-plugins-ITs-m3.0.3/ws/maven-shade-plugin/target/it/dep-reduced-pom/verify.groovy>
[INFO] ..SUCCESS (4.1 s)
[INFO] Building: rerun-with-reloc/pom.xml
[INFO] ..SUCCESS (6.2 s)
[INFO] Building: duplicate-classes-with-reloc/pom.xml
[INFO] ..SUCCESS (3.1 s)
[INFO] Building: filter-artifact-contents/pom.xml
[INFO] run script <https://builds.apache.org/job/maven-plugins-ITs-m3.0.3/ws/maven-shade-plugin/target/it/filter-artifact-contents/verify.bsh>
[INFO] ..SUCCESS (3.8 s)
[INFO] Building: project-with-reactors-included/pom.xml
[INFO] run script <https://builds.apache.org/job/maven-plugins-ITs-m3.0.3/ws/maven-shade-plugin/target/it/project-with-reactors-included/verify.bsh>
[INFO] ..SUCCESS (5.7 s)
[INFO] Building: reloc-enum-ref-from-anno/pom.xml
[INFO] ..SUCCESS (3.4 s)
[INFO] 
[INFO] --- maven-invoker-plugin:1.6:verify (integration-test) @ maven-shade-plugin ---
[INFO] -------------------------------------------------
[INFO] Build Summary:
[INFO]   Passed: 41, Failed: 0, Errors: 0, Skipped: 0
[INFO] -------------------------------------------------
[INFO] 
[INFO] --- maven-install-plugin:2.3.1:install (default-install) @ maven-shade-plugin ---
[INFO] Installing <https://builds.apache.org/job/maven-plugins-ITs-m3.0.3/ws/maven-shade-plugin/target/maven-shade-plugin-2.0.1-SNAPSHOT.jar> to /home/jenkins/.m2/repository/org/apache/maven/plugins/maven-shade-plugin/2.0.1-SNAPSHOT/maven-shade-plugin-2.0.1-SNAPSHOT.jar
[INFO] Installing <https://builds.apache.org/job/maven-plugins-ITs-m3.0.3/ws/maven-shade-plugin/pom.xml> to /home/jenkins/.m2/repository/org/apache/maven/plugins/maven-shade-plugin/2.0.1-SNAPSHOT/maven-shade-plugin-2.0.1-SNAPSHOT.pom
[INFO] Installing <https://builds.apache.org/job/maven-plugins-ITs-m3.0.3/ws/maven-shade-plugin/target/maven-shade-plugin-2.0.1-SNAPSHOT-tests.jar> to /home/jenkins/.m2/repository/org/apache/maven/plugins/maven-shade-plugin/2.0.1-SNAPSHOT/maven-shade-plugin-2.0.1-SNAPSHOT-tests.jar
[INFO]                                                                         
[INFO] ------------------------------------------------------------------------
[INFO] Building Maven Plugins Aggregator 1-SNAPSHOT
[INFO] ------------------------------------------------------------------------
[INFO] 
[INFO] --- maven-clean-plugin:2.4.1:clean (default-clean) @ maven-plugins-aggregator ---
[INFO] Deleting <https://builds.apache.org/job/maven-plugins-ITs-m3.0.3/ws/target>
[INFO] 
[INFO] --- maven-remote-resources-plugin:1.1:process (default) @ maven-plugins-aggregator ---
[INFO] 
[INFO] --- maven-install-plugin:2.3.1:install (default-install) @ maven-plugins-aggregator ---
[INFO] Installing <https://builds.apache.org/job/maven-plugins-ITs-m3.0.3/ws/pom.xml> to /home/jenkins/.m2/repository/org/apache/maven/plugins/maven-plugins-aggregator/1-SNAPSHOT/maven-plugins-aggregator-1-SNAPSHOT.pom
[INFO] ------------------------------------------------------------------------
[INFO] Reactor Summary:
[INFO] 
[INFO] Maven Plugins ..................................... SUCCESS [25.729s]
[INFO] Maven ACR Plugin .................................. SUCCESS [31.106s]
[INFO] Maven Ant Plugin .................................. SUCCESS [1:14.184s]
[INFO] Maven AntRun Plugin ............................... SUCCESS [58.138s]
[INFO] Maven Eclipse Plugin .............................. SUCCESS [6:43.864s]
[INFO] Maven Assembly Plugin ............................. SUCCESS [11:29.573s]
[INFO] Maven Changelog Plugin ............................ SUCCESS [55.929s]
[INFO] Maven Changes Report Plugin ....................... SUCCESS [1:34.023s]
[INFO] Maven Checkstyle Plugin ........................... SUCCESS [1:42.377s]
[INFO] Maven Clean Plugin ................................ SUCCESS [26.804s]
[INFO] Maven Compiler Plugin ............................. SUCCESS [1:07.335s]
[INFO] Maven Dependency Plugin ........................... FAILURE [0.520s]
[INFO] Maven Deploy Plugin ............................... SUCCESS [1:02.862s]
[INFO] Maven DOAP Plugin ................................. SUCCESS [19.754s]
[INFO] Maven Documentation Checker Plugin ................ SUCCESS [1:48.343s]
[INFO] Maven EAR Plugin .................................. SUCCESS [4:03.595s]
[INFO] Maven EJB Plugin .................................. SUCCESS [28.546s]
[INFO] Maven GPG Plugin .................................. SUCCESS [15.786s]
[INFO] Maven Help Plugin ................................. SUCCESS [37.532s]
[INFO] Maven IDEA Plugin ................................. SUCCESS [7.977s]
[INFO] Maven Install Plugin .............................. SUCCESS [40.757s]
[INFO] Maven JAR Plugin .................................. SUCCESS [1:08.193s]
[INFO] Maven Jarsigner Plugin ............................ SUCCESS [25.280s]
[INFO] Maven Javadoc Plugin .............................. SUCCESS [3:04.120s]
[INFO] Maven Linkcheck Plugin ............................ SUCCESS [2.928s]
[INFO] Maven One Plugin .................................. SUCCESS [2.063s]
[INFO] Maven Patch Plugin ................................ SUCCESS [12.639s]
[INFO] Maven PDF Plugin .................................. SUCCESS [34.858s]
[INFO] Maven PMD Plugin .................................. SUCCESS [41.333s]
[INFO] Maven RAR Plugin .................................. SUCCESS [10.602s]
[INFO] Maven Reactor Plugin .............................. SUCCESS [2.895s]
[INFO] Maven Repository Plugin ........................... SUCCESS [41.072s]
[INFO] Maven Resources Plugin ............................ SUCCESS [56.786s]
[INFO] Maven Site Plugin 3 ............................... SUCCESS [7:21.792s]
[INFO] Maven Source Plugin ............................... SUCCESS [49.308s]
[INFO] Maven Stage Plugin ................................ SUCCESS [5.341s]
[INFO] Maven Toolchains Plugin ........................... SUCCESS [2.370s]
[INFO] Maven Verifier Plugin ............................. SUCCESS [16.684s]
[INFO] Maven WAR Plugin .................................. SUCCESS [1:28.451s]
[INFO] SCM Publish Maven Plugin .......................... SUCCESS [1:25.279s]
[INFO] Maven Invoker Plugin .............................. SUCCESS [4:48.565s]
[INFO] Maven Project Info Reports Plugin ................. SUCCESS [2:36.314s]
[INFO] Maven Remote Resources Plugin ..................... SUCCESS [54.013s]
[INFO] Maven Shade Plugin ................................ SUCCESS [3:12.197s]
[INFO] Maven Plugins Aggregator .......................... SUCCESS [0.080s]
[INFO] ------------------------------------------------------------------------
[INFO] BUILD FAILURE
[INFO] ------------------------------------------------------------------------
[INFO] Total time: 1:07:40.106s
[INFO] Finished at: Fri Nov 23 23:10:10 UTC 2012
[INFO] Final Memory: 101M/417M
[INFO] ------------------------------------------------------------------------
[WARNING] The requested profile "apache.snapshots" could not be activated because it does not exist.
[ERROR] Failed to execute goal on project maven-dependency-plugin: Could not resolve dependencies for project org.apache.maven.plugins:maven-dependency-plugin:maven-plugin:2.7-SNAPSHOT: Could not find artifact org.apache.maven.shared:maven-dependency-analyzer:jar:1.3 in central (http://repo1.maven.org/maven2) -> [Help 1]
[ERROR] 
[ERROR] To see the full stack trace of the errors, re-run Maven with the -e switch.
[ERROR] Re-run Maven using the -X switch to enable full debug logging.
[ERROR] 
[ERROR] For more information about the errors and possible solutions, please read the following articles:
[ERROR] [Help 1] http://cwiki.apache.org/confluence/display/MAVEN/DependencyResolutionException
[ERROR] 
[ERROR] After correcting the problems, you can resume the build with the command
[ERROR]   mvn <goals> -rf :maven-dependency-plugin
Build step 'Invoke top-level Maven targets' marked build as failure
Recording test results

Build failed in Jenkins: maven-plugins-ITs-m3.0.3 #68

Posted by Apache Jenkins Server <je...@builds.apache.org>.
See <https://builds.apache.org/job/maven-plugins-ITs-m3.0.3/68/changes>

Changes:

[Robert Scholte] [maven-release-plugin] prepare for next development iteration

[Robert Scholte] [maven-release-plugin] prepare release maven-invoker-plugin-1.8

[Robert Scholte] Use inherited version of maven-invoker-plugin

------------------------------------------
[...truncated 9840 lines...]
 T E S T S
-------------------------------------------------------
Running org.apache.maven.plugins.shade.mojo.RelativizePathTest
Tests run: 1, Failures: 0, Errors: 0, Skipped: 0, Time elapsed: 0.049 sec
Running org.apache.maven.plugins.shade.mojo.ShadeMojoTest
Tests run: 4, Failures: 0, Errors: 0, Skipped: 0, Time elapsed: 2.299 sec
Running org.apache.maven.plugins.shade.mojo.ArtifactSelectorTest
Tests run: 1, Failures: 0, Errors: 0, Skipped: 0, Time elapsed: 0.001 sec
Running org.apache.maven.plugins.shade.mojo.ArtifactIdTest
Tests run: 2, Failures: 0, Errors: 0, Skipped: 0, Time elapsed: 0.001 sec
Running org.apache.maven.plugins.shade.filter.SimpleFilterTest
Tests run: 1, Failures: 0, Errors: 0, Skipped: 0, Time elapsed: 0 sec
Running org.apache.maven.plugins.shade.resource.AppendingTransformerTest
Tests run: 1, Failures: 0, Errors: 0, Skipped: 0, Time elapsed: 0.001 sec
Running org.apache.maven.plugins.shade.resource.ApacheNoticeResourceTransformerTest
Tests run: 1, Failures: 0, Errors: 0, Skipped: 0, Time elapsed: 0.001 sec
Running org.apache.maven.plugins.shade.resource.ApacheLicenseResourceTransformerTest
Tests run: 1, Failures: 0, Errors: 0, Skipped: 0, Time elapsed: 0.001 sec
Running org.apache.maven.plugins.shade.resource.XmlAppendingTransformerTest
Tests run: 1, Failures: 0, Errors: 0, Skipped: 0, Time elapsed: 0.005 sec
Running org.apache.maven.plugins.shade.resource.ComponentsXmlResourceTransformerTest
Tests run: 1, Failures: 0, Errors: 0, Skipped: 0, Time elapsed: 0.063 sec
Running org.apache.maven.plugins.shade.relocation.SimpleRelocatorParameterTest
Tests run: 2, Failures: 0, Errors: 0, Skipped: 0, Time elapsed: 0 sec
Running org.apache.maven.plugins.shade.relocation.SimpleRelocatorTest
Tests run: 7, Failures: 0, Errors: 0, Skipped: 0, Time elapsed: 0.003 sec
Running org.apache.maven.plugins.shade.DefaultShaderTest
Tests run: 4, Failures: 0, Errors: 0, Skipped: 0, Time elapsed: 0.962 sec

Results :

Tests run: 27, Failures: 0, Errors: 0, Skipped: 0

[INFO] 
[INFO] --- maven-jar-plugin:2.4:jar (default-jar) @ maven-shade-plugin ---
[INFO] Building jar: <https://builds.apache.org/job/maven-plugins-ITs-m3.0.3/ws/maven-shade-plugin/target/maven-shade-plugin-2.0.1-SNAPSHOT.jar>
[INFO] 
[INFO] --- maven-plugin-plugin:3.2:addPluginArtifactMetadata (default-addPluginArtifactMetadata) @ maven-shade-plugin ---
[INFO] 
[INFO] --- maven-jar-plugin:2.4:test-jar (default) @ maven-shade-plugin ---
[INFO] Building jar: <https://builds.apache.org/job/maven-plugins-ITs-m3.0.3/ws/maven-shade-plugin/target/maven-shade-plugin-2.0.1-SNAPSHOT-tests.jar>
[INFO] 
[INFO] --- maven-invoker-plugin:1.6:install (integration-test) @ maven-shade-plugin ---
[INFO] Installing <https://builds.apache.org/job/maven-plugins-ITs-m3.0.3/ws/maven-shade-plugin/pom.xml> to <https://builds.apache.org/job/maven-plugins-ITs-m3.0.3/ws/maven-shade-plugin/target/local-repo/org/apache/maven/plugins/maven-shade-plugin/2.0.1-SNAPSHOT/maven-shade-plugin-2.0.1-SNAPSHOT.pom>
[INFO] Installing <https://builds.apache.org/job/maven-plugins-ITs-m3.0.3/ws/maven-shade-plugin/target/maven-shade-plugin-2.0.1-SNAPSHOT.jar> to <https://builds.apache.org/job/maven-plugins-ITs-m3.0.3/ws/maven-shade-plugin/target/local-repo/org/apache/maven/plugins/maven-shade-plugin/2.0.1-SNAPSHOT/maven-shade-plugin-2.0.1-SNAPSHOT.jar>
[INFO] Installing <https://builds.apache.org/job/maven-plugins-ITs-m3.0.3/ws/maven-shade-plugin/target/maven-shade-plugin-2.0.1-SNAPSHOT-tests.jar> to <https://builds.apache.org/job/maven-plugins-ITs-m3.0.3/ws/maven-shade-plugin/target/local-repo/org/apache/maven/plugins/maven-shade-plugin/2.0.1-SNAPSHOT/maven-shade-plugin-2.0.1-SNAPSHOT-tests.jar>
[INFO] 
[INFO] --- maven-invoker-plugin:1.6:integration-test (integration-test) @ maven-shade-plugin ---
[INFO] Building: shadePomDependency/pom.xml
[INFO] ..SUCCESS (5.9 s)
[INFO] Building: finalNameShade-attached/pom.xml
[INFO] run script <https://builds.apache.org/job/maven-plugins-ITs-m3.0.3/ws/maven-shade-plugin/target/it/finalNameShade-attached/setup.bsh>
[INFO] run script <https://builds.apache.org/job/maven-plugins-ITs-m3.0.3/ws/maven-shade-plugin/target/it/finalNameShade-attached/verify.bsh>
[INFO] ..SUCCESS (3.7 s)
[INFO] Building: attached-artifact-type/pom.xml
[INFO] ..SUCCESS (3.1 s)
[INFO] Building: project-with-reactors-included/pom.xml
[INFO] run script <https://builds.apache.org/job/maven-plugins-ITs-m3.0.3/ws/maven-shade-plugin/target/it/project-with-reactors-included/verify.bsh>
[INFO] ..SUCCESS (7.1 s)
[INFO] Building: pom-packaging/pom.xml
[INFO] run script <https://builds.apache.org/job/maven-plugins-ITs-m3.0.3/ws/maven-shade-plugin/target/it/pom-packaging/verify.bsh>
[INFO] ..SUCCESS (2.6 s)
[INFO] Building: users-shader-impl/pom.xml
[INFO] run script <https://builds.apache.org/job/maven-plugins-ITs-m3.0.3/ws/maven-shade-plugin/target/it/users-shader-impl/verify.groovy>
[INFO] ..SUCCESS (4.2 s)
[INFO] Building: mini-jar-respect-includes/pom.xml
[INFO] run script <https://builds.apache.org/job/maven-plugins-ITs-m3.0.3/ws/maven-shade-plugin/target/it/mini-jar-respect-includes/verify.bsh>
[INFO] ..SUCCESS (4.6 s)
[INFO] Building: reloc-includes-excludes/pom.xml
[INFO] run script <https://builds.apache.org/job/maven-plugins-ITs-m3.0.3/ws/maven-shade-plugin/target/it/reloc-includes-excludes/verify.bsh>
[INFO] ..SUCCESS (4.0 s)
[INFO] Building: manifest-retained/pom.xml
[INFO] run script <https://builds.apache.org/job/maven-plugins-ITs-m3.0.3/ws/maven-shade-plugin/target/it/manifest-retained/verify.bsh>
[INFO] ..SUCCESS (4.8 s)
[INFO] Building: implicit-inclusion-of-project-artifact/pom.xml
[INFO] run script <https://builds.apache.org/job/maven-plugins-ITs-m3.0.3/ws/maven-shade-plugin/target/it/implicit-inclusion-of-project-artifact/verify.bsh>
[INFO] ..SUCCESS (3.9 s)
[INFO] Building: dep-reduced-pom-relocated-result/pom.xml
[INFO] ..SUCCESS (2.8 s)
[INFO] Building: dep-reduced-pom-with-local-parent/pom.xml
[INFO] ..SUCCESS (2.8 s)
[INFO] Building: rerun-without-reloc/pom.xml
[INFO] ..SUCCESS (3.6 s)
[INFO] Building: finalNameBuild-attached/pom.xml
[INFO] run script <https://builds.apache.org/job/maven-plugins-ITs-m3.0.3/ws/maven-shade-plugin/target/it/finalNameBuild-attached/setup.bsh>
[INFO] run script <https://builds.apache.org/job/maven-plugins-ITs-m3.0.3/ws/maven-shade-plugin/target/it/finalNameBuild-attached/verify.bsh>
[INFO] ..SUCCESS (3.6 s)
[INFO] Building: empty-apache-notice-transform/pom.xml
[INFO] ..SUCCESS (4.3 s)
[INFO] Building: MSHADE-105/pom.xml
[INFO] run script <https://builds.apache.org/job/maven-plugins-ITs-m3.0.3/ws/maven-shade-plugin/target/it/MSHADE-105/verify.bsh>
[INFO] ..SUCCESS (7.2 s)
[INFO] Building: reloc-anno/pom.xml
[INFO] ..SUCCESS (3.5 s)
[INFO] Building: component-descriptor-relocation/pom.xml
[INFO] ..SUCCESS (4.6 s)
[INFO] Building: mini-jar-package-info/pom.xml
[INFO] run script <https://builds.apache.org/job/maven-plugins-ITs-m3.0.3/ws/maven-shade-plugin/target/it/mini-jar-package-info/verify.bsh>
[INFO] ..SUCCESS (4.3 s)
[INFO] Building: dep-reduced-pom/pom.xml
[INFO] run script <https://builds.apache.org/job/maven-plugins-ITs-m3.0.3/ws/maven-shade-plugin/target/it/dep-reduced-pom/verify.groovy>
[INFO] ..SUCCESS (3.9 s)
[INFO] Building: mshade-123/pom.xml
[INFO] ..SUCCESS (6.2 s)
[INFO] Building: reloc-enum-ref-from-anno/pom.xml
[INFO] ..SUCCESS (3.5 s)
[INFO] Building: rerun-with-reloc/pom.xml
[INFO] ..SUCCESS (5.3 s)
[INFO] Building: mini-jar/pom.xml
[INFO] run script <https://builds.apache.org/job/maven-plugins-ITs-m3.0.3/ws/maven-shade-plugin/target/it/mini-jar/verify.bsh>
[INFO] ..SUCCESS (4.1 s)
[INFO] Building: xml-transformer-ignores-dtd/pom.xml
[INFO] run script <https://builds.apache.org/job/maven-plugins-ITs-m3.0.3/ws/maven-shade-plugin/target/it/xml-transformer-ignores-dtd/verify.bsh>
[INFO] ..SUCCESS (3.9 s)
[INFO] Building: duplicate-classes-with-reloc/pom.xml
[INFO] ..SUCCESS (3.0 s)
[INFO] Building: finalNameShade/pom.xml
[INFO] run script <https://builds.apache.org/job/maven-plugins-ITs-m3.0.3/ws/maven-shade-plugin/target/it/finalNameShade/setup.bsh>
[INFO] run script <https://builds.apache.org/job/maven-plugins-ITs-m3.0.3/ws/maven-shade-plugin/target/it/finalNameShade/verify.bsh>
[INFO] ..SUCCESS (3.6 s)
[INFO] Building: finalNameBuild/pom.xml
[INFO] run script <https://builds.apache.org/job/maven-plugins-ITs-m3.0.3/ws/maven-shade-plugin/target/it/finalNameBuild/setup.bsh>
[INFO] run script <https://builds.apache.org/job/maven-plugins-ITs-m3.0.3/ws/maven-shade-plugin/target/it/finalNameBuild/verify.bsh>
[INFO] ..SUCCESS (3.6 s)
[INFO] Building: filter-artifact-contents/pom.xml
[INFO] run script <https://builds.apache.org/job/maven-plugins-ITs-m3.0.3/ws/maven-shade-plugin/target/it/filter-artifact-contents/verify.bsh>
[INFO] ..SUCCESS (3.7 s)
[INFO] Building: artifact-includes-excludes/pom.xml
[INFO] run script <https://builds.apache.org/job/maven-plugins-ITs-m3.0.3/ws/maven-shade-plugin/target/it/artifact-includes-excludes/verify.bsh>
[INFO] ..SUCCESS (3.7 s)
[INFO] Building: non-runtime-scope-excluded/pom.xml
[INFO] run script <https://builds.apache.org/job/maven-plugins-ITs-m3.0.3/ws/maven-shade-plugin/target/it/non-runtime-scope-excluded/verify.bsh>
[INFO] ..SUCCESS (3.8 s)
[INFO] Building: manifest-transformed/pom.xml
[INFO] run script <https://builds.apache.org/job/maven-plugins-ITs-m3.0.3/ws/maven-shade-plugin/target/it/manifest-transformed/verify.bsh>
[INFO] ..SUCCESS (4.6 s)
[INFO] Building: dep-reduced-pom-unique/pom.xml
[INFO] run script <https://builds.apache.org/job/maven-plugins-ITs-m3.0.3/ws/maven-shade-plugin/target/it/dep-reduced-pom-unique/verify.groovy>
[INFO] ..SUCCESS (3.9 s)
[INFO] Building: reloc-abs-resource-path/pom.xml
[INFO] ..SUCCESS (5.7 s)
[INFO] Building: services-resource-transformer/pom.xml
[INFO] run script <https://builds.apache.org/job/maven-plugins-ITs-m3.0.3/ws/maven-shade-plugin/target/it/services-resource-transformer/verify.bsh>
[INFO] ..SUCCESS (3.7 s)
[INFO] Building: reloc-class-from-string-pool/pom.xml
[INFO] ..SUCCESS (3.5 s)
[INFO] Building: attach-after-lifecycle-fork/pom.xml
[INFO] run script <https://builds.apache.org/job/maven-plugins-ITs-m3.0.3/ws/maven-shade-plugin/target/it/attach-after-lifecycle-fork/setup.bsh>
[INFO] run script <https://builds.apache.org/job/maven-plugins-ITs-m3.0.3/ws/maven-shade-plugin/target/it/attach-after-lifecycle-fork/verify.bsh>
[INFO] ..SUCCESS (3.0 s)
[INFO] Building: mini-jar-malformed-dependencies/pom.xml
[INFO] ..SUCCESS (7.4 s)
[INFO] Building: duplicate-classes-without-reloc/pom.xml
[INFO] ..SUCCESS (2.9 s)
[INFO] Building: empty-relocation-shaded-pattern/pom.xml
[INFO] ..SUCCESS (3.5 s)
[INFO] Building: empty-relocation-pattern/pom.xml
[INFO] ..SUCCESS (3.7 s)
[INFO] 
[INFO] --- maven-invoker-plugin:1.6:verify (integration-test) @ maven-shade-plugin ---
[INFO] -------------------------------------------------
[INFO] Build Summary:
[INFO]   Passed: 41, Failed: 0, Errors: 0, Skipped: 0
[INFO] -------------------------------------------------
[INFO] 
[INFO] --- maven-install-plugin:2.3.1:install (default-install) @ maven-shade-plugin ---
[INFO] Installing <https://builds.apache.org/job/maven-plugins-ITs-m3.0.3/ws/maven-shade-plugin/target/maven-shade-plugin-2.0.1-SNAPSHOT.jar> to /home/jenkins/.m2/repository/org/apache/maven/plugins/maven-shade-plugin/2.0.1-SNAPSHOT/maven-shade-plugin-2.0.1-SNAPSHOT.jar
[INFO] Installing <https://builds.apache.org/job/maven-plugins-ITs-m3.0.3/ws/maven-shade-plugin/pom.xml> to /home/jenkins/.m2/repository/org/apache/maven/plugins/maven-shade-plugin/2.0.1-SNAPSHOT/maven-shade-plugin-2.0.1-SNAPSHOT.pom
[INFO] Installing <https://builds.apache.org/job/maven-plugins-ITs-m3.0.3/ws/maven-shade-plugin/target/maven-shade-plugin-2.0.1-SNAPSHOT-tests.jar> to /home/jenkins/.m2/repository/org/apache/maven/plugins/maven-shade-plugin/2.0.1-SNAPSHOT/maven-shade-plugin-2.0.1-SNAPSHOT-tests.jar
[INFO]                                                                         
[INFO] ------------------------------------------------------------------------
[INFO] Building Maven Plugins Aggregator 1-SNAPSHOT
[INFO] ------------------------------------------------------------------------
[INFO] 
[INFO] --- maven-clean-plugin:2.4.1:clean (default-clean) @ maven-plugins-aggregator ---
[INFO] Deleting <https://builds.apache.org/job/maven-plugins-ITs-m3.0.3/ws/target>
[INFO] 
[INFO] --- maven-remote-resources-plugin:1.1:process (default) @ maven-plugins-aggregator ---
[INFO] 
[INFO] --- maven-install-plugin:2.3.1:install (default-install) @ maven-plugins-aggregator ---
[INFO] Installing <https://builds.apache.org/job/maven-plugins-ITs-m3.0.3/ws/pom.xml> to /home/jenkins/.m2/repository/org/apache/maven/plugins/maven-plugins-aggregator/1-SNAPSHOT/maven-plugins-aggregator-1-SNAPSHOT.pom
[INFO] ------------------------------------------------------------------------
[INFO] Reactor Summary:
[INFO] 
[INFO] Maven Plugins ..................................... SUCCESS [5.022s]
[INFO] Maven ACR Plugin .................................. SUCCESS [32.315s]
[INFO] Maven Ant Plugin .................................. SUCCESS [1:13.575s]
[INFO] Maven AntRun Plugin ............................... SUCCESS [54.242s]
[INFO] Maven Eclipse Plugin .............................. SUCCESS [6:51.018s]
[INFO] Maven Assembly Plugin ............................. SUCCESS [11:29.189s]
[INFO] Maven Changelog Plugin ............................ SUCCESS [52.541s]
[INFO] Maven Changes Report Plugin ....................... SUCCESS [1:01.774s]
[INFO] Maven Checkstyle Plugin ........................... SUCCESS [1:47.527s]
[INFO] Maven Clean Plugin ................................ SUCCESS [28.099s]
[INFO] Maven Compiler Plugin ............................. SUCCESS [1:12.683s]
[INFO] Maven Dependency Plugin ........................... FAILURE [0.760s]
[INFO] Maven Deploy Plugin ............................... SUCCESS [1:02.100s]
[INFO] Maven DOAP Plugin ................................. SUCCESS [20.223s]
[INFO] Maven Documentation Checker Plugin ................ SUCCESS [8.121s]
[INFO] Maven EAR Plugin .................................. SUCCESS [3:49.604s]
[INFO] Maven EJB Plugin .................................. SUCCESS [28.471s]
[INFO] Maven GPG Plugin .................................. SUCCESS [12.370s]
[INFO] Maven Help Plugin ................................. SUCCESS [34.408s]
[INFO] Maven IDEA Plugin ................................. SUCCESS [9.140s]
[INFO] Maven Install Plugin .............................. SUCCESS [40.943s]
[INFO] Maven JAR Plugin .................................. SUCCESS [1:10.985s]
[INFO] Maven Jarsigner Plugin ............................ SUCCESS [24.286s]
[INFO] Maven Javadoc Plugin .............................. SUCCESS [3:04.294s]
[INFO] Maven Linkcheck Plugin ............................ SUCCESS [2.758s]
[INFO] Maven One Plugin .................................. SUCCESS [3.565s]
[INFO] Maven Patch Plugin ................................ SUCCESS [13.131s]
[INFO] Maven PDF Plugin .................................. SUCCESS [41.544s]
[INFO] Maven PMD Plugin .................................. SUCCESS [50.982s]
[INFO] Maven RAR Plugin .................................. SUCCESS [19.119s]
[INFO] Maven Reactor Plugin .............................. SUCCESS [3.106s]
[INFO] Maven Repository Plugin ........................... SUCCESS [43.016s]
[INFO] Maven Resources Plugin ............................ SUCCESS [55.458s]
[INFO] Maven Site Plugin 3 ............................... SUCCESS [6:19.882s]
[INFO] Maven Source Plugin ............................... SUCCESS [45.833s]
[INFO] Maven Stage Plugin ................................ SUCCESS [2.448s]
[INFO] Maven Toolchains Plugin ........................... SUCCESS [2.247s]
[INFO] Maven Verifier Plugin ............................. SUCCESS [16.024s]
[INFO] Maven WAR Plugin .................................. SUCCESS [1:22.760s]
[INFO] SCM Publish Maven Plugin .......................... SUCCESS [1:21.928s]
[INFO] Maven Invoker Plugin .............................. SUCCESS [4:26.641s]
[INFO] Maven Project Info Reports Plugin ................. SUCCESS [2:56.811s]
[INFO] Maven Remote Resources Plugin ..................... SUCCESS [56.113s]
[INFO] Maven Shade Plugin ................................ SUCCESS [3:15.759s]
[INFO] Maven Plugins Aggregator .......................... SUCCESS [0.053s]
[INFO] ------------------------------------------------------------------------
[INFO] BUILD FAILURE
[INFO] ------------------------------------------------------------------------
[INFO] Total time: 1:04:35.010s
[INFO] Finished at: Fri Nov 23 19:24:49 UTC 2012
[INFO] Final Memory: 101M/417M
[INFO] ------------------------------------------------------------------------
[WARNING] The requested profile "apache.snapshots" could not be activated because it does not exist.
[ERROR] Failed to execute goal on project maven-dependency-plugin: Could not resolve dependencies for project org.apache.maven.plugins:maven-dependency-plugin:maven-plugin:2.7-SNAPSHOT: Could not find artifact org.apache.maven.shared:maven-dependency-analyzer:jar:1.3 in central (http://repo1.maven.org/maven2) -> [Help 1]
[ERROR] 
[ERROR] To see the full stack trace of the errors, re-run Maven with the -e switch.
[ERROR] Re-run Maven using the -X switch to enable full debug logging.
[ERROR] 
[ERROR] For more information about the errors and possible solutions, please read the following articles:
[ERROR] [Help 1] http://cwiki.apache.org/confluence/display/MAVEN/DependencyResolutionException
[ERROR] 
[ERROR] After correcting the problems, you can resume the build with the command
[ERROR]   mvn <goals> -rf :maven-dependency-plugin
Build step 'Invoke top-level Maven targets' marked build as failure
Recording test results

Build failed in Jenkins: maven-plugins-ITs-m3.0.3 #67

Posted by Apache Jenkins Server <je...@builds.apache.org>.
See <https://builds.apache.org/job/maven-plugins-ITs-m3.0.3/67/changes>

Changes:

[Robert Scholte] Add workaround for MRELEASE-803

------------------------------------------
[...truncated 9808 lines...]
 T E S T S
-------------------------------------------------------
Running org.apache.maven.plugins.shade.mojo.ArtifactSelectorTest
Tests run: 1, Failures: 0, Errors: 0, Skipped: 0, Time elapsed: 0.028 sec
Running org.apache.maven.plugins.shade.mojo.ShadeMojoTest
Tests run: 4, Failures: 0, Errors: 0, Skipped: 0, Time elapsed: 2.344 sec
Running org.apache.maven.plugins.shade.mojo.RelativizePathTest
Tests run: 1, Failures: 0, Errors: 0, Skipped: 0, Time elapsed: 0.017 sec
Running org.apache.maven.plugins.shade.mojo.ArtifactIdTest
Tests run: 2, Failures: 0, Errors: 0, Skipped: 0, Time elapsed: 0.002 sec
Running org.apache.maven.plugins.shade.DefaultShaderTest
Tests run: 4, Failures: 0, Errors: 0, Skipped: 0, Time elapsed: 0.825 sec
Running org.apache.maven.plugins.shade.resource.AppendingTransformerTest
Tests run: 1, Failures: 0, Errors: 0, Skipped: 0, Time elapsed: 0.001 sec
Running org.apache.maven.plugins.shade.resource.ApacheNoticeResourceTransformerTest
Tests run: 1, Failures: 0, Errors: 0, Skipped: 0, Time elapsed: 0.001 sec
Running org.apache.maven.plugins.shade.resource.XmlAppendingTransformerTest
Tests run: 1, Failures: 0, Errors: 0, Skipped: 0, Time elapsed: 0.005 sec
Running org.apache.maven.plugins.shade.resource.ApacheLicenseResourceTransformerTest
Tests run: 1, Failures: 0, Errors: 0, Skipped: 0, Time elapsed: 0 sec
Running org.apache.maven.plugins.shade.resource.ComponentsXmlResourceTransformerTest
Tests run: 1, Failures: 0, Errors: 0, Skipped: 0, Time elapsed: 0.056 sec
Running org.apache.maven.plugins.shade.filter.SimpleFilterTest
Tests run: 1, Failures: 0, Errors: 0, Skipped: 0, Time elapsed: 0 sec
Running org.apache.maven.plugins.shade.relocation.SimpleRelocatorParameterTest
Tests run: 2, Failures: 0, Errors: 0, Skipped: 0, Time elapsed: 0 sec
Running org.apache.maven.plugins.shade.relocation.SimpleRelocatorTest
Tests run: 7, Failures: 0, Errors: 0, Skipped: 0, Time elapsed: 0.003 sec

Results :

Tests run: 27, Failures: 0, Errors: 0, Skipped: 0

[INFO] 
[INFO] --- maven-jar-plugin:2.4:jar (default-jar) @ maven-shade-plugin ---
[INFO] Building jar: <https://builds.apache.org/job/maven-plugins-ITs-m3.0.3/ws/maven-shade-plugin/target/maven-shade-plugin-2.0.1-SNAPSHOT.jar>
[INFO] 
[INFO] --- maven-plugin-plugin:3.2:addPluginArtifactMetadata (default-addPluginArtifactMetadata) @ maven-shade-plugin ---
[INFO] 
[INFO] --- maven-jar-plugin:2.4:test-jar (default) @ maven-shade-plugin ---
[INFO] Building jar: <https://builds.apache.org/job/maven-plugins-ITs-m3.0.3/ws/maven-shade-plugin/target/maven-shade-plugin-2.0.1-SNAPSHOT-tests.jar>
[INFO] 
[INFO] --- maven-invoker-plugin:1.6:install (integration-test) @ maven-shade-plugin ---
[INFO] Installing <https://builds.apache.org/job/maven-plugins-ITs-m3.0.3/ws/maven-shade-plugin/pom.xml> to <https://builds.apache.org/job/maven-plugins-ITs-m3.0.3/ws/maven-shade-plugin/target/local-repo/org/apache/maven/plugins/maven-shade-plugin/2.0.1-SNAPSHOT/maven-shade-plugin-2.0.1-SNAPSHOT.pom>
[INFO] Installing <https://builds.apache.org/job/maven-plugins-ITs-m3.0.3/ws/maven-shade-plugin/target/maven-shade-plugin-2.0.1-SNAPSHOT.jar> to <https://builds.apache.org/job/maven-plugins-ITs-m3.0.3/ws/maven-shade-plugin/target/local-repo/org/apache/maven/plugins/maven-shade-plugin/2.0.1-SNAPSHOT/maven-shade-plugin-2.0.1-SNAPSHOT.jar>
[INFO] Installing <https://builds.apache.org/job/maven-plugins-ITs-m3.0.3/ws/maven-shade-plugin/target/maven-shade-plugin-2.0.1-SNAPSHOT-tests.jar> to <https://builds.apache.org/job/maven-plugins-ITs-m3.0.3/ws/maven-shade-plugin/target/local-repo/org/apache/maven/plugins/maven-shade-plugin/2.0.1-SNAPSHOT/maven-shade-plugin-2.0.1-SNAPSHOT-tests.jar>
[INFO] 
[INFO] --- maven-invoker-plugin:1.6:integration-test (integration-test) @ maven-shade-plugin ---
[INFO] Building: xml-transformer-ignores-dtd/pom.xml
[INFO] run script <https://builds.apache.org/job/maven-plugins-ITs-m3.0.3/ws/maven-shade-plugin/target/it/xml-transformer-ignores-dtd/verify.bsh>
[INFO] ..SUCCESS (4.0 s)
[INFO] Building: attach-after-lifecycle-fork/pom.xml
[INFO] run script <https://builds.apache.org/job/maven-plugins-ITs-m3.0.3/ws/maven-shade-plugin/target/it/attach-after-lifecycle-fork/setup.bsh>
[INFO] run script <https://builds.apache.org/job/maven-plugins-ITs-m3.0.3/ws/maven-shade-plugin/target/it/attach-after-lifecycle-fork/verify.bsh>
[INFO] ..SUCCESS (3.3 s)
[INFO] Building: duplicate-classes-without-reloc/pom.xml
[INFO] ..SUCCESS (3.0 s)
[INFO] Building: filter-artifact-contents/pom.xml
[INFO] run script <https://builds.apache.org/job/maven-plugins-ITs-m3.0.3/ws/maven-shade-plugin/target/it/filter-artifact-contents/verify.bsh>
[INFO] ..SUCCESS (3.8 s)
[INFO] Building: component-descriptor-relocation/pom.xml
[INFO] ..SUCCESS (4.2 s)
[INFO] Building: finalNameShade/pom.xml
[INFO] run script <https://builds.apache.org/job/maven-plugins-ITs-m3.0.3/ws/maven-shade-plugin/target/it/finalNameShade/setup.bsh>
[INFO] run script <https://builds.apache.org/job/maven-plugins-ITs-m3.0.3/ws/maven-shade-plugin/target/it/finalNameShade/verify.bsh>
[INFO] ..SUCCESS (3.6 s)
[INFO] Building: manifest-retained/pom.xml
[INFO] run script <https://builds.apache.org/job/maven-plugins-ITs-m3.0.3/ws/maven-shade-plugin/target/it/manifest-retained/verify.bsh>
[INFO] ..SUCCESS (4.6 s)
[INFO] Building: manifest-transformed/pom.xml
[INFO] run script <https://builds.apache.org/job/maven-plugins-ITs-m3.0.3/ws/maven-shade-plugin/target/it/manifest-transformed/verify.bsh>
[INFO] ..SUCCESS (4.7 s)
[INFO] Building: services-resource-transformer/pom.xml
[INFO] run script <https://builds.apache.org/job/maven-plugins-ITs-m3.0.3/ws/maven-shade-plugin/target/it/services-resource-transformer/verify.bsh>
[INFO] ..SUCCESS (3.7 s)
[INFO] Building: pom-packaging/pom.xml
[INFO] run script <https://builds.apache.org/job/maven-plugins-ITs-m3.0.3/ws/maven-shade-plugin/target/it/pom-packaging/verify.bsh>
[INFO] ..SUCCESS (2.6 s)
[INFO] Building: non-runtime-scope-excluded/pom.xml
[INFO] run script <https://builds.apache.org/job/maven-plugins-ITs-m3.0.3/ws/maven-shade-plugin/target/it/non-runtime-scope-excluded/verify.bsh>
[INFO] ..SUCCESS (3.7 s)
[INFO] Building: reloc-anno/pom.xml
[INFO] ..SUCCESS (3.3 s)
[INFO] Building: mini-jar-respect-includes/pom.xml
[INFO] run script <https://builds.apache.org/job/maven-plugins-ITs-m3.0.3/ws/maven-shade-plugin/target/it/mini-jar-respect-includes/verify.bsh>
[INFO] ..SUCCESS (4.6 s)
[INFO] Building: empty-relocation-pattern/pom.xml
[INFO] ..SUCCESS (3.5 s)
[INFO] Building: finalNameBuild/pom.xml
[INFO] run script <https://builds.apache.org/job/maven-plugins-ITs-m3.0.3/ws/maven-shade-plugin/target/it/finalNameBuild/setup.bsh>
[INFO] run script <https://builds.apache.org/job/maven-plugins-ITs-m3.0.3/ws/maven-shade-plugin/target/it/finalNameBuild/verify.bsh>
[INFO] ..SUCCESS (3.7 s)
[INFO] Building: attached-artifact-type/pom.xml
[INFO] ..SUCCESS (2.9 s)
[INFO] Building: empty-relocation-shaded-pattern/pom.xml
[INFO] ..SUCCESS (3.7 s)
[INFO] Building: reloc-includes-excludes/pom.xml
[INFO] run script <https://builds.apache.org/job/maven-plugins-ITs-m3.0.3/ws/maven-shade-plugin/target/it/reloc-includes-excludes/verify.bsh>
[INFO] ..SUCCESS (4.2 s)
[INFO] Building: rerun-with-reloc/pom.xml
[INFO] ..SUCCESS (5.2 s)
[INFO] Building: implicit-inclusion-of-project-artifact/pom.xml
[INFO] run script <https://builds.apache.org/job/maven-plugins-ITs-m3.0.3/ws/maven-shade-plugin/target/it/implicit-inclusion-of-project-artifact/verify.bsh>
[INFO] ..SUCCESS (3.9 s)
[INFO] Building: duplicate-classes-with-reloc/pom.xml
[INFO] ..SUCCESS (2.9 s)
[INFO] Building: dep-reduced-pom/pom.xml
[INFO] run script <https://builds.apache.org/job/maven-plugins-ITs-m3.0.3/ws/maven-shade-plugin/target/it/dep-reduced-pom/verify.groovy>
[INFO] ..SUCCESS (3.7 s)
[INFO] Building: rerun-without-reloc/pom.xml
[INFO] ..SUCCESS (3.6 s)
[INFO] Building: finalNameBuild-attached/pom.xml
[INFO] run script <https://builds.apache.org/job/maven-plugins-ITs-m3.0.3/ws/maven-shade-plugin/target/it/finalNameBuild-attached/setup.bsh>
[INFO] run script <https://builds.apache.org/job/maven-plugins-ITs-m3.0.3/ws/maven-shade-plugin/target/it/finalNameBuild-attached/verify.bsh>
[INFO] ..SUCCESS (3.6 s)
[INFO] Building: finalNameShade-attached/pom.xml
[INFO] run script <https://builds.apache.org/job/maven-plugins-ITs-m3.0.3/ws/maven-shade-plugin/target/it/finalNameShade-attached/setup.bsh>
[INFO] run script <https://builds.apache.org/job/maven-plugins-ITs-m3.0.3/ws/maven-shade-plugin/target/it/finalNameShade-attached/verify.bsh>
[INFO] ..SUCCESS (3.8 s)
[INFO] Building: shadePomDependency/pom.xml
[INFO] ..SUCCESS (4.3 s)
[INFO] Building: artifact-includes-excludes/pom.xml
[INFO] run script <https://builds.apache.org/job/maven-plugins-ITs-m3.0.3/ws/maven-shade-plugin/target/it/artifact-includes-excludes/verify.bsh>
[INFO] ..SUCCESS (3.7 s)
[INFO] Building: reloc-enum-ref-from-anno/pom.xml
[INFO] ..SUCCESS (3.3 s)
[INFO] Building: mini-jar-package-info/pom.xml
[INFO] run script <https://builds.apache.org/job/maven-plugins-ITs-m3.0.3/ws/maven-shade-plugin/target/it/mini-jar-package-info/verify.bsh>
[INFO] ..SUCCESS (4.4 s)
[INFO] Building: project-with-reactors-included/pom.xml
[INFO] run script <https://builds.apache.org/job/maven-plugins-ITs-m3.0.3/ws/maven-shade-plugin/target/it/project-with-reactors-included/verify.bsh>
[INFO] ..SUCCESS (5.2 s)
[INFO] Building: dep-reduced-pom-with-local-parent/pom.xml
[INFO] ..SUCCESS (2.7 s)
[INFO] Building: mini-jar/pom.xml
[INFO] run script <https://builds.apache.org/job/maven-plugins-ITs-m3.0.3/ws/maven-shade-plugin/target/it/mini-jar/verify.bsh>
[INFO] ..SUCCESS (3.9 s)
[INFO] Building: dep-reduced-pom-unique/pom.xml
[INFO] run script <https://builds.apache.org/job/maven-plugins-ITs-m3.0.3/ws/maven-shade-plugin/target/it/dep-reduced-pom-unique/verify.groovy>
[INFO] ..SUCCESS (3.9 s)
[INFO] Building: mini-jar-malformed-dependencies/pom.xml
[INFO] ..SUCCESS (7.1 s)
[INFO] Building: reloc-abs-resource-path/pom.xml
[INFO] ..SUCCESS (5.6 s)
[INFO] Building: MSHADE-105/pom.xml
[INFO] run script <https://builds.apache.org/job/maven-plugins-ITs-m3.0.3/ws/maven-shade-plugin/target/it/MSHADE-105/verify.bsh>
[INFO] ..SUCCESS (7.1 s)
[INFO] Building: mshade-123/pom.xml
[INFO] ..SUCCESS (5.4 s)
[INFO] Building: reloc-class-from-string-pool/pom.xml
[INFO] ..SUCCESS (3.2 s)
[INFO] Building: users-shader-impl/pom.xml
[INFO] run script <https://builds.apache.org/job/maven-plugins-ITs-m3.0.3/ws/maven-shade-plugin/target/it/users-shader-impl/verify.groovy>
[INFO] ..SUCCESS (4.2 s)
[INFO] Building: empty-apache-notice-transform/pom.xml
[INFO] ..SUCCESS (4.4 s)
[INFO] Building: dep-reduced-pom-relocated-result/pom.xml
[INFO] ..SUCCESS (2.8 s)
[INFO] 
[INFO] --- maven-invoker-plugin:1.6:verify (integration-test) @ maven-shade-plugin ---
[INFO] -------------------------------------------------
[INFO] Build Summary:
[INFO]   Passed: 41, Failed: 0, Errors: 0, Skipped: 0
[INFO] -------------------------------------------------
[INFO] 
[INFO] --- maven-install-plugin:2.3.1:install (default-install) @ maven-shade-plugin ---
[INFO] Installing <https://builds.apache.org/job/maven-plugins-ITs-m3.0.3/ws/maven-shade-plugin/target/maven-shade-plugin-2.0.1-SNAPSHOT.jar> to /home/jenkins/.m2/repository/org/apache/maven/plugins/maven-shade-plugin/2.0.1-SNAPSHOT/maven-shade-plugin-2.0.1-SNAPSHOT.jar
[INFO] Installing <https://builds.apache.org/job/maven-plugins-ITs-m3.0.3/ws/maven-shade-plugin/pom.xml> to /home/jenkins/.m2/repository/org/apache/maven/plugins/maven-shade-plugin/2.0.1-SNAPSHOT/maven-shade-plugin-2.0.1-SNAPSHOT.pom
[INFO] Installing <https://builds.apache.org/job/maven-plugins-ITs-m3.0.3/ws/maven-shade-plugin/target/maven-shade-plugin-2.0.1-SNAPSHOT-tests.jar> to /home/jenkins/.m2/repository/org/apache/maven/plugins/maven-shade-plugin/2.0.1-SNAPSHOT/maven-shade-plugin-2.0.1-SNAPSHOT-tests.jar
[INFO]                                                                         
[INFO] ------------------------------------------------------------------------
[INFO] Building Maven Plugins Aggregator 1-SNAPSHOT
[INFO] ------------------------------------------------------------------------
[INFO] 
[INFO] --- maven-clean-plugin:2.4.1:clean (default-clean) @ maven-plugins-aggregator ---
[INFO] Deleting <https://builds.apache.org/job/maven-plugins-ITs-m3.0.3/ws/target>
[INFO] 
[INFO] --- maven-remote-resources-plugin:1.1:process (default) @ maven-plugins-aggregator ---
[INFO] 
[INFO] --- maven-install-plugin:2.3.1:install (default-install) @ maven-plugins-aggregator ---
[INFO] Installing <https://builds.apache.org/job/maven-plugins-ITs-m3.0.3/ws/pom.xml> to /home/jenkins/.m2/repository/org/apache/maven/plugins/maven-plugins-aggregator/1-SNAPSHOT/maven-plugins-aggregator-1-SNAPSHOT.pom
[INFO] ------------------------------------------------------------------------
[INFO] Reactor Summary:
[INFO] 
[INFO] Maven Plugins ..................................... SUCCESS [7.488s]
[INFO] Maven ACR Plugin .................................. SUCCESS [21.525s]
[INFO] Maven Ant Plugin .................................. SUCCESS [1:07.627s]
[INFO] Maven AntRun Plugin ............................... SUCCESS [53.388s]
[INFO] Maven Eclipse Plugin .............................. SUCCESS [6:08.971s]
[INFO] Maven Assembly Plugin ............................. SUCCESS [10:46.542s]
[INFO] Maven Changelog Plugin ............................ SUCCESS [1:04.234s]
[INFO] Maven Changes Report Plugin ....................... SUCCESS [1:20.823s]
[INFO] Maven Checkstyle Plugin ........................... SUCCESS [1:46.808s]
[INFO] Maven Clean Plugin ................................ SUCCESS [22.393s]
[INFO] Maven Compiler Plugin ............................. SUCCESS [1:05.946s]
[INFO] Maven Dependency Plugin ........................... FAILURE [0.482s]
[INFO] Maven Deploy Plugin ............................... SUCCESS [1:01.610s]
[INFO] Maven DOAP Plugin ................................. SUCCESS [18.081s]
[INFO] Maven Documentation Checker Plugin ................ SUCCESS [6.238s]
[INFO] Maven EAR Plugin .................................. SUCCESS [3:54.383s]
[INFO] Maven EJB Plugin .................................. SUCCESS [28.610s]
[INFO] Maven GPG Plugin .................................. SUCCESS [9.898s]
[INFO] Maven Help Plugin ................................. SUCCESS [35.341s]
[INFO] Maven IDEA Plugin ................................. SUCCESS [7.827s]
[INFO] Maven Install Plugin .............................. SUCCESS [41.101s]
[INFO] Maven JAR Plugin .................................. SUCCESS [1:16.831s]
[INFO] Maven Jarsigner Plugin ............................ SUCCESS [23.863s]
[INFO] Maven Javadoc Plugin .............................. SUCCESS [2:55.296s]
[INFO] Maven Linkcheck Plugin ............................ SUCCESS [3.366s]
[INFO] Maven One Plugin .................................. SUCCESS [2.006s]
[INFO] Maven Patch Plugin ................................ SUCCESS [13.861s]
[INFO] Maven PDF Plugin .................................. SUCCESS [34.354s]
[INFO] Maven PMD Plugin .................................. SUCCESS [42.345s]
[INFO] Maven RAR Plugin .................................. SUCCESS [11.164s]
[INFO] Maven Reactor Plugin .............................. SUCCESS [3.020s]
[INFO] Maven Repository Plugin ........................... SUCCESS [41.653s]
[INFO] Maven Resources Plugin ............................ SUCCESS [56.212s]
[INFO] Maven Site Plugin 3 ............................... SUCCESS [6:36.584s]
[INFO] Maven Source Plugin ............................... SUCCESS [47.531s]
[INFO] Maven Stage Plugin ................................ SUCCESS [2.500s]
[INFO] Maven Toolchains Plugin ........................... SUCCESS [2.086s]
[INFO] Maven Verifier Plugin ............................. SUCCESS [15.608s]
[INFO] Maven WAR Plugin .................................. SUCCESS [1:18.892s]
[INFO] SCM Publish Maven Plugin .......................... SUCCESS [51.354s]
[INFO] Maven Invoker Plugin .............................. SUCCESS [4:21.069s]
[INFO] Maven Project Info Reports Plugin ................. SUCCESS [2:34.667s]
[INFO] Maven Remote Resources Plugin ..................... SUCCESS [55.689s]
[INFO] Maven Shade Plugin ................................ SUCCESS [3:13.236s]
[INFO] Maven Plugins Aggregator .......................... SUCCESS [0.072s]
[INFO] ------------------------------------------------------------------------
[INFO] BUILD FAILURE
[INFO] ------------------------------------------------------------------------
[INFO] Total time: 1:01:34.262s
[INFO] Finished at: Thu Nov 22 23:10:00 UTC 2012
[INFO] Final Memory: 85M/305M
[INFO] ------------------------------------------------------------------------
[WARNING] The requested profile "apache.snapshots" could not be activated because it does not exist.
[ERROR] Failed to execute goal on project maven-dependency-plugin: Could not resolve dependencies for project org.apache.maven.plugins:maven-dependency-plugin:maven-plugin:2.7-SNAPSHOT: Could not find artifact org.apache.maven.shared:maven-dependency-analyzer:jar:1.3 in central (http://repo1.maven.org/maven2) -> [Help 1]
[ERROR] 
[ERROR] To see the full stack trace of the errors, re-run Maven with the -e switch.
[ERROR] Re-run Maven using the -X switch to enable full debug logging.
[ERROR] 
[ERROR] For more information about the errors and possible solutions, please read the following articles:
[ERROR] [Help 1] http://cwiki.apache.org/confluence/display/MAVEN/DependencyResolutionException
[ERROR] 
[ERROR] After correcting the problems, you can resume the build with the command
[ERROR]   mvn <goals> -rf :maven-dependency-plugin
Build step 'Invoke top-level Maven targets' marked build as failure
Recording test results

Build failed in Jenkins: maven-plugins-ITs-m3.0.3 #66

Posted by Apache Jenkins Server <je...@builds.apache.org>.
See <https://builds.apache.org/job/maven-plugins-ITs-m3.0.3/66/changes>

Changes:

[Robert Scholte] compiler source+target already inherited

[Robert Scholte] Fix load of known null value

[Robert Scholte] checkstyle fixes

[Robert Scholte] Fix @since doclettag

------------------------------------------
[...truncated 9910 lines...]
 T E S T S
-------------------------------------------------------
Running org.apache.maven.plugins.shade.mojo.ArtifactSelectorTest
Tests run: 1, Failures: 0, Errors: 0, Skipped: 0, Time elapsed: 0.029 sec
Running org.apache.maven.plugins.shade.mojo.ArtifactIdTest
Tests run: 2, Failures: 0, Errors: 0, Skipped: 0, Time elapsed: 0.003 sec
Running org.apache.maven.plugins.shade.mojo.ShadeMojoTest
Tests run: 4, Failures: 0, Errors: 0, Skipped: 0, Time elapsed: 2.321 sec
Running org.apache.maven.plugins.shade.mojo.RelativizePathTest
Tests run: 1, Failures: 0, Errors: 0, Skipped: 0, Time elapsed: 0.018 sec
Running org.apache.maven.plugins.shade.filter.SimpleFilterTest
Tests run: 1, Failures: 0, Errors: 0, Skipped: 0, Time elapsed: 0 sec
Running org.apache.maven.plugins.shade.DefaultShaderTest
Tests run: 4, Failures: 0, Errors: 0, Skipped: 0, Time elapsed: 0.856 sec
Running org.apache.maven.plugins.shade.relocation.SimpleRelocatorTest
Tests run: 7, Failures: 0, Errors: 0, Skipped: 0, Time elapsed: 0.003 sec
Running org.apache.maven.plugins.shade.relocation.SimpleRelocatorParameterTest
Tests run: 2, Failures: 0, Errors: 0, Skipped: 0, Time elapsed: 0.001 sec
Running org.apache.maven.plugins.shade.resource.XmlAppendingTransformerTest
Tests run: 1, Failures: 0, Errors: 0, Skipped: 0, Time elapsed: 0.006 sec
Running org.apache.maven.plugins.shade.resource.ApacheNoticeResourceTransformerTest
Tests run: 1, Failures: 0, Errors: 0, Skipped: 0, Time elapsed: 0.001 sec
Running org.apache.maven.plugins.shade.resource.ComponentsXmlResourceTransformerTest
Tests run: 1, Failures: 0, Errors: 0, Skipped: 0, Time elapsed: 0.056 sec
Running org.apache.maven.plugins.shade.resource.ApacheLicenseResourceTransformerTest
Tests run: 1, Failures: 0, Errors: 0, Skipped: 0, Time elapsed: 0 sec
Running org.apache.maven.plugins.shade.resource.AppendingTransformerTest
Tests run: 1, Failures: 0, Errors: 0, Skipped: 0, Time elapsed: 0 sec

Results :

Tests run: 27, Failures: 0, Errors: 0, Skipped: 0

[INFO] 
[INFO] --- maven-jar-plugin:2.4:jar (default-jar) @ maven-shade-plugin ---
[INFO] Building jar: <https://builds.apache.org/job/maven-plugins-ITs-m3.0.3/ws/maven-shade-plugin/target/maven-shade-plugin-2.0.1-SNAPSHOT.jar>
[INFO] 
[INFO] --- maven-plugin-plugin:3.2:addPluginArtifactMetadata (default-addPluginArtifactMetadata) @ maven-shade-plugin ---
[INFO] 
[INFO] --- maven-jar-plugin:2.4:test-jar (default) @ maven-shade-plugin ---
[INFO] Building jar: <https://builds.apache.org/job/maven-plugins-ITs-m3.0.3/ws/maven-shade-plugin/target/maven-shade-plugin-2.0.1-SNAPSHOT-tests.jar>
[INFO] 
[INFO] --- maven-invoker-plugin:1.6:install (integration-test) @ maven-shade-plugin ---
[INFO] Installing <https://builds.apache.org/job/maven-plugins-ITs-m3.0.3/ws/maven-shade-plugin/pom.xml> to <https://builds.apache.org/job/maven-plugins-ITs-m3.0.3/ws/maven-shade-plugin/target/local-repo/org/apache/maven/plugins/maven-shade-plugin/2.0.1-SNAPSHOT/maven-shade-plugin-2.0.1-SNAPSHOT.pom>
[INFO] Installing <https://builds.apache.org/job/maven-plugins-ITs-m3.0.3/ws/maven-shade-plugin/target/maven-shade-plugin-2.0.1-SNAPSHOT.jar> to <https://builds.apache.org/job/maven-plugins-ITs-m3.0.3/ws/maven-shade-plugin/target/local-repo/org/apache/maven/plugins/maven-shade-plugin/2.0.1-SNAPSHOT/maven-shade-plugin-2.0.1-SNAPSHOT.jar>
[INFO] Installing <https://builds.apache.org/job/maven-plugins-ITs-m3.0.3/ws/maven-shade-plugin/target/maven-shade-plugin-2.0.1-SNAPSHOT-tests.jar> to <https://builds.apache.org/job/maven-plugins-ITs-m3.0.3/ws/maven-shade-plugin/target/local-repo/org/apache/maven/plugins/maven-shade-plugin/2.0.1-SNAPSHOT/maven-shade-plugin-2.0.1-SNAPSHOT-tests.jar>
[INFO] 
[INFO] --- maven-invoker-plugin:1.6:integration-test (integration-test) @ maven-shade-plugin ---
[INFO] Building: duplicate-classes-without-reloc/pom.xml
[INFO] ..SUCCESS (3.2 s)
[INFO] Building: filter-artifact-contents/pom.xml
[INFO] run script <https://builds.apache.org/job/maven-plugins-ITs-m3.0.3/ws/maven-shade-plugin/target/it/filter-artifact-contents/verify.bsh>
[INFO] ..SUCCESS (8.2 s)
[INFO] Building: project-with-reactors-included/pom.xml
[INFO] run script <https://builds.apache.org/job/maven-plugins-ITs-m3.0.3/ws/maven-shade-plugin/target/it/project-with-reactors-included/verify.bsh>
[INFO] ..SUCCESS (5.1 s)
[INFO] Building: reloc-includes-excludes/pom.xml
[INFO] run script <https://builds.apache.org/job/maven-plugins-ITs-m3.0.3/ws/maven-shade-plugin/target/it/reloc-includes-excludes/verify.bsh>
[INFO] ..SUCCESS (4.3 s)
[INFO] Building: mini-jar-respect-includes/pom.xml
[INFO] run script <https://builds.apache.org/job/maven-plugins-ITs-m3.0.3/ws/maven-shade-plugin/target/it/mini-jar-respect-includes/verify.bsh>
[INFO] ..SUCCESS (4.5 s)
[INFO] Building: attached-artifact-type/pom.xml
[INFO] ..SUCCESS (2.9 s)
[INFO] Building: services-resource-transformer/pom.xml
[INFO] run script <https://builds.apache.org/job/maven-plugins-ITs-m3.0.3/ws/maven-shade-plugin/target/it/services-resource-transformer/verify.bsh>
[INFO] ..SUCCESS (3.8 s)
[INFO] Building: reloc-enum-ref-from-anno/pom.xml
[INFO] ..SUCCESS (3.4 s)
[INFO] Building: finalNameBuild/pom.xml
[INFO] run script <https://builds.apache.org/job/maven-plugins-ITs-m3.0.3/ws/maven-shade-plugin/target/it/finalNameBuild/setup.bsh>
[INFO] run script <https://builds.apache.org/job/maven-plugins-ITs-m3.0.3/ws/maven-shade-plugin/target/it/finalNameBuild/verify.bsh>
[INFO] ..SUCCESS (3.6 s)
[INFO] Building: reloc-anno/pom.xml
[INFO] ..SUCCESS (3.3 s)
[INFO] Building: shadePomDependency/pom.xml
[INFO] ..SUCCESS (4.8 s)
[INFO] Building: users-shader-impl/pom.xml
[INFO] run script <https://builds.apache.org/job/maven-plugins-ITs-m3.0.3/ws/maven-shade-plugin/target/it/users-shader-impl/verify.groovy>
[INFO] ..SUCCESS (4.3 s)
[INFO] Building: duplicate-classes-with-reloc/pom.xml
[INFO] ..SUCCESS (2.9 s)
[INFO] Building: dep-reduced-pom/pom.xml
[INFO] run script <https://builds.apache.org/job/maven-plugins-ITs-m3.0.3/ws/maven-shade-plugin/target/it/dep-reduced-pom/verify.groovy>
[INFO] ..SUCCESS (3.6 s)
[INFO] Building: reloc-abs-resource-path/pom.xml
[INFO] ..SUCCESS (5.6 s)
[INFO] Building: component-descriptor-relocation/pom.xml
[INFO] ..SUCCESS (4.3 s)
[INFO] Building: empty-relocation-shaded-pattern/pom.xml
[INFO] ..SUCCESS (3.5 s)
[INFO] Building: non-runtime-scope-excluded/pom.xml
[INFO] run script <https://builds.apache.org/job/maven-plugins-ITs-m3.0.3/ws/maven-shade-plugin/target/it/non-runtime-scope-excluded/verify.bsh>
[INFO] ..SUCCESS (3.8 s)
[INFO] Building: mini-jar/pom.xml
[INFO] run script <https://builds.apache.org/job/maven-plugins-ITs-m3.0.3/ws/maven-shade-plugin/target/it/mini-jar/verify.bsh>
[INFO] ..SUCCESS (4.0 s)
[INFO] Building: finalNameShade/pom.xml
[INFO] run script <https://builds.apache.org/job/maven-plugins-ITs-m3.0.3/ws/maven-shade-plugin/target/it/finalNameShade/setup.bsh>
[INFO] run script <https://builds.apache.org/job/maven-plugins-ITs-m3.0.3/ws/maven-shade-plugin/target/it/finalNameShade/verify.bsh>
[INFO] ..SUCCESS (3.6 s)
[INFO] Building: artifact-includes-excludes/pom.xml
[INFO] run script <https://builds.apache.org/job/maven-plugins-ITs-m3.0.3/ws/maven-shade-plugin/target/it/artifact-includes-excludes/verify.bsh>
[INFO] ..SUCCESS (3.8 s)
[INFO] Building: xml-transformer-ignores-dtd/pom.xml
[INFO] run script <https://builds.apache.org/job/maven-plugins-ITs-m3.0.3/ws/maven-shade-plugin/target/it/xml-transformer-ignores-dtd/verify.bsh>
[INFO] ..SUCCESS (3.8 s)
[INFO] Building: reloc-class-from-string-pool/pom.xml
[INFO] ..SUCCESS (3.3 s)
[INFO] Building: dep-reduced-pom-with-local-parent/pom.xml
[INFO] ..SUCCESS (2.7 s)
[INFO] Building: mini-jar-package-info/pom.xml
[INFO] run script <https://builds.apache.org/job/maven-plugins-ITs-m3.0.3/ws/maven-shade-plugin/target/it/mini-jar-package-info/verify.bsh>
[INFO] ..SUCCESS (4.2 s)
[INFO] Building: attach-after-lifecycle-fork/pom.xml
[INFO] run script <https://builds.apache.org/job/maven-plugins-ITs-m3.0.3/ws/maven-shade-plugin/target/it/attach-after-lifecycle-fork/setup.bsh>
[INFO] run script <https://builds.apache.org/job/maven-plugins-ITs-m3.0.3/ws/maven-shade-plugin/target/it/attach-after-lifecycle-fork/verify.bsh>
[INFO] ..SUCCESS (3.1 s)
[INFO] Building: manifest-transformed/pom.xml
[INFO] run script <https://builds.apache.org/job/maven-plugins-ITs-m3.0.3/ws/maven-shade-plugin/target/it/manifest-transformed/verify.bsh>
[INFO] ..SUCCESS (4.9 s)
[INFO] Building: dep-reduced-pom-unique/pom.xml
[INFO] run script <https://builds.apache.org/job/maven-plugins-ITs-m3.0.3/ws/maven-shade-plugin/target/it/dep-reduced-pom-unique/verify.groovy>
[INFO] ..SUCCESS (3.7 s)
[INFO] Building: pom-packaging/pom.xml
[INFO] run script <https://builds.apache.org/job/maven-plugins-ITs-m3.0.3/ws/maven-shade-plugin/target/it/pom-packaging/verify.bsh>
[INFO] ..SUCCESS (2.4 s)
[INFO] Building: MSHADE-105/pom.xml
[INFO] run script <https://builds.apache.org/job/maven-plugins-ITs-m3.0.3/ws/maven-shade-plugin/target/it/MSHADE-105/verify.bsh>
[INFO] ..SUCCESS (7.4 s)
[INFO] Building: rerun-with-reloc/pom.xml
[INFO] ..SUCCESS (4.8 s)
[INFO] Building: rerun-without-reloc/pom.xml
[INFO] ..SUCCESS (3.5 s)
[INFO] Building: implicit-inclusion-of-project-artifact/pom.xml
[INFO] run script <https://builds.apache.org/job/maven-plugins-ITs-m3.0.3/ws/maven-shade-plugin/target/it/implicit-inclusion-of-project-artifact/verify.bsh>
[INFO] ..SUCCESS (3.8 s)
[INFO] Building: mini-jar-malformed-dependencies/pom.xml
[INFO] ..SUCCESS (7.5 s)
[INFO] Building: empty-apache-notice-transform/pom.xml
[INFO] ..SUCCESS (4.3 s)
[INFO] Building: finalNameShade-attached/pom.xml
[INFO] run script <https://builds.apache.org/job/maven-plugins-ITs-m3.0.3/ws/maven-shade-plugin/target/it/finalNameShade-attached/setup.bsh>
[INFO] run script <https://builds.apache.org/job/maven-plugins-ITs-m3.0.3/ws/maven-shade-plugin/target/it/finalNameShade-attached/verify.bsh>
[INFO] ..SUCCESS (3.6 s)
[INFO] Building: mshade-123/pom.xml
[INFO] ..SUCCESS (5.5 s)
[INFO] Building: dep-reduced-pom-relocated-result/pom.xml
[INFO] ..SUCCESS (2.7 s)
[INFO] Building: empty-relocation-pattern/pom.xml
[INFO] ..SUCCESS (3.5 s)
[INFO] Building: finalNameBuild-attached/pom.xml
[INFO] run script <https://builds.apache.org/job/maven-plugins-ITs-m3.0.3/ws/maven-shade-plugin/target/it/finalNameBuild-attached/setup.bsh>
[INFO] run script <https://builds.apache.org/job/maven-plugins-ITs-m3.0.3/ws/maven-shade-plugin/target/it/finalNameBuild-attached/verify.bsh>
[INFO] ..SUCCESS (3.7 s)
[INFO] Building: manifest-retained/pom.xml
[INFO] run script <https://builds.apache.org/job/maven-plugins-ITs-m3.0.3/ws/maven-shade-plugin/target/it/manifest-retained/verify.bsh>
[INFO] ..SUCCESS (5.0 s)
[INFO] 
[INFO] --- maven-invoker-plugin:1.6:verify (integration-test) @ maven-shade-plugin ---
[INFO] -------------------------------------------------
[INFO] Build Summary:
[INFO]   Passed: 41, Failed: 0, Errors: 0, Skipped: 0
[INFO] -------------------------------------------------
[INFO] 
[INFO] --- maven-install-plugin:2.3.1:install (default-install) @ maven-shade-plugin ---
[INFO] Installing <https://builds.apache.org/job/maven-plugins-ITs-m3.0.3/ws/maven-shade-plugin/target/maven-shade-plugin-2.0.1-SNAPSHOT.jar> to /home/hudson/.m2/repository/org/apache/maven/plugins/maven-shade-plugin/2.0.1-SNAPSHOT/maven-shade-plugin-2.0.1-SNAPSHOT.jar
[INFO] Installing <https://builds.apache.org/job/maven-plugins-ITs-m3.0.3/ws/maven-shade-plugin/pom.xml> to /home/hudson/.m2/repository/org/apache/maven/plugins/maven-shade-plugin/2.0.1-SNAPSHOT/maven-shade-plugin-2.0.1-SNAPSHOT.pom
[INFO] Installing <https://builds.apache.org/job/maven-plugins-ITs-m3.0.3/ws/maven-shade-plugin/target/maven-shade-plugin-2.0.1-SNAPSHOT-tests.jar> to /home/hudson/.m2/repository/org/apache/maven/plugins/maven-shade-plugin/2.0.1-SNAPSHOT/maven-shade-plugin-2.0.1-SNAPSHOT-tests.jar
[INFO]                                                                         
[INFO] ------------------------------------------------------------------------
[INFO] Building Maven Plugins Aggregator 1-SNAPSHOT
[INFO] ------------------------------------------------------------------------
[INFO] 
[INFO] --- maven-clean-plugin:2.4.1:clean (default-clean) @ maven-plugins-aggregator ---
[INFO] Deleting <https://builds.apache.org/job/maven-plugins-ITs-m3.0.3/ws/target>
[INFO] 
[INFO] --- maven-remote-resources-plugin:1.1:process (default) @ maven-plugins-aggregator ---
[INFO] 
[INFO] --- maven-install-plugin:2.3.1:install (default-install) @ maven-plugins-aggregator ---
[INFO] Installing <https://builds.apache.org/job/maven-plugins-ITs-m3.0.3/ws/pom.xml> to /home/hudson/.m2/repository/org/apache/maven/plugins/maven-plugins-aggregator/1-SNAPSHOT/maven-plugins-aggregator-1-SNAPSHOT.pom
[INFO] ------------------------------------------------------------------------
[INFO] Reactor Summary:
[INFO] 
[INFO] Maven Plugins ..................................... SUCCESS [6.488s]
[INFO] Maven ACR Plugin .................................. SUCCESS [27.561s]
[INFO] Maven Ant Plugin .................................. SUCCESS [1:05.964s]
[INFO] Maven AntRun Plugin ............................... SUCCESS [54.233s]
[INFO] Maven Eclipse Plugin .............................. SUCCESS [6:35.467s]
[INFO] Maven Assembly Plugin ............................. SUCCESS [11:30.887s]
[INFO] Maven Changelog Plugin ............................ SUCCESS [52.059s]
[INFO] Maven Changes Report Plugin ....................... SUCCESS [1:06.420s]
[INFO] Maven Checkstyle Plugin ........................... SUCCESS [1:41.111s]
[INFO] Maven Clean Plugin ................................ SUCCESS [19.770s]
[INFO] Maven Compiler Plugin ............................. SUCCESS [1:10.801s]
[INFO] Maven Dependency Plugin ........................... FAILURE [0.312s]
[INFO] Maven Deploy Plugin ............................... SUCCESS [58.485s]
[INFO] Maven DOAP Plugin ................................. SUCCESS [17.298s]
[INFO] Maven Documentation Checker Plugin ................ SUCCESS [6.479s]
[INFO] Maven EAR Plugin .................................. SUCCESS [3:54.501s]
[INFO] Maven EJB Plugin .................................. SUCCESS [28.183s]
[INFO] Maven GPG Plugin .................................. SUCCESS [10.990s]
[INFO] Maven Help Plugin ................................. SUCCESS [35.072s]
[INFO] Maven IDEA Plugin ................................. SUCCESS [7.963s]
[INFO] Maven Install Plugin .............................. SUCCESS [41.497s]
[INFO] Maven JAR Plugin .................................. SUCCESS [1:07.462s]
[INFO] Maven Jarsigner Plugin ............................ SUCCESS [24.341s]
[INFO] Maven Javadoc Plugin .............................. SUCCESS [2:54.498s]
[INFO] Maven Linkcheck Plugin ............................ SUCCESS [2.803s]
[INFO] Maven One Plugin .................................. SUCCESS [3.231s]
[INFO] Maven Patch Plugin ................................ SUCCESS [12.834s]
[INFO] Maven PDF Plugin .................................. SUCCESS [36.138s]
[INFO] Maven PMD Plugin .................................. SUCCESS [44.358s]
[INFO] Maven RAR Plugin .................................. SUCCESS [10.862s]
[INFO] Maven Reactor Plugin .............................. SUCCESS [2.785s]
[INFO] Maven Repository Plugin ........................... SUCCESS [40.978s]
[INFO] Maven Resources Plugin ............................ SUCCESS [56.299s]
[INFO] Maven Site Plugin 3 ............................... SUCCESS [6:57.872s]
[INFO] Maven Source Plugin ............................... SUCCESS [45.544s]
[INFO] Maven Stage Plugin ................................ SUCCESS [3.825s]
[INFO] Maven Toolchains Plugin ........................... SUCCESS [3.399s]
[INFO] Maven Verifier Plugin ............................. SUCCESS [15.868s]
[INFO] Maven WAR Plugin .................................. SUCCESS [1:25.230s]
[INFO] SCM Publish Maven Plugin .......................... SUCCESS [1:17.742s]
[INFO] Maven Invoker Plugin .............................. SUCCESS [4:18.400s]
[INFO] Maven Project Info Reports Plugin ................. SUCCESS [2:21.609s]
[INFO] Maven Remote Resources Plugin ..................... SUCCESS [51.893s]
[INFO] Maven Shade Plugin ................................ SUCCESS [3:15.543s]
[INFO] Maven Plugins Aggregator .......................... SUCCESS [0.126s]
[INFO] ------------------------------------------------------------------------
[INFO] BUILD FAILURE
[INFO] ------------------------------------------------------------------------
[INFO] Total time: 1:02:46.532s
[INFO] Finished at: Thu Nov 22 21:29:10 UTC 2012
[INFO] Final Memory: 85M/308M
[INFO] ------------------------------------------------------------------------
[WARNING] The requested profile "apache.snapshots" could not be activated because it does not exist.
[ERROR] Failed to execute goal on project maven-dependency-plugin: Could not resolve dependencies for project org.apache.maven.plugins:maven-dependency-plugin:maven-plugin:2.7-SNAPSHOT: Could not find artifact org.apache.maven.shared:maven-dependency-analyzer:jar:1.3 in central (http://repo1.maven.org/maven2) -> [Help 1]
[ERROR] 
[ERROR] To see the full stack trace of the errors, re-run Maven with the -e switch.
[ERROR] Re-run Maven using the -X switch to enable full debug logging.
[ERROR] 
[ERROR] For more information about the errors and possible solutions, please read the following articles:
[ERROR] [Help 1] http://cwiki.apache.org/confluence/display/MAVEN/DependencyResolutionException
[ERROR] 
[ERROR] After correcting the problems, you can resume the build with the command
[ERROR]   mvn <goals> -rf :maven-dependency-plugin
Build step 'Invoke top-level Maven targets' marked build as failure
Recording test results

Build failed in Jenkins: maven-plugins-ITs-m3.0.3 #65

Posted by Apache Jenkins Server <je...@builds.apache.org>.
See <https://builds.apache.org/job/maven-plugins-ITs-m3.0.3/65/changes>

Changes:

[aheritier] Add more docs about properties that may be used in outputFileNameMapping

------------------------------------------
[...truncated 9805 lines...]
 T E S T S
-------------------------------------------------------
Running org.apache.maven.plugins.shade.mojo.ArtifactSelectorTest
Tests run: 1, Failures: 0, Errors: 0, Skipped: 0, Time elapsed: 0.029 sec
Running org.apache.maven.plugins.shade.mojo.ShadeMojoTest
Tests run: 4, Failures: 0, Errors: 0, Skipped: 0, Time elapsed: 2.413 sec
Running org.apache.maven.plugins.shade.mojo.RelativizePathTest
Tests run: 1, Failures: 0, Errors: 0, Skipped: 0, Time elapsed: 0.022 sec
Running org.apache.maven.plugins.shade.mojo.ArtifactIdTest
Tests run: 2, Failures: 0, Errors: 0, Skipped: 0, Time elapsed: 0.002 sec
Running org.apache.maven.plugins.shade.DefaultShaderTest
Tests run: 4, Failures: 0, Errors: 0, Skipped: 0, Time elapsed: 0.808 sec
Running org.apache.maven.plugins.shade.resource.AppendingTransformerTest
Tests run: 1, Failures: 0, Errors: 0, Skipped: 0, Time elapsed: 0 sec
Running org.apache.maven.plugins.shade.resource.ApacheNoticeResourceTransformerTest
Tests run: 1, Failures: 0, Errors: 0, Skipped: 0, Time elapsed: 0.001 sec
Running org.apache.maven.plugins.shade.resource.XmlAppendingTransformerTest
Tests run: 1, Failures: 0, Errors: 0, Skipped: 0, Time elapsed: 0.005 sec
Running org.apache.maven.plugins.shade.resource.ApacheLicenseResourceTransformerTest
Tests run: 1, Failures: 0, Errors: 0, Skipped: 0, Time elapsed: 0.001 sec
Running org.apache.maven.plugins.shade.resource.ComponentsXmlResourceTransformerTest
Tests run: 1, Failures: 0, Errors: 0, Skipped: 0, Time elapsed: 0.06 sec
Running org.apache.maven.plugins.shade.filter.SimpleFilterTest
Tests run: 1, Failures: 0, Errors: 0, Skipped: 0, Time elapsed: 0 sec
Running org.apache.maven.plugins.shade.relocation.SimpleRelocatorParameterTest
Tests run: 2, Failures: 0, Errors: 0, Skipped: 0, Time elapsed: 0 sec
Running org.apache.maven.plugins.shade.relocation.SimpleRelocatorTest
Tests run: 7, Failures: 0, Errors: 0, Skipped: 0, Time elapsed: 0.003 sec

Results :

Tests run: 27, Failures: 0, Errors: 0, Skipped: 0

[INFO] 
[INFO] --- maven-jar-plugin:2.4:jar (default-jar) @ maven-shade-plugin ---
[INFO] Building jar: <https://builds.apache.org/job/maven-plugins-ITs-m3.0.3/ws/maven-shade-plugin/target/maven-shade-plugin-2.0.1-SNAPSHOT.jar>
[INFO] 
[INFO] --- maven-plugin-plugin:3.2:addPluginArtifactMetadata (default-addPluginArtifactMetadata) @ maven-shade-plugin ---
[INFO] 
[INFO] --- maven-jar-plugin:2.4:test-jar (default) @ maven-shade-plugin ---
[INFO] Building jar: <https://builds.apache.org/job/maven-plugins-ITs-m3.0.3/ws/maven-shade-plugin/target/maven-shade-plugin-2.0.1-SNAPSHOT-tests.jar>
[INFO] 
[INFO] --- maven-invoker-plugin:1.6:install (integration-test) @ maven-shade-plugin ---
[INFO] Installing <https://builds.apache.org/job/maven-plugins-ITs-m3.0.3/ws/maven-shade-plugin/pom.xml> to <https://builds.apache.org/job/maven-plugins-ITs-m3.0.3/ws/maven-shade-plugin/target/local-repo/org/apache/maven/plugins/maven-shade-plugin/2.0.1-SNAPSHOT/maven-shade-plugin-2.0.1-SNAPSHOT.pom>
[INFO] Installing <https://builds.apache.org/job/maven-plugins-ITs-m3.0.3/ws/maven-shade-plugin/target/maven-shade-plugin-2.0.1-SNAPSHOT.jar> to <https://builds.apache.org/job/maven-plugins-ITs-m3.0.3/ws/maven-shade-plugin/target/local-repo/org/apache/maven/plugins/maven-shade-plugin/2.0.1-SNAPSHOT/maven-shade-plugin-2.0.1-SNAPSHOT.jar>
[INFO] Installing <https://builds.apache.org/job/maven-plugins-ITs-m3.0.3/ws/maven-shade-plugin/target/maven-shade-plugin-2.0.1-SNAPSHOT-tests.jar> to <https://builds.apache.org/job/maven-plugins-ITs-m3.0.3/ws/maven-shade-plugin/target/local-repo/org/apache/maven/plugins/maven-shade-plugin/2.0.1-SNAPSHOT/maven-shade-plugin-2.0.1-SNAPSHOT-tests.jar>
[INFO] 
[INFO] --- maven-invoker-plugin:1.6:integration-test (integration-test) @ maven-shade-plugin ---
[INFO] Building: xml-transformer-ignores-dtd/pom.xml
[INFO] run script <https://builds.apache.org/job/maven-plugins-ITs-m3.0.3/ws/maven-shade-plugin/target/it/xml-transformer-ignores-dtd/verify.bsh>
[INFO] ..SUCCESS (4.0 s)
[INFO] Building: attach-after-lifecycle-fork/pom.xml
[INFO] run script <https://builds.apache.org/job/maven-plugins-ITs-m3.0.3/ws/maven-shade-plugin/target/it/attach-after-lifecycle-fork/setup.bsh>
[INFO] run script <https://builds.apache.org/job/maven-plugins-ITs-m3.0.3/ws/maven-shade-plugin/target/it/attach-after-lifecycle-fork/verify.bsh>
[INFO] ..SUCCESS (3.6 s)
[INFO] Building: duplicate-classes-without-reloc/pom.xml
[INFO] ..SUCCESS (3.0 s)
[INFO] Building: filter-artifact-contents/pom.xml
[INFO] run script <https://builds.apache.org/job/maven-plugins-ITs-m3.0.3/ws/maven-shade-plugin/target/it/filter-artifact-contents/verify.bsh>
[INFO] ..SUCCESS (3.9 s)
[INFO] Building: component-descriptor-relocation/pom.xml
[INFO] ..SUCCESS (4.6 s)
[INFO] Building: finalNameShade/pom.xml
[INFO] run script <https://builds.apache.org/job/maven-plugins-ITs-m3.0.3/ws/maven-shade-plugin/target/it/finalNameShade/setup.bsh>
[INFO] run script <https://builds.apache.org/job/maven-plugins-ITs-m3.0.3/ws/maven-shade-plugin/target/it/finalNameShade/verify.bsh>
[INFO] ..SUCCESS (3.8 s)
[INFO] Building: manifest-retained/pom.xml
[INFO] run script <https://builds.apache.org/job/maven-plugins-ITs-m3.0.3/ws/maven-shade-plugin/target/it/manifest-retained/verify.bsh>
[INFO] ..SUCCESS (4.8 s)
[INFO] Building: manifest-transformed/pom.xml
[INFO] run script <https://builds.apache.org/job/maven-plugins-ITs-m3.0.3/ws/maven-shade-plugin/target/it/manifest-transformed/verify.bsh>
[INFO] ..SUCCESS (4.6 s)
[INFO] Building: services-resource-transformer/pom.xml
[INFO] run script <https://builds.apache.org/job/maven-plugins-ITs-m3.0.3/ws/maven-shade-plugin/target/it/services-resource-transformer/verify.bsh>
[INFO] ..SUCCESS (3.7 s)
[INFO] Building: pom-packaging/pom.xml
[INFO] run script <https://builds.apache.org/job/maven-plugins-ITs-m3.0.3/ws/maven-shade-plugin/target/it/pom-packaging/verify.bsh>
[INFO] ..SUCCESS (2.6 s)
[INFO] Building: non-runtime-scope-excluded/pom.xml
[INFO] run script <https://builds.apache.org/job/maven-plugins-ITs-m3.0.3/ws/maven-shade-plugin/target/it/non-runtime-scope-excluded/verify.bsh>
[INFO] ..SUCCESS (4.4 s)
[INFO] Building: reloc-anno/pom.xml
[INFO] ..SUCCESS (3.5 s)
[INFO] Building: mini-jar-respect-includes/pom.xml
[INFO] run script <https://builds.apache.org/job/maven-plugins-ITs-m3.0.3/ws/maven-shade-plugin/target/it/mini-jar-respect-includes/verify.bsh>
[INFO] ..SUCCESS (4.4 s)
[INFO] Building: empty-relocation-pattern/pom.xml
[INFO] ..SUCCESS (3.9 s)
[INFO] Building: finalNameBuild/pom.xml
[INFO] run script <https://builds.apache.org/job/maven-plugins-ITs-m3.0.3/ws/maven-shade-plugin/target/it/finalNameBuild/setup.bsh>
[INFO] run script <https://builds.apache.org/job/maven-plugins-ITs-m3.0.3/ws/maven-shade-plugin/target/it/finalNameBuild/verify.bsh>
[INFO] ..SUCCESS (3.7 s)
[INFO] Building: attached-artifact-type/pom.xml
[INFO] ..SUCCESS (3.0 s)
[INFO] Building: empty-relocation-shaded-pattern/pom.xml
[INFO] ..SUCCESS (3.5 s)
[INFO] Building: reloc-includes-excludes/pom.xml
[INFO] run script <https://builds.apache.org/job/maven-plugins-ITs-m3.0.3/ws/maven-shade-plugin/target/it/reloc-includes-excludes/verify.bsh>
[INFO] ..SUCCESS (4.4 s)
[INFO] Building: rerun-with-reloc/pom.xml
[INFO] ..SUCCESS (5.4 s)
[INFO] Building: implicit-inclusion-of-project-artifact/pom.xml
[INFO] run script <https://builds.apache.org/job/maven-plugins-ITs-m3.0.3/ws/maven-shade-plugin/target/it/implicit-inclusion-of-project-artifact/verify.bsh>
[INFO] ..SUCCESS (3.7 s)
[INFO] Building: duplicate-classes-with-reloc/pom.xml
[INFO] ..SUCCESS (2.8 s)
[INFO] Building: dep-reduced-pom/pom.xml
[INFO] run script <https://builds.apache.org/job/maven-plugins-ITs-m3.0.3/ws/maven-shade-plugin/target/it/dep-reduced-pom/verify.groovy>
[INFO] ..SUCCESS (3.9 s)
[INFO] Building: rerun-without-reloc/pom.xml
[INFO] ..SUCCESS (3.6 s)
[INFO] Building: finalNameBuild-attached/pom.xml
[INFO] run script <https://builds.apache.org/job/maven-plugins-ITs-m3.0.3/ws/maven-shade-plugin/target/it/finalNameBuild-attached/setup.bsh>
[INFO] run script <https://builds.apache.org/job/maven-plugins-ITs-m3.0.3/ws/maven-shade-plugin/target/it/finalNameBuild-attached/verify.bsh>
[INFO] ..SUCCESS (3.8 s)
[INFO] Building: finalNameShade-attached/pom.xml
[INFO] run script <https://builds.apache.org/job/maven-plugins-ITs-m3.0.3/ws/maven-shade-plugin/target/it/finalNameShade-attached/setup.bsh>
[INFO] run script <https://builds.apache.org/job/maven-plugins-ITs-m3.0.3/ws/maven-shade-plugin/target/it/finalNameShade-attached/verify.bsh>
[INFO] ..SUCCESS (3.6 s)
[INFO] Building: shadePomDependency/pom.xml
[INFO] ..SUCCESS (4.3 s)
[INFO] Building: artifact-includes-excludes/pom.xml
[INFO] run script <https://builds.apache.org/job/maven-plugins-ITs-m3.0.3/ws/maven-shade-plugin/target/it/artifact-includes-excludes/verify.bsh>
[INFO] ..SUCCESS (3.6 s)
[INFO] Building: reloc-enum-ref-from-anno/pom.xml
[INFO] ..SUCCESS (3.3 s)
[INFO] Building: mini-jar-package-info/pom.xml
[INFO] run script <https://builds.apache.org/job/maven-plugins-ITs-m3.0.3/ws/maven-shade-plugin/target/it/mini-jar-package-info/verify.bsh>
[INFO] ..SUCCESS (4.4 s)
[INFO] Building: project-with-reactors-included/pom.xml
[INFO] run script <https://builds.apache.org/job/maven-plugins-ITs-m3.0.3/ws/maven-shade-plugin/target/it/project-with-reactors-included/verify.bsh>
[INFO] ..SUCCESS (5.7 s)
[INFO] Building: dep-reduced-pom-with-local-parent/pom.xml
[INFO] ..SUCCESS (2.7 s)
[INFO] Building: mini-jar/pom.xml
[INFO] run script <https://builds.apache.org/job/maven-plugins-ITs-m3.0.3/ws/maven-shade-plugin/target/it/mini-jar/verify.bsh>
[INFO] ..SUCCESS (3.9 s)
[INFO] Building: dep-reduced-pom-unique/pom.xml
[INFO] run script <https://builds.apache.org/job/maven-plugins-ITs-m3.0.3/ws/maven-shade-plugin/target/it/dep-reduced-pom-unique/verify.groovy>
[INFO] ..SUCCESS (4.0 s)
[INFO] Building: mini-jar-malformed-dependencies/pom.xml
[INFO] ..SUCCESS (8.2 s)
[INFO] Building: reloc-abs-resource-path/pom.xml
[INFO] ..SUCCESS (6.2 s)
[INFO] Building: MSHADE-105/pom.xml
[INFO] run script <https://builds.apache.org/job/maven-plugins-ITs-m3.0.3/ws/maven-shade-plugin/target/it/MSHADE-105/verify.bsh>
[INFO] ..SUCCESS (6.9 s)
[INFO] Building: mshade-123/pom.xml
[INFO] ..SUCCESS (5.5 s)
[INFO] Building: reloc-class-from-string-pool/pom.xml
[INFO] ..SUCCESS (3.2 s)
[INFO] Building: users-shader-impl/pom.xml
[INFO] run script <https://builds.apache.org/job/maven-plugins-ITs-m3.0.3/ws/maven-shade-plugin/target/it/users-shader-impl/verify.groovy>
[INFO] ..SUCCESS (4.2 s)
[INFO] Building: empty-apache-notice-transform/pom.xml
[INFO] ..SUCCESS (4.3 s)
[INFO] Building: dep-reduced-pom-relocated-result/pom.xml
[INFO] ..SUCCESS (2.7 s)
[INFO] 
[INFO] --- maven-invoker-plugin:1.6:verify (integration-test) @ maven-shade-plugin ---
[INFO] -------------------------------------------------
[INFO] Build Summary:
[INFO]   Passed: 41, Failed: 0, Errors: 0, Skipped: 0
[INFO] -------------------------------------------------
[INFO] 
[INFO] --- maven-install-plugin:2.3.1:install (default-install) @ maven-shade-plugin ---
[INFO] Installing <https://builds.apache.org/job/maven-plugins-ITs-m3.0.3/ws/maven-shade-plugin/target/maven-shade-plugin-2.0.1-SNAPSHOT.jar> to /home/jenkins/.m2/repository/org/apache/maven/plugins/maven-shade-plugin/2.0.1-SNAPSHOT/maven-shade-plugin-2.0.1-SNAPSHOT.jar
[INFO] Installing <https://builds.apache.org/job/maven-plugins-ITs-m3.0.3/ws/maven-shade-plugin/pom.xml> to /home/jenkins/.m2/repository/org/apache/maven/plugins/maven-shade-plugin/2.0.1-SNAPSHOT/maven-shade-plugin-2.0.1-SNAPSHOT.pom
[INFO] Installing <https://builds.apache.org/job/maven-plugins-ITs-m3.0.3/ws/maven-shade-plugin/target/maven-shade-plugin-2.0.1-SNAPSHOT-tests.jar> to /home/jenkins/.m2/repository/org/apache/maven/plugins/maven-shade-plugin/2.0.1-SNAPSHOT/maven-shade-plugin-2.0.1-SNAPSHOT-tests.jar
[INFO]                                                                         
[INFO] ------------------------------------------------------------------------
[INFO] Building Maven Plugins Aggregator 1-SNAPSHOT
[INFO] ------------------------------------------------------------------------
[INFO] 
[INFO] --- maven-clean-plugin:2.4.1:clean (default-clean) @ maven-plugins-aggregator ---
[INFO] Deleting <https://builds.apache.org/job/maven-plugins-ITs-m3.0.3/ws/target>
[INFO] 
[INFO] --- maven-remote-resources-plugin:1.1:process (default) @ maven-plugins-aggregator ---
[INFO] 
[INFO] --- maven-install-plugin:2.3.1:install (default-install) @ maven-plugins-aggregator ---
[INFO] Installing <https://builds.apache.org/job/maven-plugins-ITs-m3.0.3/ws/pom.xml> to /home/jenkins/.m2/repository/org/apache/maven/plugins/maven-plugins-aggregator/1-SNAPSHOT/maven-plugins-aggregator-1-SNAPSHOT.pom
[INFO] ------------------------------------------------------------------------
[INFO] Reactor Summary:
[INFO] 
[INFO] Maven Plugins ..................................... SUCCESS [3.840s]
[INFO] Maven ACR Plugin .................................. SUCCESS [21.073s]
[INFO] Maven Ant Plugin .................................. SUCCESS [1:06.226s]
[INFO] Maven AntRun Plugin ............................... SUCCESS [53.572s]
[INFO] Maven Eclipse Plugin .............................. SUCCESS [6:23.788s]
[INFO] Maven Assembly Plugin ............................. SUCCESS [10:47.310s]
[INFO] Maven Changelog Plugin ............................ SUCCESS [45.981s]
[INFO] Maven Changes Report Plugin ....................... SUCCESS [1:02.047s]
[INFO] Maven Checkstyle Plugin ........................... SUCCESS [1:34.612s]
[INFO] Maven Clean Plugin ................................ SUCCESS [20.374s]
[INFO] Maven Compiler Plugin ............................. SUCCESS [1:06.424s]
[INFO] Maven Dependency Plugin ........................... FAILURE [0.384s]
[INFO] Maven Deploy Plugin ............................... SUCCESS [58.056s]
[INFO] Maven DOAP Plugin ................................. SUCCESS [17.037s]
[INFO] Maven Documentation Checker Plugin ................ SUCCESS [6.187s]
[INFO] Maven EAR Plugin .................................. SUCCESS [3:44.047s]
[INFO] Maven EJB Plugin .................................. SUCCESS [27.917s]
[INFO] Maven GPG Plugin .................................. SUCCESS [11.393s]
[INFO] Maven Help Plugin ................................. SUCCESS [36.016s]
[INFO] Maven IDEA Plugin ................................. SUCCESS [10.199s]
[INFO] Maven Install Plugin .............................. SUCCESS [39.605s]
[INFO] Maven JAR Plugin .................................. SUCCESS [1:11.873s]
[INFO] Maven Jarsigner Plugin ............................ SUCCESS [24.178s]
[INFO] Maven Javadoc Plugin .............................. SUCCESS [2:46.891s]
[INFO] Maven Linkcheck Plugin ............................ SUCCESS [2.793s]
[INFO] Maven One Plugin .................................. SUCCESS [1.671s]
[INFO] Maven Patch Plugin ................................ SUCCESS [13.019s]
[INFO] Maven PDF Plugin .................................. SUCCESS [31.669s]
[INFO] Maven PMD Plugin .................................. SUCCESS [38.109s]
[INFO] Maven RAR Plugin .................................. SUCCESS [10.637s]
[INFO] Maven Reactor Plugin .............................. SUCCESS [2.471s]
[INFO] Maven Repository Plugin ........................... SUCCESS [35.969s]
[INFO] Maven Resources Plugin ............................ SUCCESS [54.827s]
[INFO] Maven Site Plugin 3 ............................... SUCCESS [6:13.388s]
[INFO] Maven Source Plugin ............................... SUCCESS [46.365s]
[INFO] Maven Stage Plugin ................................ SUCCESS [3.224s]
[INFO] Maven Toolchains Plugin ........................... SUCCESS [2.123s]
[INFO] Maven Verifier Plugin ............................. SUCCESS [16.673s]
[INFO] Maven WAR Plugin .................................. SUCCESS [1:17.363s]
[INFO] SCM Publish Maven Plugin .......................... SUCCESS [50.689s]
[INFO] Maven Invoker Plugin .............................. SUCCESS [4:24.917s]
[INFO] Maven Project Info Reports Plugin ................. SUCCESS [2:32.659s]
[INFO] Maven Remote Resources Plugin ..................... SUCCESS [52.476s]
[INFO] Maven Shade Plugin ................................ SUCCESS [3:08.567s]
[INFO] Maven Plugins Aggregator .......................... SUCCESS [0.044s]
[INFO] ------------------------------------------------------------------------
[INFO] BUILD FAILURE
[INFO] ------------------------------------------------------------------------
[INFO] Total time: 59:40.626s
[INFO] Finished at: Thu Nov 22 16:32:30 UTC 2012
[INFO] Final Memory: 85M/309M
[INFO] ------------------------------------------------------------------------
[WARNING] The requested profile "apache.snapshots" could not be activated because it does not exist.
[ERROR] Failed to execute goal on project maven-dependency-plugin: Could not resolve dependencies for project org.apache.maven.plugins:maven-dependency-plugin:maven-plugin:2.7-SNAPSHOT: Could not find artifact org.apache.maven.shared:maven-dependency-analyzer:jar:1.3 in central (http://repo1.maven.org/maven2) -> [Help 1]
[ERROR] 
[ERROR] To see the full stack trace of the errors, re-run Maven with the -e switch.
[ERROR] Re-run Maven using the -X switch to enable full debug logging.
[ERROR] 
[ERROR] For more information about the errors and possible solutions, please read the following articles:
[ERROR] [Help 1] http://cwiki.apache.org/confluence/display/MAVEN/DependencyResolutionException
[ERROR] 
[ERROR] After correcting the problems, you can resume the build with the command
[ERROR]   mvn <goals> -rf :maven-dependency-plugin
Build step 'Invoke top-level Maven targets' marked build as failure
Recording test results

Build failed in Jenkins: maven-plugins-ITs-m3.0.3 #64

Posted by Apache Jenkins Server <je...@builds.apache.org>.
See <https://builds.apache.org/job/maven-plugins-ITs-m3.0.3/64/changes>

Changes:

[andham] Fixed yet another incorrect internal link.

------------------------------------------
[...truncated 9803 lines...]
 T E S T S
-------------------------------------------------------
Running org.apache.maven.plugins.shade.mojo.ArtifactSelectorTest
Tests run: 1, Failures: 0, Errors: 0, Skipped: 0, Time elapsed: 0.028 sec
Running org.apache.maven.plugins.shade.mojo.ShadeMojoTest
Tests run: 4, Failures: 0, Errors: 0, Skipped: 0, Time elapsed: 2.43 sec
Running org.apache.maven.plugins.shade.mojo.RelativizePathTest
Tests run: 1, Failures: 0, Errors: 0, Skipped: 0, Time elapsed: 0.031 sec
Running org.apache.maven.plugins.shade.mojo.ArtifactIdTest
Tests run: 2, Failures: 0, Errors: 0, Skipped: 0, Time elapsed: 0.002 sec
Running org.apache.maven.plugins.shade.DefaultShaderTest
Tests run: 4, Failures: 0, Errors: 0, Skipped: 0, Time elapsed: 0.864 sec
Running org.apache.maven.plugins.shade.resource.AppendingTransformerTest
Tests run: 1, Failures: 0, Errors: 0, Skipped: 0, Time elapsed: 0.004 sec
Running org.apache.maven.plugins.shade.resource.ApacheNoticeResourceTransformerTest
Tests run: 1, Failures: 0, Errors: 0, Skipped: 0, Time elapsed: 0 sec
Running org.apache.maven.plugins.shade.resource.XmlAppendingTransformerTest
Tests run: 1, Failures: 0, Errors: 0, Skipped: 0, Time elapsed: 0 sec
Running org.apache.maven.plugins.shade.resource.ApacheLicenseResourceTransformerTest
Tests run: 1, Failures: 0, Errors: 0, Skipped: 0, Time elapsed: 0 sec
Running org.apache.maven.plugins.shade.resource.ComponentsXmlResourceTransformerTest
Tests run: 1, Failures: 0, Errors: 0, Skipped: 0, Time elapsed: 0.05 sec
Running org.apache.maven.plugins.shade.filter.SimpleFilterTest
Tests run: 1, Failures: 0, Errors: 0, Skipped: 0, Time elapsed: 0 sec
Running org.apache.maven.plugins.shade.relocation.SimpleRelocatorParameterTest
Tests run: 2, Failures: 0, Errors: 0, Skipped: 0, Time elapsed: 0 sec
Running org.apache.maven.plugins.shade.relocation.SimpleRelocatorTest
Tests run: 7, Failures: 0, Errors: 0, Skipped: 0, Time elapsed: 0.003 sec

Results :

Tests run: 27, Failures: 0, Errors: 0, Skipped: 0

[INFO] 
[INFO] --- maven-jar-plugin:2.4:jar (default-jar) @ maven-shade-plugin ---
[INFO] Building jar: <https://builds.apache.org/job/maven-plugins-ITs-m3.0.3/ws/maven-shade-plugin/target/maven-shade-plugin-2.0.1-SNAPSHOT.jar>
[INFO] 
[INFO] --- maven-plugin-plugin:3.2:addPluginArtifactMetadata (default-addPluginArtifactMetadata) @ maven-shade-plugin ---
[INFO] 
[INFO] --- maven-jar-plugin:2.4:test-jar (default) @ maven-shade-plugin ---
[INFO] Building jar: <https://builds.apache.org/job/maven-plugins-ITs-m3.0.3/ws/maven-shade-plugin/target/maven-shade-plugin-2.0.1-SNAPSHOT-tests.jar>
[INFO] 
[INFO] --- maven-invoker-plugin:1.6:install (integration-test) @ maven-shade-plugin ---
[INFO] Installing <https://builds.apache.org/job/maven-plugins-ITs-m3.0.3/ws/maven-shade-plugin/pom.xml> to <https://builds.apache.org/job/maven-plugins-ITs-m3.0.3/ws/maven-shade-plugin/target/local-repo/org/apache/maven/plugins/maven-shade-plugin/2.0.1-SNAPSHOT/maven-shade-plugin-2.0.1-SNAPSHOT.pom>
[INFO] Installing <https://builds.apache.org/job/maven-plugins-ITs-m3.0.3/ws/maven-shade-plugin/target/maven-shade-plugin-2.0.1-SNAPSHOT.jar> to <https://builds.apache.org/job/maven-plugins-ITs-m3.0.3/ws/maven-shade-plugin/target/local-repo/org/apache/maven/plugins/maven-shade-plugin/2.0.1-SNAPSHOT/maven-shade-plugin-2.0.1-SNAPSHOT.jar>
[INFO] Installing <https://builds.apache.org/job/maven-plugins-ITs-m3.0.3/ws/maven-shade-plugin/target/maven-shade-plugin-2.0.1-SNAPSHOT-tests.jar> to <https://builds.apache.org/job/maven-plugins-ITs-m3.0.3/ws/maven-shade-plugin/target/local-repo/org/apache/maven/plugins/maven-shade-plugin/2.0.1-SNAPSHOT/maven-shade-plugin-2.0.1-SNAPSHOT-tests.jar>
[INFO] 
[INFO] --- maven-invoker-plugin:1.6:integration-test (integration-test) @ maven-shade-plugin ---
[INFO] Building: xml-transformer-ignores-dtd/pom.xml
[INFO] run script <https://builds.apache.org/job/maven-plugins-ITs-m3.0.3/ws/maven-shade-plugin/target/it/xml-transformer-ignores-dtd/verify.bsh>
[INFO] ..SUCCESS (5.7 s)
[INFO] Building: attach-after-lifecycle-fork/pom.xml
[INFO] run script <https://builds.apache.org/job/maven-plugins-ITs-m3.0.3/ws/maven-shade-plugin/target/it/attach-after-lifecycle-fork/setup.bsh>
[INFO] run script <https://builds.apache.org/job/maven-plugins-ITs-m3.0.3/ws/maven-shade-plugin/target/it/attach-after-lifecycle-fork/verify.bsh>
[INFO] ..SUCCESS (3.5 s)
[INFO] Building: duplicate-classes-without-reloc/pom.xml
[INFO] ..SUCCESS (3.2 s)
[INFO] Building: filter-artifact-contents/pom.xml
[INFO] run script <https://builds.apache.org/job/maven-plugins-ITs-m3.0.3/ws/maven-shade-plugin/target/it/filter-artifact-contents/verify.bsh>
[INFO] ..SUCCESS (4.2 s)
[INFO] Building: component-descriptor-relocation/pom.xml
[INFO] ..SUCCESS (4.5 s)
[INFO] Building: finalNameShade/pom.xml
[INFO] run script <https://builds.apache.org/job/maven-plugins-ITs-m3.0.3/ws/maven-shade-plugin/target/it/finalNameShade/setup.bsh>
[INFO] run script <https://builds.apache.org/job/maven-plugins-ITs-m3.0.3/ws/maven-shade-plugin/target/it/finalNameShade/verify.bsh>
[INFO] ..SUCCESS (4.9 s)
[INFO] Building: manifest-retained/pom.xml
[INFO] run script <https://builds.apache.org/job/maven-plugins-ITs-m3.0.3/ws/maven-shade-plugin/target/it/manifest-retained/verify.bsh>
[INFO] ..SUCCESS (5.1 s)
[INFO] Building: manifest-transformed/pom.xml
[INFO] run script <https://builds.apache.org/job/maven-plugins-ITs-m3.0.3/ws/maven-shade-plugin/target/it/manifest-transformed/verify.bsh>
[INFO] ..SUCCESS (5.1 s)
[INFO] Building: services-resource-transformer/pom.xml
[INFO] run script <https://builds.apache.org/job/maven-plugins-ITs-m3.0.3/ws/maven-shade-plugin/target/it/services-resource-transformer/verify.bsh>
[INFO] ..SUCCESS (3.8 s)
[INFO] Building: pom-packaging/pom.xml
[INFO] run script <https://builds.apache.org/job/maven-plugins-ITs-m3.0.3/ws/maven-shade-plugin/target/it/pom-packaging/verify.bsh>
[INFO] ..SUCCESS (2.8 s)
[INFO] Building: non-runtime-scope-excluded/pom.xml
[INFO] run script <https://builds.apache.org/job/maven-plugins-ITs-m3.0.3/ws/maven-shade-plugin/target/it/non-runtime-scope-excluded/verify.bsh>
[INFO] ..SUCCESS (3.9 s)
[INFO] Building: reloc-anno/pom.xml
[INFO] ..SUCCESS (3.4 s)
[INFO] Building: mini-jar-respect-includes/pom.xml
[INFO] run script <https://builds.apache.org/job/maven-plugins-ITs-m3.0.3/ws/maven-shade-plugin/target/it/mini-jar-respect-includes/verify.bsh>
[INFO] ..SUCCESS (4.9 s)
[INFO] Building: empty-relocation-pattern/pom.xml
[INFO] ..SUCCESS (3.9 s)
[INFO] Building: finalNameBuild/pom.xml
[INFO] run script <https://builds.apache.org/job/maven-plugins-ITs-m3.0.3/ws/maven-shade-plugin/target/it/finalNameBuild/setup.bsh>
[INFO] run script <https://builds.apache.org/job/maven-plugins-ITs-m3.0.3/ws/maven-shade-plugin/target/it/finalNameBuild/verify.bsh>
[INFO] ..SUCCESS (4.4 s)
[INFO] Building: attached-artifact-type/pom.xml
[INFO] ..SUCCESS (3.1 s)
[INFO] Building: empty-relocation-shaded-pattern/pom.xml
[INFO] ..SUCCESS (4.2 s)
[INFO] Building: reloc-includes-excludes/pom.xml
[INFO] run script <https://builds.apache.org/job/maven-plugins-ITs-m3.0.3/ws/maven-shade-plugin/target/it/reloc-includes-excludes/verify.bsh>
[INFO] ..SUCCESS (4.6 s)
[INFO] Building: rerun-with-reloc/pom.xml
[INFO] ..SUCCESS (6.0 s)
[INFO] Building: implicit-inclusion-of-project-artifact/pom.xml
[INFO] run script <https://builds.apache.org/job/maven-plugins-ITs-m3.0.3/ws/maven-shade-plugin/target/it/implicit-inclusion-of-project-artifact/verify.bsh>
[INFO] ..SUCCESS (4.0 s)
[INFO] Building: duplicate-classes-with-reloc/pom.xml
[INFO] ..SUCCESS (3.6 s)
[INFO] Building: dep-reduced-pom/pom.xml
[INFO] run script <https://builds.apache.org/job/maven-plugins-ITs-m3.0.3/ws/maven-shade-plugin/target/it/dep-reduced-pom/verify.groovy>
[INFO] ..SUCCESS (4.1 s)
[INFO] Building: rerun-without-reloc/pom.xml
[INFO] ..SUCCESS (3.6 s)
[INFO] Building: finalNameBuild-attached/pom.xml
[INFO] run script <https://builds.apache.org/job/maven-plugins-ITs-m3.0.3/ws/maven-shade-plugin/target/it/finalNameBuild-attached/setup.bsh>
[INFO] run script <https://builds.apache.org/job/maven-plugins-ITs-m3.0.3/ws/maven-shade-plugin/target/it/finalNameBuild-attached/verify.bsh>
[INFO] ..SUCCESS (3.8 s)
[INFO] Building: finalNameShade-attached/pom.xml
[INFO] run script <https://builds.apache.org/job/maven-plugins-ITs-m3.0.3/ws/maven-shade-plugin/target/it/finalNameShade-attached/setup.bsh>
[INFO] run script <https://builds.apache.org/job/maven-plugins-ITs-m3.0.3/ws/maven-shade-plugin/target/it/finalNameShade-attached/verify.bsh>
[INFO] ..SUCCESS (3.9 s)
[INFO] Building: shadePomDependency/pom.xml
[INFO] ..SUCCESS (4.5 s)
[INFO] Building: artifact-includes-excludes/pom.xml
[INFO] run script <https://builds.apache.org/job/maven-plugins-ITs-m3.0.3/ws/maven-shade-plugin/target/it/artifact-includes-excludes/verify.bsh>
[INFO] ..SUCCESS (3.9 s)
[INFO] Building: reloc-enum-ref-from-anno/pom.xml
[INFO] ..SUCCESS (3.5 s)
[INFO] Building: mini-jar-package-info/pom.xml
[INFO] run script <https://builds.apache.org/job/maven-plugins-ITs-m3.0.3/ws/maven-shade-plugin/target/it/mini-jar-package-info/verify.bsh>
[INFO] ..SUCCESS (4.5 s)
[INFO] Building: project-with-reactors-included/pom.xml
[INFO] run script <https://builds.apache.org/job/maven-plugins-ITs-m3.0.3/ws/maven-shade-plugin/target/it/project-with-reactors-included/verify.bsh>
[INFO] ..SUCCESS (5.6 s)
[INFO] Building: dep-reduced-pom-with-local-parent/pom.xml
[INFO] ..SUCCESS (2.8 s)
[INFO] Building: mini-jar/pom.xml
[INFO] run script <https://builds.apache.org/job/maven-plugins-ITs-m3.0.3/ws/maven-shade-plugin/target/it/mini-jar/verify.bsh>
[INFO] ..SUCCESS (4.7 s)
[INFO] Building: dep-reduced-pom-unique/pom.xml
[INFO] run script <https://builds.apache.org/job/maven-plugins-ITs-m3.0.3/ws/maven-shade-plugin/target/it/dep-reduced-pom-unique/verify.groovy>
[INFO] ..SUCCESS (4.3 s)
[INFO] Building: mini-jar-malformed-dependencies/pom.xml
[INFO] ..SUCCESS (7.7 s)
[INFO] Building: reloc-abs-resource-path/pom.xml
[INFO] ..SUCCESS (6.3 s)
[INFO] Building: MSHADE-105/pom.xml
[INFO] run script <https://builds.apache.org/job/maven-plugins-ITs-m3.0.3/ws/maven-shade-plugin/target/it/MSHADE-105/verify.bsh>
[INFO] ..SUCCESS (9.1 s)
[INFO] Building: mshade-123/pom.xml
[INFO] ..SUCCESS (7.1 s)
[INFO] Building: reloc-class-from-string-pool/pom.xml
[INFO] ..SUCCESS (3.8 s)
[INFO] Building: users-shader-impl/pom.xml
[INFO] run script <https://builds.apache.org/job/maven-plugins-ITs-m3.0.3/ws/maven-shade-plugin/target/it/users-shader-impl/verify.groovy>
[INFO] ..SUCCESS (5.2 s)
[INFO] Building: empty-apache-notice-transform/pom.xml
[INFO] ..SUCCESS (10.7 s)
[INFO] Building: dep-reduced-pom-relocated-result/pom.xml
[INFO] ..SUCCESS (6.5 s)
[INFO] 
[INFO] --- maven-invoker-plugin:1.6:verify (integration-test) @ maven-shade-plugin ---
[INFO] -------------------------------------------------
[INFO] Build Summary:
[INFO]   Passed: 41, Failed: 0, Errors: 0, Skipped: 0
[INFO] -------------------------------------------------
[INFO] 
[INFO] --- maven-install-plugin:2.3.1:install (default-install) @ maven-shade-plugin ---
[INFO] Installing <https://builds.apache.org/job/maven-plugins-ITs-m3.0.3/ws/maven-shade-plugin/target/maven-shade-plugin-2.0.1-SNAPSHOT.jar> to /home/jenkins/.m2/repository/org/apache/maven/plugins/maven-shade-plugin/2.0.1-SNAPSHOT/maven-shade-plugin-2.0.1-SNAPSHOT.jar
[INFO] Installing <https://builds.apache.org/job/maven-plugins-ITs-m3.0.3/ws/maven-shade-plugin/pom.xml> to /home/jenkins/.m2/repository/org/apache/maven/plugins/maven-shade-plugin/2.0.1-SNAPSHOT/maven-shade-plugin-2.0.1-SNAPSHOT.pom
[INFO] Installing <https://builds.apache.org/job/maven-plugins-ITs-m3.0.3/ws/maven-shade-plugin/target/maven-shade-plugin-2.0.1-SNAPSHOT-tests.jar> to /home/jenkins/.m2/repository/org/apache/maven/plugins/maven-shade-plugin/2.0.1-SNAPSHOT/maven-shade-plugin-2.0.1-SNAPSHOT-tests.jar
[INFO]                                                                         
[INFO] ------------------------------------------------------------------------
[INFO] Building Maven Plugins Aggregator 1-SNAPSHOT
[INFO] ------------------------------------------------------------------------
[INFO] 
[INFO] --- maven-clean-plugin:2.4.1:clean (default-clean) @ maven-plugins-aggregator ---
[INFO] Deleting <https://builds.apache.org/job/maven-plugins-ITs-m3.0.3/ws/target>
[INFO] 
[INFO] --- maven-remote-resources-plugin:1.1:process (default) @ maven-plugins-aggregator ---
[INFO] 
[INFO] --- maven-install-plugin:2.3.1:install (default-install) @ maven-plugins-aggregator ---
[INFO] Installing <https://builds.apache.org/job/maven-plugins-ITs-m3.0.3/ws/pom.xml> to /home/jenkins/.m2/repository/org/apache/maven/plugins/maven-plugins-aggregator/1-SNAPSHOT/maven-plugins-aggregator-1-SNAPSHOT.pom
[INFO] ------------------------------------------------------------------------
[INFO] Reactor Summary:
[INFO] 
[INFO] Maven Plugins ..................................... SUCCESS [3.337s]
[INFO] Maven ACR Plugin .................................. SUCCESS [20.891s]
[INFO] Maven Ant Plugin .................................. SUCCESS [1:10.948s]
[INFO] Maven AntRun Plugin ............................... SUCCESS [53.500s]
[INFO] Maven Eclipse Plugin .............................. SUCCESS [6:13.098s]
[INFO] Maven Assembly Plugin ............................. SUCCESS [10:38.773s]
[INFO] Maven Changelog Plugin ............................ SUCCESS [55.397s]
[INFO] Maven Changes Report Plugin ....................... SUCCESS [1:02.033s]
[INFO] Maven Checkstyle Plugin ........................... SUCCESS [1:36.871s]
[INFO] Maven Clean Plugin ................................ SUCCESS [20.831s]
[INFO] Maven Compiler Plugin ............................. SUCCESS [1:03.879s]
[INFO] Maven Dependency Plugin ........................... FAILURE [0.431s]
[INFO] Maven Deploy Plugin ............................... SUCCESS [1:00.745s]
[INFO] Maven DOAP Plugin ................................. SUCCESS [16.791s]
[INFO] Maven Documentation Checker Plugin ................ SUCCESS [7.024s]
[INFO] Maven EAR Plugin .................................. SUCCESS [3:47.234s]
[INFO] Maven EJB Plugin .................................. SUCCESS [27.092s]
[INFO] Maven GPG Plugin .................................. SUCCESS [9.760s]
[INFO] Maven Help Plugin ................................. SUCCESS [35.368s]
[INFO] Maven IDEA Plugin ................................. SUCCESS [7.202s]
[INFO] Maven Install Plugin .............................. SUCCESS [39.049s]
[INFO] Maven JAR Plugin .................................. SUCCESS [1:09.818s]
[INFO] Maven Jarsigner Plugin ............................ SUCCESS [23.584s]
[INFO] Maven Javadoc Plugin .............................. SUCCESS [2:46.864s]
[INFO] Maven Linkcheck Plugin ............................ SUCCESS [3.296s]
[INFO] Maven One Plugin .................................. SUCCESS [1.566s]
[INFO] Maven Patch Plugin ................................ SUCCESS [12.717s]
[INFO] Maven PDF Plugin .................................. SUCCESS [31.791s]
[INFO] Maven PMD Plugin .................................. SUCCESS [37.103s]
[INFO] Maven RAR Plugin .................................. SUCCESS [9.960s]
[INFO] Maven Reactor Plugin .............................. SUCCESS [2.337s]
[INFO] Maven Repository Plugin ........................... SUCCESS [35.988s]
[INFO] Maven Resources Plugin ............................ SUCCESS [54.221s]
[INFO] Maven Site Plugin 3 ............................... SUCCESS [6:26.317s]
[INFO] Maven Source Plugin ............................... SUCCESS [45.132s]
[INFO] Maven Stage Plugin ................................ SUCCESS [1.936s]
[INFO] Maven Toolchains Plugin ........................... SUCCESS [1.733s]
[INFO] Maven Verifier Plugin ............................. SUCCESS [14.514s]
[INFO] Maven WAR Plugin .................................. SUCCESS [1:16.154s]
[INFO] SCM Publish Maven Plugin .......................... SUCCESS [47.561s]
[INFO] Maven Invoker Plugin .............................. SUCCESS [4:17.108s]
[INFO] Maven Project Info Reports Plugin ................. SUCCESS [2:41.648s]
[INFO] Maven Remote Resources Plugin ..................... SUCCESS [53.984s]
[INFO] Maven Shade Plugin ................................ SUCCESS [3:43.176s]
[INFO] Maven Plugins Aggregator .......................... SUCCESS [0.128s]
[INFO] ------------------------------------------------------------------------
[INFO] BUILD FAILURE
[INFO] ------------------------------------------------------------------------
[INFO] Total time: 1:00:10.087s
[INFO] Finished at: Thu Nov 22 15:17:45 UTC 2012
[INFO] Final Memory: 84M/313M
[INFO] ------------------------------------------------------------------------
[WARNING] The requested profile "apache.snapshots" could not be activated because it does not exist.
[ERROR] Failed to execute goal on project maven-dependency-plugin: Could not resolve dependencies for project org.apache.maven.plugins:maven-dependency-plugin:maven-plugin:2.7-SNAPSHOT: Could not find artifact org.apache.maven.shared:maven-dependency-analyzer:jar:1.3 in central (http://repo1.maven.org/maven2) -> [Help 1]
[ERROR] 
[ERROR] To see the full stack trace of the errors, re-run Maven with the -e switch.
[ERROR] Re-run Maven using the -X switch to enable full debug logging.
[ERROR] 
[ERROR] For more information about the errors and possible solutions, please read the following articles:
[ERROR] [Help 1] http://cwiki.apache.org/confluence/display/MAVEN/DependencyResolutionException
[ERROR] 
[ERROR] After correcting the problems, you can resume the build with the command
[ERROR]   mvn <goals> -rf :maven-dependency-plugin
Build step 'Invoke top-level Maven targets' marked build as failure
Recording test results