You are viewing a plain text version of this content. The canonical link for it is here.
Posted to builds@mesos.apache.org by Apache Jenkins Server <je...@builds.apache.org> on 2019/02/21 19:49:00 UTC

Branch: origin/master Mesos-Buildbot - Build # 6151 - Still Failing

Branch: origin/master

The Apache Jenkins build system has built Mesos-Buildbot (build #6151)

Status: Still Failing

Check console output at https://builds.apache.org/job/Mesos-Buildbot/6151/ to view the results.

Branch: origin/master Mesos-Buildbot - Build # 6180 - Still Failing

Posted by Apache Jenkins Server <je...@builds.apache.org>.
Branch: origin/master

The Apache Jenkins build system has built Mesos-Buildbot (build #6180)

Status: Still Failing

Check console output at https://builds.apache.org/job/Mesos-Buildbot/6180/ to view the results.

1 tests failed.
FAILED:  StorageLocalResourceProviderTest.RetryOperationStatusUpdateToScheduler

Error Message:
/tmp/SRC/src/tests/storage_local_resource_provider_tests.cpp:4486
Failed to wait 1mins for offers

Stack Trace:
/tmp/SRC/src/tests/storage_local_resource_provider_tests.cpp:4486
Failed to wait 1mins for offers

Branch: origin/master Mesos-Buildbot - Build # 6179 - Still Failing

Posted by Apache Jenkins Server <je...@builds.apache.org>.
Branch: origin/master

The Apache Jenkins build system has built Mesos-Buildbot (build #6179)

Status: Still Failing

Check console output at https://builds.apache.org/job/Mesos-Buildbot/6179/ to view the results.

All tests passed

Branch: origin/master Mesos-Buildbot - Build # 6178 - Still Failing

Posted by Apache Jenkins Server <je...@builds.apache.org>.
Branch: origin/master

The Apache Jenkins build system has built Mesos-Buildbot (build #6178)

Status: Still Failing

Check console output at https://builds.apache.org/job/Mesos-Buildbot/6178/ to view the results.

1 tests failed.
FAILED:  ExamplesTest.DynamicReservationFramework

Error Message:
../../src/tests/script.cpp:86
Failed
dynamic_reservation_framework_test.sh terminated with signal Aborted (core dumped)

Stack Trace:
../../src/tests/script.cpp:86
Failed
dynamic_reservation_framework_test.sh terminated with signal Aborted (core dumped)

Branch: origin/master Mesos-Buildbot - Build # 6177 - Still Failing

Posted by Apache Jenkins Server <je...@builds.apache.org>.
Branch: origin/master

The Apache Jenkins build system has built Mesos-Buildbot (build #6177)

Status: Still Failing

Check console output at https://builds.apache.org/job/Mesos-Buildbot/6177/ to view the results.

1 tests failed.
FAILED:  ExamplesTest.DynamicReservationFramework

Error Message:
../../../src/tests/script.cpp:86
Failed
dynamic_reservation_framework_test.sh terminated with signal Aborted (core dumped)

Stack Trace:
../../../src/tests/script.cpp:86
Failed
dynamic_reservation_framework_test.sh terminated with signal Aborted (core dumped)

Branch: origin/master Mesos-Buildbot - Build # 6176 - Still Failing

Posted by Apache Jenkins Server <je...@builds.apache.org>.
Branch: origin/master

The Apache Jenkins build system has built Mesos-Buildbot (build #6176)

Status: Still Failing

Check console output at https://builds.apache.org/job/Mesos-Buildbot/6176/ to view the results.

1 tests failed.
FAILED:  ExamplesTest.DynamicReservationFramework

Error Message:
/tmp/SRC/src/tests/script.cpp:86
Failed
dynamic_reservation_framework_test.sh terminated with signal Aborted (core dumped)

Stack Trace:
/tmp/SRC/src/tests/script.cpp:86
Failed
dynamic_reservation_framework_test.sh terminated with signal Aborted (core dumped)

Branch: origin/master Mesos-Buildbot - Build # 6174 - Still Failing

Posted by Apache Jenkins Server <je...@builds.apache.org>.
Branch: origin/master

The Apache Jenkins build system has built Mesos-Buildbot (build #6174)

Status: Still Failing

Check console output at https://builds.apache.org/job/Mesos-Buildbot/6174/ to view the results.

1 tests failed.
FAILED:  StorageLocalResourceProviderTest.RetryRpcWithExponentialBackoff

Error Message:
/tmp/SRC/src/tests/storage_local_resource_provider_tests.cpp:5027
Failed to wait 1mins for offers

Stack Trace:
/tmp/SRC/src/tests/storage_local_resource_provider_tests.cpp:5027
Failed to wait 1mins for offers

Branch: origin/master Mesos-Buildbot - Build # 6173 - Still Failing

Posted by Apache Jenkins Server <je...@builds.apache.org>.
Branch: origin/master

The Apache Jenkins build system has built Mesos-Buildbot (build #6173)

Status: Still Failing

Check console output at https://builds.apache.org/job/Mesos-Buildbot/6173/ to view the results.

1 tests failed.
FAILED:  StorageLocalResourceProviderTest.RetryRpcWithExponentialBackoff

Error Message:
/tmp/SRC/src/tests/storage_local_resource_provider_tests.cpp:5027
Failed to wait 1mins for offers

Stack Trace:
/tmp/SRC/src/tests/storage_local_resource_provider_tests.cpp:5027
Failed to wait 1mins for offers

Branch: origin/master Mesos-Buildbot - Build # 6172 - Still Failing

Posted by Apache Jenkins Server <je...@builds.apache.org>.
Branch: origin/master

The Apache Jenkins build system has built Mesos-Buildbot (build #6172)

Status: Still Failing

Check console output at https://builds.apache.org/job/Mesos-Buildbot/6172/ to view the results.

1 tests failed.
FAILED:  ExamplesTest.DynamicReservationFramework

Error Message:
/tmp/SRC/src/tests/script.cpp:86
Failed
dynamic_reservation_framework_test.sh terminated with signal Aborted (core dumped)

Stack Trace:
/tmp/SRC/src/tests/script.cpp:86
Failed
dynamic_reservation_framework_test.sh terminated with signal Aborted (core dumped)

Branch: origin/master Mesos-Buildbot - Build # 6171 - Still Failing

Posted by Apache Jenkins Server <je...@builds.apache.org>.
Branch: origin/master

The Apache Jenkins build system has built Mesos-Buildbot (build #6171)

Status: Still Failing

Check console output at https://builds.apache.org/job/Mesos-Buildbot/6171/ to view the results.

1 tests failed.
FAILED:  StorageLocalResourceProviderTest.RetryRpcWithExponentialBackoff

Error Message:
../../src/tests/storage_local_resource_provider_tests.cpp:5027
Failed to wait 1mins for offers

Stack Trace:
../../src/tests/storage_local_resource_provider_tests.cpp:5027
Failed to wait 1mins for offers

Branch: origin/master Mesos-Buildbot - Build # 6170 - Still Failing

Posted by Apache Jenkins Server <je...@builds.apache.org>.
Branch: origin/master

The Apache Jenkins build system has built Mesos-Buildbot (build #6170)

Status: Still Failing

Check console output at https://builds.apache.org/job/Mesos-Buildbot/6170/ to view the results.

2 tests failed.
FAILED:  ExamplesTest.DynamicReservationFramework

Error Message:
/tmp/SRC/src/tests/script.cpp:86
Failed
dynamic_reservation_framework_test.sh terminated with signal Aborted (core dumped)

Stack Trace:
/tmp/SRC/src/tests/script.cpp:86
Failed
dynamic_reservation_framework_test.sh terminated with signal Aborted (core dumped)

FAILED:  ExamplesTest.DynamicReservationFramework

Error Message:
../../../src/tests/script.cpp:86
Failed
dynamic_reservation_framework_test.sh terminated with signal Aborted (core dumped)

Stack Trace:
../../../src/tests/script.cpp:86
Failed
dynamic_reservation_framework_test.sh terminated with signal Aborted (core dumped)

Branch: origin/master Mesos-Buildbot - Build # 6169 - Still Failing

Posted by Apache Jenkins Server <je...@builds.apache.org>.
Branch: origin/master

The Apache Jenkins build system has built Mesos-Buildbot (build #6169)

Status: Still Failing

Check console output at https://builds.apache.org/job/Mesos-Buildbot/6169/ to view the results.

1 tests failed.
FAILED:  CommandExecutorCheckTest.HTTPCheckDelivered

Error Message:
/tmp/SRC/src/tests/check_tests.cpp:1139
      Expected: v1::TASK_RUNNING
      Which is: TASK_RUNNING
To be equal to: checkResult.state()
      Which is: TASK_FAILED

Stack Trace:
/tmp/SRC/src/tests/check_tests.cpp:1139
      Expected: v1::TASK_RUNNING
      Which is: TASK_RUNNING
To be equal to: checkResult.state()
      Which is: TASK_FAILED

Branch: origin/1.7.x Mesos-Buildbot - Build # 6168 - Still Failing

Posted by Apache Jenkins Server <je...@builds.apache.org>.
Branch: origin/1.7.x

The Apache Jenkins build system has built Mesos-Buildbot (build #6168)

Status: Still Failing

Check console output at https://builds.apache.org/job/Mesos-Buildbot/6168/ to view the results.

All tests passed

Branch: origin/1.7.x Mesos-Buildbot - Build # 6167 - Still Failing

Posted by Apache Jenkins Server <je...@builds.apache.org>.
Branch: origin/1.7.x

The Apache Jenkins build system has built Mesos-Buildbot (build #6167)

Status: Still Failing

Check console output at https://builds.apache.org/job/Mesos-Buildbot/6167/ to view the results.

1 tests failed.
FAILED:  MasterTest.CreateVolumesV1AuthorizationFailure

Error Message:
../../src/tests/master_tests.cpp:10129
Mock function called more times than expected - returning default value.
    Function call: authorized(@0x7fa2b9066108 48-byte object <98-19 47-D1 A2-7F 00-00 00-00 00-00 00-00 00-00 07-00 00-00 00-00 00-00 40-AF 01-78 A2-7F 00-00 40-92 00-78 A2-7F 00-00 04-00 00-00 A2-7F 00-00>)
          Returns: Abandoned
         Expected: to be called once
           Actual: called twice - over-saturated and active

Stack Trace:
../../src/tests/master_tests.cpp:10129
Mock function called more times than expected - returning default value.
    Function call: authorized(@0x7fa2b9066108 48-byte object <98-19 47-D1 A2-7F 00-00 00-00 00-00 00-00 00-00 07-00 00-00 00-00 00-00 40-AF 01-78 A2-7F 00-00 40-92 00-78 A2-7F 00-00 04-00 00-00 A2-7F 00-00>)
          Returns: Abandoned
         Expected: to be called once
           Actual: called twice - over-saturated and active

Branch: origin/master Mesos-Buildbot - Build # 6166 - Still Failing

Posted by Apache Jenkins Server <je...@builds.apache.org>.
Branch: origin/master

The Apache Jenkins build system has built Mesos-Buildbot (build #6166)

Status: Still Failing

Check console output at https://builds.apache.org/job/Mesos-Buildbot/6166/ to view the results.

4 tests failed.
FAILED:  DiskQuotaTest.SlaveRecovery

Error Message:
/tmp/SRC/src/tests/disk_quota_tests.cpp:746
Value of: usage->has_disk_limit_bytes()
  Actual: false
Expected: true

Stack Trace:
/tmp/SRC/src/tests/disk_quota_tests.cpp:746
Value of: usage->has_disk_limit_bytes()
  Actual: false
Expected: true

FAILED:  ExamplesTest.DynamicReservationFramework

Error Message:
/tmp/SRC/src/tests/script.cpp:86
Failed
dynamic_reservation_framework_test.sh terminated with signal Aborted (core dumped)

Stack Trace:
/tmp/SRC/src/tests/script.cpp:86
Failed
dynamic_reservation_framework_test.sh terminated with signal Aborted (core dumped)

FAILED:  ExamplesTest.DynamicReservationFramework

Error Message:
../../src/tests/script.cpp:86
Failed
dynamic_reservation_framework_test.sh terminated with signal Aborted (core dumped)

Stack Trace:
../../src/tests/script.cpp:86
Failed
dynamic_reservation_framework_test.sh terminated with signal Aborted (core dumped)

FAILED:  ExamplesTest.DynamicReservationFramework

Error Message:
/tmp/SRC/src/tests/script.cpp:86
Failed
dynamic_reservation_framework_test.sh terminated with signal Aborted (core dumped)

Stack Trace:
/tmp/SRC/src/tests/script.cpp:86
Failed
dynamic_reservation_framework_test.sh terminated with signal Aborted (core dumped)

Branch: origin/1.6.x Mesos-Buildbot - Build # 6165 - Still Failing

Posted by Apache Jenkins Server <je...@builds.apache.org>.
Branch: origin/1.6.x

The Apache Jenkins build system has built Mesos-Buildbot (build #6165)

Status: Still Failing

Check console output at https://builds.apache.org/job/Mesos-Buildbot/6165/ to view the results.

All tests passed

Branch: origin/master Mesos-Buildbot - Build # 6164 - Still Failing

Posted by Apache Jenkins Server <je...@builds.apache.org>.
Branch: origin/master

The Apache Jenkins build system has built Mesos-Buildbot (build #6164)

Status: Still Failing

Check console output at https://builds.apache.org/job/Mesos-Buildbot/6164/ to view the results.

All tests passed

Branch: origin/master Mesos-Buildbot - Build # 6163 - Still Failing

Posted by Apache Jenkins Server <je...@builds.apache.org>.
Branch: origin/master

The Apache Jenkins build system has built Mesos-Buildbot (build #6163)

Status: Still Failing

Check console output at https://builds.apache.org/job/Mesos-Buildbot/6163/ to view the results.

1 tests failed.
FAILED:  ExamplesTest.DynamicReservationFramework

Error Message:
../../../src/tests/script.cpp:86
Failed
dynamic_reservation_framework_test.sh terminated with signal Aborted (core dumped)

Stack Trace:
../../../src/tests/script.cpp:86
Failed
dynamic_reservation_framework_test.sh terminated with signal Aborted (core dumped)

Branch: origin/master Mesos-Buildbot - Build # 6162 - Still Failing

Posted by Apache Jenkins Server <je...@builds.apache.org>.
Branch: origin/master

The Apache Jenkins build system has built Mesos-Buildbot (build #6162)

Status: Still Failing

Check console output at https://builds.apache.org/job/Mesos-Buildbot/6162/ to view the results.

2 tests failed.
FAILED:  DiskQuotaTest.SlaveRecovery

Error Message:
/tmp/SRC/src/tests/disk_quota_tests.cpp:746
Value of: usage->has_disk_limit_bytes()
  Actual: false
Expected: true

Stack Trace:
/tmp/SRC/src/tests/disk_quota_tests.cpp:746
Value of: usage->has_disk_limit_bytes()
  Actual: false
Expected: true

FAILED:  StorageLocalResourceProviderTest.RetryRpcWithExponentialBackoff

Error Message:
/tmp/SRC/src/tests/storage_local_resource_provider_tests.cpp:5027
Failed to wait 1mins for offers

Stack Trace:
/tmp/SRC/src/tests/storage_local_resource_provider_tests.cpp:5027
Failed to wait 1mins for offers

Branch: origin/master Mesos-Buildbot - Build # 6161 - Still Failing

Posted by Apache Jenkins Server <je...@builds.apache.org>.
Branch: origin/master

The Apache Jenkins build system has built Mesos-Buildbot (build #6161)

Status: Still Failing

Check console output at https://builds.apache.org/job/Mesos-Buildbot/6161/ to view the results.

All tests passed

Branch: origin/master Mesos-Buildbot - Build # 6160 - Still Failing

Posted by Apache Jenkins Server <je...@builds.apache.org>.
Branch: origin/master

The Apache Jenkins build system has built Mesos-Buildbot (build #6160)

Status: Still Failing

Check console output at https://builds.apache.org/job/Mesos-Buildbot/6160/ to view the results.

1 tests failed.
FAILED:  StorageLocalResourceProviderTest.RetryRpcWithExponentialBackoff

Error Message:
/tmp/SRC/src/tests/storage_local_resource_provider_tests.cpp:5027
Failed to wait 1mins for offers

Stack Trace:
/tmp/SRC/src/tests/storage_local_resource_provider_tests.cpp:5027
Failed to wait 1mins for offers

Branch: origin/1.7.x Mesos-Buildbot - Build # 6159 - Still Failing

Posted by Apache Jenkins Server <je...@builds.apache.org>.
Branch: origin/1.7.x

The Apache Jenkins build system has built Mesos-Buildbot (build #6159)

Status: Still Failing

Check console output at https://builds.apache.org/job/Mesos-Buildbot/6159/ to view the results.

1 tests failed.
FAILED:  DefaultExecutorCheckTest.CommandCheckTimeout

Error Message:
/tmp/SRC/src/tests/check_tests.cpp:2162
Failed to wait 1mins for updateCheckResult

Stack Trace:
/tmp/SRC/src/tests/check_tests.cpp:2162
Failed to wait 1mins for updateCheckResult

Branch: origin/1.4.x Mesos-Buildbot - Build # 6158 - Still Failing

Posted by Apache Jenkins Server <je...@builds.apache.org>.
Branch: origin/1.4.x

The Apache Jenkins build system has built Mesos-Buildbot (build #6158)

Status: Still Failing

Check console output at https://builds.apache.org/job/Mesos-Buildbot/6158/ to view the results.

7 tests failed.
FAILED:  OversubscriptionTest.RescindRevocableOfferWithIncreasedRevocable

Error Message:
../../../src/tests/oversubscription_tests.cpp:553
      Expected: allocatedResources(resources2, framework.roles(0))
      Which is: { cpus(allocated: *){REV}:3 }
To be equal to: resources3
      Which is: { cpus(allocated: *){REV}:2 }

Stack Trace:
../../../src/tests/oversubscription_tests.cpp:553
      Expected: allocatedResources(resources2, framework.roles(0))
      Which is: { cpus(allocated: *){REV}:3 }
To be equal to: resources3
      Which is: { cpus(allocated: *){REV}:2 }

FAILED:  ExamplesTest.TestFramework

Error Message:
../../../src/tests/script.cpp:83
Failed
test_framework_test.sh terminated with signal Aborted (core dumped)

Stack Trace:
../../../src/tests/script.cpp:83
Failed
test_framework_test.sh terminated with signal Aborted (core dumped)

FAILED:  ExamplesTest.PersistentVolumeFramework

Error Message:
../../../src/tests/script.cpp:83
Failed
persistent_volume_framework_test.sh terminated with signal Aborted (core dumped)

Stack Trace:
../../../src/tests/script.cpp:83
Failed
persistent_volume_framework_test.sh terminated with signal Aborted (core dumped)

FAILED:  DockerFetcherPluginTest.INTERNET_CURL_InvokeFetchByName

Error Message:
../../../src/tests/uri_fetcher_tests.cpp:369
Failed to wait 1mins for fetcher.get()->fetch(uri, dir, "docker", None())

Stack Trace:
../../../src/tests/uri_fetcher_tests.cpp:369
Failed to wait 1mins for fetcher.get()->fetch(uri, dir, "docker", None())

FAILED:  MasterTest.IgnoreOldAgentReregistration

Error Message:
../../src/tests/master_tests.cpp:8034
Failed to wait 15secs for reregisterSlaveMessage

Stack Trace:
../../src/tests/master_tests.cpp:8034
Failed to wait 15secs for reregisterSlaveMessage

FAILED:  ExamplesTest.JavaFramework

Error Message:
../../src/tests/script.cpp:83
Failed
java_framework_test.sh terminated with signal Aborted (core dumped)

Stack Trace:
../../src/tests/script.cpp:83
Failed
java_framework_test.sh terminated with signal Aborted (core dumped)

FAILED:  MasterTest.IgnoreOldAgentReregistration

Error Message:
/tmp/SRC/src/tests/master_tests.cpp:8034
Failed to wait 15secs for reregisterSlaveMessage

Stack Trace:
/tmp/SRC/src/tests/master_tests.cpp:8034
Failed to wait 15secs for reregisterSlaveMessage

Branch: origin/master Mesos-Buildbot - Build # 6157 - Still Failing

Posted by Apache Jenkins Server <je...@builds.apache.org>.
Branch: origin/master

The Apache Jenkins build system has built Mesos-Buildbot (build #6157)

Status: Still Failing

Check console output at https://builds.apache.org/job/Mesos-Buildbot/6157/ to view the results.

All tests passed

Branch: origin/master Mesos-Buildbot - Build # 6156 - Still Failing

Posted by Apache Jenkins Server <je...@builds.apache.org>.
Branch: origin/master

The Apache Jenkins build system has built Mesos-Buildbot (build #6156)

Status: Still Failing

Check console output at https://builds.apache.org/job/Mesos-Buildbot/6156/ to view the results.

1 tests failed.
FAILED:  DiskQuotaTest.SlaveRecovery

Error Message:
/tmp/SRC/src/tests/disk_quota_tests.cpp:746
Value of: usage->has_disk_limit_bytes()
  Actual: false
Expected: true

Stack Trace:
/tmp/SRC/src/tests/disk_quota_tests.cpp:746
Value of: usage->has_disk_limit_bytes()
  Actual: false
Expected: true

Branch: origin/1.7.x Mesos-Buildbot - Build # 6155 - Still Failing

Posted by Apache Jenkins Server <je...@builds.apache.org>.
Branch: origin/1.7.x

The Apache Jenkins build system has built Mesos-Buildbot (build #6155)

Status: Still Failing

Check console output at https://builds.apache.org/job/Mesos-Buildbot/6155/ to view the results.

4 tests failed.
FAILED:  PersistentVolumeEndpointsTest.EndpointCreateThenOfferRemove

Error Message:
../../src/tests/persistent_volume_endpoints_tests.cpp:1745
Failed to wait 1mins for offers

Stack Trace:
../../src/tests/persistent_volume_endpoints_tests.cpp:1745
Failed to wait 1mins for offers

FAILED:  DiskQuotaTest.SlaveRecovery

Error Message:
/tmp/SRC/src/tests/disk_quota_tests.cpp:746
Value of: usage->has_disk_limit_bytes()
  Actual: false
Expected: true

Stack Trace:
/tmp/SRC/src/tests/disk_quota_tests.cpp:746
Value of: usage->has_disk_limit_bytes()
  Actual: false
Expected: true

FAILED:  MasterAuthorizationTest.SlaveRemovedDropped

Error Message:
/tmp/SRC/src/tests/master_authorization_tests.cpp:730
Mock function called more times than expected - returning default value.
    Function call: authorized(@0x7fd1453dc000 48-byte object <68-99 55-51 D1-7F 00-00 00-00 00-00 00-00 00-00 07-00 00-00 00-00 00-00 B0-7E 01-1C D1-7F 00-00 70-1C 01-1C D1-7F 00-00 02-00 00-00 D1-7F 00-00>)
          Returns: Abandoned
         Expected: to be called once
           Actual: called twice - over-saturated and active

Stack Trace:
/tmp/SRC/src/tests/master_authorization_tests.cpp:730
Mock function called more times than expected - returning default value.
    Function call: authorized(@0x7fd1453dc000 48-byte object <68-99 55-51 D1-7F 00-00 00-00 00-00 00-00 00-00 07-00 00-00 00-00 00-00 B0-7E 01-1C D1-7F 00-00 70-1C 01-1C D1-7F 00-00 02-00 00-00 D1-7F 00-00>)
          Returns: Abandoned
         Expected: to be called once
           Actual: called twice - over-saturated and active

FAILED:  MasterTest.CreateVolumesV1AuthorizationFailure

Error Message:
/tmp/SRC/src/tests/master_tests.cpp:10129
Mock function called more times than expected - returning default value.
    Function call: authorized(@0x7fbaec4ad108 48-byte object <C8-43 37-01 BB-7F 00-00 00-00 00-00 00-00 00-00 07-00 00-00 00-00 00-00 80-F9 01-A4 BA-7F 00-00 C0-04 02-A4 BA-7F 00-00 04-00 00-00 BA-7F 00-00>)
          Returns: Abandoned
         Expected: to be called once
           Actual: called twice - over-saturated and active

Stack Trace:
/tmp/SRC/src/tests/master_tests.cpp:10129
Mock function called more times than expected - returning default value.
    Function call: authorized(@0x7fbaec4ad108 48-byte object <C8-43 37-01 BB-7F 00-00 00-00 00-00 00-00 00-00 07-00 00-00 00-00 00-00 80-F9 01-A4 BA-7F 00-00 C0-04 02-A4 BA-7F 00-00 04-00 00-00 BA-7F 00-00>)
          Returns: Abandoned
         Expected: to be called once
           Actual: called twice - over-saturated and active

Branch: origin/master Mesos-Buildbot - Build # 6154 - Still Failing

Posted by Apache Jenkins Server <je...@builds.apache.org>.
Branch: origin/master

The Apache Jenkins build system has built Mesos-Buildbot (build #6154)

Status: Still Failing

Check console output at https://builds.apache.org/job/Mesos-Buildbot/6154/ to view the results.

All tests passed

Branch: origin/1.7.x Mesos-Buildbot - Build # 6153 - Still Failing

Posted by Apache Jenkins Server <je...@builds.apache.org>.
Branch: origin/1.7.x

The Apache Jenkins build system has built Mesos-Buildbot (build #6153)

Status: Still Failing

Check console output at https://builds.apache.org/job/Mesos-Buildbot/6153/ to view the results.

1 tests failed.
FAILED:  SlaveRecoveryTest/0.ReconcileKillTask

Error Message:
../../src/tests/slave_recovery_tests.cpp:3598
      Expected: TASK_KILLED
To be equal to: status->state()
      Which is: TASK_FAILED

Stack Trace:
../../src/tests/slave_recovery_tests.cpp:3598
      Expected: TASK_KILLED
To be equal to: status->state()
      Which is: TASK_FAILED

Branch: origin/master Mesos-Buildbot - Build # 6152 - Still Failing

Posted by Apache Jenkins Server <je...@builds.apache.org>.
Branch: origin/master

The Apache Jenkins build system has built Mesos-Buildbot (build #6152)

Status: Still Failing

Check console output at https://builds.apache.org/job/Mesos-Buildbot/6152/ to view the results.