You are viewing a plain text version of this content. The canonical link for it is here.
Posted to notifications@maven.apache.org by Apache Jenkins Server <je...@builds.apache.org> on 2022/06/21 22:24:58 UTC

Build unstable in Jenkins: Maven » Maven TLP » maven » PR-756 #5

See https://ci-maven.apache.org/job/Maven/job/maven-box/job/maven/job/PR-756/5/

Changes:

* force basedir as absolute path

12 tests failed.
FAILED:  org.apache.maven.it.MavenITmng4469AuthenticatedDeploymentToCustomRepoTest.linux-jdk17 / Run ITs Linux Java 17 / testit

Error Message:
Exit code was non-zero: 1; command line and log = 
/home/jenkins/jenkins-home/workspace/Maven_maven-box_maven_PR-756/test/core-it-suite/target/apache-maven/bin/mvn --global-settings /home/jenkins/jenkins-home/workspace/Maven_maven-box_maven_PR-756/test/core-it-suite/target/test-classes/settings.xml --settings settings.xml -e --batch-mode -Dmaven.repo.local=/home/jenkins/jenkins-home/workspace/Maven_maven-box_maven_PR-756/test/it-local-repo org.apache.maven.its.plugins:maven-it-plugin-artifact:2.1-SNAPSHOT:deploy-file
[INFO] [jenkins-event-spy] Jenkins Maven Event Spy is disabled
[INFO] Error stacktraces are turned on.
[INFO] Scanning for projects...
[INFO] 
[INFO] ------------------< org.apache.maven:standalone-pom >-------------------
[INFO] Building Maven Stub Project (No POM) 1
[INFO] ------------------------------------------------------------------------
[INFO] BUILD FAILURE
[INFO] ------------------------------------------------------------------------
[INFO] Total time:  0.018 s
[INFO] Finished at: 2022-06-21T22:00:42Z
[INFO] ------------------------------------------------------------------------
[ERROR] Cannot invoke "java.io.File.toPath()" because "rootBasedir" is null
java.lang.NullPointerException: Cannot invoke "java.io.File.toPath()" because "rootBasedir" is null
    at org.apache.maven.cli.event.ExecutionEventLogger.projectStarted (ExecutionEventLogger.java:341)
    at org.apache.maven.eventspy.internal.EventSpyExecutionListener.projectStarted (EventSpyExecutionListener.java:76)
    at org.apache.maven.lifecycle.internal.DefaultExecutionEventCatapult.fire (DefaultExecutionEventCatapult.java:71)
    at org.apache.maven.lifecycle.internal.DefaultExecutionEventCatapult.fire (DefaultExecutionEventCatapult.java:42)
    at org.apache.maven.lifecycle.internal.LifecycleModuleBuilder.buildProject (LifecycleModuleBuilder.java:108)
    at org.apache.maven.lifecycle.internal.LifecycleModuleBuilder.buildProject (LifecycleModuleBuilder.java:81)
    at org.apache.maven.lifecycle.internal.builder.singlethreaded.SingleThreadedBuilder.build (SingleThreadedBuilder.java:56)
    at org.apache.maven.lifecycle.internal.LifecycleStarter.execute (LifecycleStarter.java:128)
    at org.apache.maven.DefaultMaven.doExecute (DefaultMaven.java:296)
    at org.apache.maven.DefaultMaven.doExecute (DefaultMaven.java:192)
    at org.apache.maven.DefaultMaven.execute (DefaultMaven.java:105)
    at org.apache.maven.cli.MavenCli.execute (MavenCli.java:960)
    at org.apache.maven.cli.MavenCli.doMain (MavenCli.java:293)
    at org.apache.maven.cli.MavenCli.doMain (MavenCli.java:247)
    at jdk.internal.reflect.GeneratedMethodAccessor72.invoke (Unknown Source)
    at jdk.internal.reflect.DelegatingMethodAccessorImpl.invoke (DelegatingMethodAccessorImpl.java:43)
    at java.lang.reflect.Method.invoke (Method.java:568)
    at org.apache.maven.it.Embedded3xLauncher.run (Embedded3xLauncher.java:218)
    at org.apache.maven.it.Verifier.executeGoals (Verifier.java:1466)
    at org.apache.maven.it.Verifier.executeGoal (Verifier.java:1368)
    at org.apache.maven.it.Verifier.executeGoal (Verifier.java:1362)
    at org.apache.maven.it.MavenITmng4469AuthenticatedDeploymentToCustomRepoTest.testit (MavenITmng4469AuthenticatedDeploymentToCustomRepoTest.java:155)
    at jdk.internal.reflect.NativeMethodAccessorImpl.invoke0 (Native Method)
    at jdk.internal.reflect.NativeMethodAccessorImpl.invoke (NativeMethodAccessorImpl.java:77)
    at jdk.internal.reflect.DelegatingMethodAccessorImpl.invoke (DelegatingMethodAccessorImpl.java:43)
    at java.lang.reflect.Method.invoke (Method.java:568)
    at junit.framework.TestCase.runTest (TestCase.java:176)
    at org.apache.maven.it.AbstractMavenIntegrationTestCase.runTest (AbstractMavenIntegrationTestCase.java:260)
    at junit.framework.TestCase.runBare (TestCase.java:141)
    at junit.framework.TestResult$1.protect (TestResult.java:122)
    at junit.framework.TestResult.runProtected (TestResult.java:142)
    at junit.framework.TestResult.run (TestResult.java:125)
    at junit.framework.TestCase.run (TestCase.java:129)
    at junit.framework.TestSuite.runTest (TestSuite.java:252)
    at junit.framework.TestSuite.run (TestSuite.java:247)
    at junit.framework.TestSuite.runTest (TestSuite.java:252)
    at junit.framework.TestSuite.run (TestSuite.java:247)
    at org.junit.internal.runners.JUnit38ClassRunner.run (JUnit38ClassRunner.java:86)
    at org.apache.maven.surefire.junit4.JUnit4Provider.execute (JUnit4Provider.java:365)
    at org.apache.maven.surefire.junit4.JUnit4Provider.executeWithRerun (JUnit4Provider.java:273)
    at org.apache.maven.surefire.junit4.JUnit4Provider.executeTestSet (JUnit4Provider.java:238)
    at org.apache.maven.surefire.junit4.JUnit4Provider.invoke (JUnit4Provider.java:159)
    at org.apache.maven.surefire.booter.ForkedBooter.invokeProviderInSameClassLoader (ForkedBooter.java:383)
    at org.apache.maven.surefire.booter.ForkedBooter.runSuitesInProcess (ForkedBooter.java:344)
    at org.apache.maven.surefire.booter.ForkedBooter.execute (ForkedBooter.java:125)
    at org.apache.maven.surefire.booter.ForkedBooter.main (ForkedBooter.java:417)
[ERROR] 
[ERROR] Re-run Maven using the -X switch to enable full debug logging.


Stack Trace:
org.apache.maven.it.VerificationException: 
Exit code was non-zero: 1; command line and log = 
/home/jenkins/jenkins-home/workspace/Maven_maven-box_maven_PR-756/test/core-it-suite/target/apache-maven/bin/mvn --global-settings /home/jenkins/jenkins-home/workspace/Maven_maven-box_maven_PR-756/test/core-it-suite/target/test-classes/settings.xml --settings settings.xml -e --batch-mode -Dmaven.repo.local=/home/jenkins/jenkins-home/workspace/Maven_maven-box_maven_PR-756/test/it-local-repo org.apache.maven.its.plugins:maven-it-plugin-artifact:2.1-SNAPSHOT:deploy-file
[INFO] [jenkins-event-spy] Jenkins Maven Event Spy is disabled
[INFO] Error stacktraces are turned on.
[INFO] Scanning for projects...
[INFO] 
[INFO] ------------------< org.apache.maven:standalone-pom >-------------------
[INFO] Building Maven Stub Project (No POM) 1
[INFO] ------------------------------------------------------------------------
[INFO] BUILD FAILURE
[INFO] ------------------------------------------------------------------------
[INFO] Total time:  0.018 s
[INFO] Finished at: 2022-06-21T22:00:42Z
[INFO] ------------------------------------------------------------------------
[ERROR] Cannot invoke "java.io.File.toPath()" because "rootBasedir" is null
java.lang.NullPointerException: Cannot invoke "java.io.File.toPath()" because "rootBasedir" is null
    at org.apache.maven.cli.event.ExecutionEventLogger.projectStarted (ExecutionEventLogger.java:341)
    at org.apache.maven.eventspy.internal.EventSpyExecutionListener.projectStarted (EventSpyExecutionListener.java:76)
    at org.apache.maven.lifecycle.internal.DefaultExecutionEventCatapult.fire (DefaultExecutionEventCatapult.java:71)
    at org.apache.maven.lifecycle.internal.DefaultExecutionEventCatapult.fire (DefaultExecutionEventCatapult.java:42)
    at org.apache.maven.lifecycle.internal.LifecycleModuleBuilder.buildProject (LifecycleModuleBuilder.java:108)
    at org.apache.maven.lifecycle.internal.LifecycleModuleBuilder.buildProject (LifecycleModuleBuilder.java:81)
    at org.apache.maven.lifecycle.internal.builder.singlethreaded.SingleThreadedBuilder.build (SingleThreadedBuilder.java:56)
    at org.apache.maven.lifecycle.internal.LifecycleStarter.execute (LifecycleStarter.java:128)
    at org.apache.maven.DefaultMaven.doExecute (DefaultMaven.java:296)
    at org.apache.maven.DefaultMaven.doExecute (DefaultMaven.java:192)
    at org.apache.maven.DefaultMaven.execute (DefaultMaven.java:105)
    at org.apache.maven.cli.MavenCli.execute (MavenCli.java:960)
    at org.apache.maven.cli.MavenCli.doMain (MavenCli.java:293)
    at org.apache.maven.cli.MavenCli.doMain (MavenCli.java:247)
    at jdk.internal.reflect.GeneratedMethodAccessor72.invoke (Unknown Source)
    at jdk.internal.reflect.DelegatingMethodAccessorImpl.invoke (DelegatingMethodAccessorImpl.java:43)
    at java.lang.reflect.Method.invoke (Method.java:568)
    at org.apache.maven.it.Embedded3xLauncher.run (Embedded3xLauncher.java:218)
    at org.apache.maven.it.Verifier.executeGoals (Verifier.java:1466)
    at org.apache.maven.it.Verifier.executeGoal (Verifier.java:1368)
    at org.apache.maven.it.Verifier.executeGoal (Verifier.java:1362)
    at org.apache.maven.it.MavenITmng4469AuthenticatedDeploymentToCustomRepoTest.testit (MavenITmng4469AuthenticatedDeploymentToCustomRepoTest.java:155)
    at jdk.internal.reflect.NativeMethodAccessorImpl.invoke0 (Native Method)
    at jdk.internal.reflect.NativeMethodAccessorImpl.invoke (NativeMethodAccessorImpl.java:77)
    at jdk.internal.reflect.DelegatingMethodAccessorImpl.invoke (DelegatingMethodAccessorImpl.java:43)
    at java.lang.reflect.Method.invoke (Method.java:568)
    at junit.framework.TestCase.runTest (TestCase.java:176)
    at org.apache.maven.it.AbstractMavenIntegrationTestCase.runTest (AbstractMavenIntegrationTestCase.java:260)
    at junit.framework.TestCase.runBare (TestCase.java:141)
    at junit.framework.TestResult$1.protect (TestResult.java:122)
    at junit.framework.TestResult.runProtected (TestResult.java:142)
    at junit.framework.TestResult.run (TestResult.java:125)
    at junit.framework.TestCase.run (TestCase.java:129)
    at junit.framework.TestSuite.runTest (TestSuite.java:252)
    at junit.framework.TestSuite.run (TestSuite.java:247)
    at junit.framework.TestSuite.runTest (TestSuite.java:252)
    at junit.framework.TestSuite.run (TestSuite.java:247)
    at org.junit.internal.runners.JUnit38ClassRunner.run (JUnit38ClassRunner.java:86)
    at org.apache.maven.surefire.junit4.JUnit4Provider.execute (JUnit4Provider.java:365)
    at org.apache.maven.surefire.junit4.JUnit4Provider.executeWithRerun (JUnit4Provider.java:273)
    at org.apache.maven.surefire.junit4.JUnit4Provider.executeTestSet (JUnit4Provider.java:238)
    at org.apache.maven.surefire.junit4.JUnit4Provider.invoke (JUnit4Provider.java:159)
    at org.apache.maven.surefire.booter.ForkedBooter.invokeProviderInSameClassLoader (ForkedBooter.java:383)
    at org.apache.maven.surefire.booter.ForkedBooter.runSuitesInProcess (ForkedBooter.java:344)
    at org.apache.maven.surefire.booter.ForkedBooter.execute (ForkedBooter.java:125)
    at org.apache.maven.surefire.booter.ForkedBooter.main (ForkedBooter.java:417)
[ERROR] 
[ERROR] Re-run Maven using the -X switch to enable full debug logging.

	at org.apache.maven.it.MavenITmng4469AuthenticatedDeploymentToCustomRepoTest.testit(MavenITmng4469AuthenticatedDeploymentToCustomRepoTest.java:155)


FAILED:  org.apache.maven.it.MavenITmng3099SettingsProfilesWithNoPomTest.linux-jdk17 / Run ITs Linux Java 17 / testit

Error Message:
Exit code was non-zero: 1; command line and log = 
/home/jenkins/jenkins-home/workspace/Maven_maven-box_maven_PR-756/test/core-it-suite/target/apache-maven/bin/mvn --global-settings /home/jenkins/jenkins-home/workspace/Maven_maven-box_maven_PR-756/test/core-it-suite/target/test-classes/settings.xml -s settings.xml -e --batch-mode -Dmaven.repo.local=/home/jenkins/jenkins-home/workspace/Maven_maven-box_maven_PR-756/test/it-local-repo org.apache.maven.its.mng3099:maven-mng3099-plugin:0.1:touch
[INFO] [jenkins-event-spy] Jenkins Maven Event Spy is disabled
[INFO] Error stacktraces are turned on.
[INFO] Scanning for projects...
[INFO] Downloading from central: file:target/null/org/apache/maven/its/mng3099/maven-mng3099-plugin/0.1/maven-mng3099-plugin-0.1.pom
[INFO] Downloading from maven-core-it: file:///home/jenkins/jenkins-home/workspace/Maven_maven-box_maven_PR-756/test/core-it-suite/target/test-classes/mng-3099/repo/org/apache/maven/its/mng3099/maven-mng3099-plugin/0.1/maven-mng3099-plugin-0.1.pom
[INFO] Downloaded from maven-core-it: file:///home/jenkins/jenkins-home/workspace/Maven_maven-box_maven_PR-756/test/core-it-suite/target/test-classes/mng-3099/repo/org/apache/maven/its/mng3099/maven-mng3099-plugin/0.1/maven-mng3099-plugin-0.1.pom (2.1 kB at 2.1 MB/s)
[INFO] Downloading from central: file:target/null/org/apache/maven/its/mng3099/maven-mng3099-plugin/0.1/maven-mng3099-plugin-0.1.jar
[INFO] Downloading from maven-core-it: file:///home/jenkins/jenkins-home/workspace/Maven_maven-box_maven_PR-756/test/core-it-suite/target/test-classes/mng-3099/repo/org/apache/maven/its/mng3099/maven-mng3099-plugin/0.1/maven-mng3099-plugin-0.1.jar
[INFO] Downloaded from maven-core-it: file:///home/jenkins/jenkins-home/workspace/Maven_maven-box_maven_PR-756/test/core-it-suite/target/test-classes/mng-3099/repo/org/apache/maven/its/mng3099/maven-mng3099-plugin/0.1/maven-mng3099-plugin-0.1.jar (7.9 kB)
[INFO] 
[INFO] ------------------< org.apache.maven:standalone-pom >-------------------
[INFO] Building Maven Stub Project (No POM) 1
[INFO] ------------------------------------------------------------------------
[INFO] BUILD FAILURE
[INFO] ------------------------------------------------------------------------
[INFO] Total time:  0.006 s
[INFO] Finished at: 2022-06-21T22:01:41Z
[INFO] ------------------------------------------------------------------------
[ERROR] Cannot invoke "java.io.File.toPath()" because "rootBasedir" is null
java.lang.NullPointerException: Cannot invoke "java.io.File.toPath()" because "rootBasedir" is null
    at org.apache.maven.cli.event.ExecutionEventLogger.projectStarted (ExecutionEventLogger.java:341)
    at org.apache.maven.eventspy.internal.EventSpyExecutionListener.projectStarted (EventSpyExecutionListener.java:76)
    at org.apache.maven.lifecycle.internal.DefaultExecutionEventCatapult.fire (DefaultExecutionEventCatapult.java:71)
    at org.apache.maven.lifecycle.internal.DefaultExecutionEventCatapult.fire (DefaultExecutionEventCatapult.java:42)
    at org.apache.maven.lifecycle.internal.LifecycleModuleBuilder.buildProject (LifecycleModuleBuilder.java:108)
    at org.apache.maven.lifecycle.internal.LifecycleModuleBuilder.buildProject (LifecycleModuleBuilder.java:81)
    at org.apache.maven.lifecycle.internal.builder.singlethreaded.SingleThreadedBuilder.build (SingleThreadedBuilder.java:56)
    at org.apache.maven.lifecycle.internal.LifecycleStarter.execute (LifecycleStarter.java:128)
    at org.apache.maven.DefaultMaven.doExecute (DefaultMaven.java:296)
    at org.apache.maven.DefaultMaven.doExecute (DefaultMaven.java:192)
    at org.apache.maven.DefaultMaven.execute (DefaultMaven.java:105)
    at org.apache.maven.cli.MavenCli.execute (MavenCli.java:960)
    at org.apache.maven.cli.MavenCli.doMain (MavenCli.java:293)
    at org.apache.maven.cli.MavenCli.doMain (MavenCli.java:247)
    at jdk.internal.reflect.GeneratedMethodAccessor72.invoke (Unknown Source)
    at jdk.internal.reflect.DelegatingMethodAccessorImpl.invoke (DelegatingMethodAccessorImpl.java:43)
    at java.lang.reflect.Method.invoke (Method.java:568)
    at org.apache.maven.it.Embedded3xLauncher.run (Embedded3xLauncher.java:218)
    at org.apache.maven.it.Verifier.executeGoals (Verifier.java:1466)
    at org.apache.maven.it.Verifier.executeGoal (Verifier.java:1368)
    at org.apache.maven.it.Verifier.executeGoal (Verifier.java:1362)
    at org.apache.maven.it.MavenITmng3099SettingsProfilesWithNoPomTest.testit (MavenITmng3099SettingsProfilesWithNoPomTest.java:59)
    at jdk.internal.reflect.NativeMethodAccessorImpl.invoke0 (Native Method)
    at jdk.internal.reflect.NativeMethodAccessorImpl.invoke (NativeMethodAccessorImpl.java:77)
    at jdk.internal.reflect.DelegatingMethodAccessorImpl.invoke (DelegatingMethodAccessorImpl.java:43)
    at java.lang.reflect.Method.invoke (Method.java:568)
    at junit.framework.TestCase.runTest (TestCase.java:176)
    at org.apache.maven.it.AbstractMavenIntegrationTestCase.runTest (AbstractMavenIntegrationTestCase.java:260)
    at junit.framework.TestCase.runBare (TestCase.java:141)
    at junit.framework.TestResult$1.protect (TestResult.java:122)
    at junit.framework.TestResult.runProtected (TestResult.java:142)
    at junit.framework.TestResult.run (TestResult.java:125)
    at junit.framework.TestCase.run (TestCase.java:129)
    at junit.framework.TestSuite.runTest (TestSuite.java:252)
    at junit.framework.TestSuite.run (TestSuite.java:247)
    at junit.framework.TestSuite.runTest (TestSuite.java:252)
    at junit.framework.TestSuite.run (TestSuite.java:247)
    at org.junit.internal.runners.JUnit38ClassRunner.run (JUnit38ClassRunner.java:86)
    at org.apache.maven.surefire.junit4.JUnit4Provider.execute (JUnit4Provider.java:365)
    at org.apache.maven.surefire.junit4.JUnit4Provider.executeWithRerun (JUnit4Provider.java:273)
    at org.apache.maven.surefire.junit4.JUnit4Provider.executeTestSet (JUnit4Provider.java:238)
    at org.apache.maven.surefire.junit4.JUnit4Provider.invoke (JUnit4Provider.java:159)
    at org.apache.maven.surefire.booter.ForkedBooter.invokeProviderInSameClassLoader (ForkedBooter.java:383)
    at org.apache.maven.surefire.booter.ForkedBooter.runSuitesInProcess (ForkedBooter.java:344)
    at org.apache.maven.surefire.booter.ForkedBooter.execute (ForkedBooter.java:125)
    at org.apache.maven.surefire.booter.ForkedBooter.main (ForkedBooter.java:417)
[ERROR] 
[ERROR] Re-run Maven using the -X switch to enable full debug logging.


Stack Trace:
org.apache.maven.it.VerificationException: 
Exit code was non-zero: 1; command line and log = 
/home/jenkins/jenkins-home/workspace/Maven_maven-box_maven_PR-756/test/core-it-suite/target/apache-maven/bin/mvn --global-settings /home/jenkins/jenkins-home/workspace/Maven_maven-box_maven_PR-756/test/core-it-suite/target/test-classes/settings.xml -s settings.xml -e --batch-mode -Dmaven.repo.local=/home/jenkins/jenkins-home/workspace/Maven_maven-box_maven_PR-756/test/it-local-repo org.apache.maven.its.mng3099:maven-mng3099-plugin:0.1:touch
[INFO] [jenkins-event-spy] Jenkins Maven Event Spy is disabled
[INFO] Error stacktraces are turned on.
[INFO] Scanning for projects...
[INFO] Downloading from central: file:target/null/org/apache/maven/its/mng3099/maven-mng3099-plugin/0.1/maven-mng3099-plugin-0.1.pom
[INFO] Downloading from maven-core-it: file:///home/jenkins/jenkins-home/workspace/Maven_maven-box_maven_PR-756/test/core-it-suite/target/test-classes/mng-3099/repo/org/apache/maven/its/mng3099/maven-mng3099-plugin/0.1/maven-mng3099-plugin-0.1.pom
[INFO] Downloaded from maven-core-it: file:///home/jenkins/jenkins-home/workspace/Maven_maven-box_maven_PR-756/test/core-it-suite/target/test-classes/mng-3099/repo/org/apache/maven/its/mng3099/maven-mng3099-plugin/0.1/maven-mng3099-plugin-0.1.pom (2.1 kB at 2.1 MB/s)
[INFO] Downloading from central: file:target/null/org/apache/maven/its/mng3099/maven-mng3099-plugin/0.1/maven-mng3099-plugin-0.1.jar
[INFO] Downloading from maven-core-it: file:///home/jenkins/jenkins-home/workspace/Maven_maven-box_maven_PR-756/test/core-it-suite/target/test-classes/mng-3099/repo/org/apache/maven/its/mng3099/maven-mng3099-plugin/0.1/maven-mng3099-plugin-0.1.jar
[INFO] Downloaded from maven-core-it: file:///home/jenkins/jenkins-home/workspace/Maven_maven-box_maven_PR-756/test/core-it-suite/target/test-classes/mng-3099/repo/org/apache/maven/its/mng3099/maven-mng3099-plugin/0.1/maven-mng3099-plugin-0.1.jar (7.9 kB)
[INFO] 
[INFO] ------------------< org.apache.maven:standalone-pom >-------------------
[INFO] Building Maven Stub Project (No POM) 1
[INFO] ------------------------------------------------------------------------
[INFO] BUILD FAILURE
[INFO] ------------------------------------------------------------------------
[INFO] Total time:  0.006 s
[INFO] Finished at: 2022-06-21T22:01:41Z
[INFO] ------------------------------------------------------------------------
[ERROR] Cannot invoke "java.io.File.toPath()" because "rootBasedir" is null
java.lang.NullPointerException: Cannot invoke "java.io.File.toPath()" because "rootBasedir" is null
    at org.apache.maven.cli.event.ExecutionEventLogger.projectStarted (ExecutionEventLogger.java:341)
    at org.apache.maven.eventspy.internal.EventSpyExecutionListener.projectStarted (EventSpyExecutionListener.java:76)
    at org.apache.maven.lifecycle.internal.DefaultExecutionEventCatapult.fire (DefaultExecutionEventCatapult.java:71)
    at org.apache.maven.lifecycle.internal.DefaultExecutionEventCatapult.fire (DefaultExecutionEventCatapult.java:42)
    at org.apache.maven.lifecycle.internal.LifecycleModuleBuilder.buildProject (LifecycleModuleBuilder.java:108)
    at org.apache.maven.lifecycle.internal.LifecycleModuleBuilder.buildProject (LifecycleModuleBuilder.java:81)
    at org.apache.maven.lifecycle.internal.builder.singlethreaded.SingleThreadedBuilder.build (SingleThreadedBuilder.java:56)
    at org.apache.maven.lifecycle.internal.LifecycleStarter.execute (LifecycleStarter.java:128)
    at org.apache.maven.DefaultMaven.doExecute (DefaultMaven.java:296)
    at org.apache.maven.DefaultMaven.doExecute (DefaultMaven.java:192)
    at org.apache.maven.DefaultMaven.execute (DefaultMaven.java:105)
    at org.apache.maven.cli.MavenCli.execute (MavenCli.java:960)
    at org.apache.maven.cli.MavenCli.doMain (MavenCli.java:293)
    at org.apache.maven.cli.MavenCli.doMain (MavenCli.java:247)
    at jdk.internal.reflect.GeneratedMethodAccessor72.invoke (Unknown Source)
    at jdk.internal.reflect.DelegatingMethodAccessorImpl.invoke (DelegatingMethodAccessorImpl.java:43)
    at java.lang.reflect.Method.invoke (Method.java:568)
    at org.apache.maven.it.Embedded3xLauncher.run (Embedded3xLauncher.java:218)
    at org.apache.maven.it.Verifier.executeGoals (Verifier.java:1466)
    at org.apache.maven.it.Verifier.executeGoal (Verifier.java:1368)
    at org.apache.maven.it.Verifier.executeGoal (Verifier.java:1362)
    at org.apache.maven.it.MavenITmng3099SettingsProfilesWithNoPomTest.testit (MavenITmng3099SettingsProfilesWithNoPomTest.java:59)
    at jdk.internal.reflect.NativeMethodAccessorImpl.invoke0 (Native Method)
    at jdk.internal.reflect.NativeMethodAccessorImpl.invoke (NativeMethodAccessorImpl.java:77)
    at jdk.internal.reflect.DelegatingMethodAccessorImpl.invoke (DelegatingMethodAccessorImpl.java:43)
    at java.lang.reflect.Method.invoke (Method.java:568)
    at junit.framework.TestCase.runTest (TestCase.java:176)
    at org.apache.maven.it.AbstractMavenIntegrationTestCase.runTest (AbstractMavenIntegrationTestCase.java:260)
    at junit.framework.TestCase.runBare (TestCase.java:141)
    at junit.framework.TestResult$1.protect (TestResult.java:122)
    at junit.framework.TestResult.runProtected (TestResult.java:142)
    at junit.framework.TestResult.run (TestResult.java:125)
    at junit.framework.TestCase.run (TestCase.java:129)
    at junit.framework.TestSuite.runTest (TestSuite.java:252)
    at junit.framework.TestSuite.run (TestSuite.java:247)
    at junit.framework.TestSuite.runTest (TestSuite.java:252)
    at junit.framework.TestSuite.run (TestSuite.java:247)
    at org.junit.internal.runners.JUnit38ClassRunner.run (JUnit38ClassRunner.java:86)
    at org.apache.maven.surefire.junit4.JUnit4Provider.execute (JUnit4Provider.java:365)
    at org.apache.maven.surefire.junit4.JUnit4Provider.executeWithRerun (JUnit4Provider.java:273)
    at org.apache.maven.surefire.junit4.JUnit4Provider.executeTestSet (JUnit4Provider.java:238)
    at org.apache.maven.surefire.junit4.JUnit4Provider.invoke (JUnit4Provider.java:159)
    at org.apache.maven.surefire.booter.ForkedBooter.invokeProviderInSameClassLoader (ForkedBooter.java:383)
    at org.apache.maven.surefire.booter.ForkedBooter.runSuitesInProcess (ForkedBooter.java:344)
    at org.apache.maven.surefire.booter.ForkedBooter.execute (ForkedBooter.java:125)
    at org.apache.maven.surefire.booter.ForkedBooter.main (ForkedBooter.java:417)
[ERROR] 
[ERROR] Re-run Maven using the -X switch to enable full debug logging.

	at org.apache.maven.it.MavenITmng3099SettingsProfilesWithNoPomTest.testit(MavenITmng3099SettingsProfilesWithNoPomTest.java:59)


FAILED:  org.apache.maven.it.MavenITmng4469AuthenticatedDeploymentToCustomRepoTest.linux-jdk8 / Run ITs Linux Java 8 / testit

Error Message:
Exit code was non-zero: 1; command line and log = 
/home/jenkins/jenkins-home/workspace/Maven_maven-box_maven_PR-756/test/core-it-suite/target/apache-maven/bin/mvn --global-settings /home/jenkins/jenkins-home/workspace/Maven_maven-box_maven_PR-756/test/core-it-suite/target/test-classes/settings.xml --settings settings.xml -e --batch-mode -Dmaven.repo.local=/home/jenkins/jenkins-home/workspace/Maven_maven-box_maven_PR-756/test/it-local-repo org.apache.maven.its.plugins:maven-it-plugin-artifact:2.1-SNAPSHOT:deploy-file
[INFO] [jenkins-event-spy] Jenkins Maven Event Spy is disabled
[INFO] Error stacktraces are turned on.
[INFO] Scanning for projects...
[INFO] 
[INFO] ------------------< org.apache.maven:standalone-pom >-------------------
[INFO] Building Maven Stub Project (No POM) 1
[INFO] ------------------------------------------------------------------------
[INFO] BUILD FAILURE
[INFO] ------------------------------------------------------------------------
[INFO] Total time:  0.011 s
[INFO] Finished at: 2022-06-21T22:01:16Z
[INFO] ------------------------------------------------------------------------
[ERROR] NullPointerException
java.lang.NullPointerException
    at org.apache.maven.cli.event.ExecutionEventLogger.projectStarted (ExecutionEventLogger.java:341)
    at org.apache.maven.eventspy.internal.EventSpyExecutionListener.projectStarted (EventSpyExecutionListener.java:76)
    at org.apache.maven.lifecycle.internal.DefaultExecutionEventCatapult.fire (DefaultExecutionEventCatapult.java:71)
    at org.apache.maven.lifecycle.internal.DefaultExecutionEventCatapult.fire (DefaultExecutionEventCatapult.java:42)
    at org.apache.maven.lifecycle.internal.LifecycleModuleBuilder.buildProject (LifecycleModuleBuilder.java:108)
    at org.apache.maven.lifecycle.internal.LifecycleModuleBuilder.buildProject (LifecycleModuleBuilder.java:81)
    at org.apache.maven.lifecycle.internal.builder.singlethreaded.SingleThreadedBuilder.build (SingleThreadedBuilder.java:56)
    at org.apache.maven.lifecycle.internal.LifecycleStarter.execute (LifecycleStarter.java:128)
    at org.apache.maven.DefaultMaven.doExecute (DefaultMaven.java:296)
    at org.apache.maven.DefaultMaven.doExecute (DefaultMaven.java:192)
    at org.apache.maven.DefaultMaven.execute (DefaultMaven.java:105)
    at org.apache.maven.cli.MavenCli.execute (MavenCli.java:960)
    at org.apache.maven.cli.MavenCli.doMain (MavenCli.java:293)
    at org.apache.maven.cli.MavenCli.doMain (MavenCli.java:247)
    at sun.reflect.GeneratedMethodAccessor67.invoke (Unknown Source)
    at sun.reflect.DelegatingMethodAccessorImpl.invoke (DelegatingMethodAccessorImpl.java:43)
    at java.lang.reflect.Method.invoke (Method.java:498)
    at org.apache.maven.it.Embedded3xLauncher.run (Embedded3xLauncher.java:218)
    at org.apache.maven.it.Verifier.executeGoals (Verifier.java:1466)
    at org.apache.maven.it.Verifier.executeGoal (Verifier.java:1368)
    at org.apache.maven.it.Verifier.executeGoal (Verifier.java:1362)
    at org.apache.maven.it.MavenITmng4469AuthenticatedDeploymentToCustomRepoTest.testit (MavenITmng4469AuthenticatedDeploymentToCustomRepoTest.java:155)
    at sun.reflect.NativeMethodAccessorImpl.invoke0 (Native Method)
    at sun.reflect.NativeMethodAccessorImpl.invoke (NativeMethodAccessorImpl.java:62)
    at sun.reflect.DelegatingMethodAccessorImpl.invoke (DelegatingMethodAccessorImpl.java:43)
    at java.lang.reflect.Method.invoke (Method.java:498)
    at junit.framework.TestCase.runTest (TestCase.java:176)
    at org.apache.maven.it.AbstractMavenIntegrationTestCase.runTest (AbstractMavenIntegrationTestCase.java:260)
    at junit.framework.TestCase.runBare (TestCase.java:141)
    at junit.framework.TestResult$1.protect (TestResult.java:122)
    at junit.framework.TestResult.runProtected (TestResult.java:142)
    at junit.framework.TestResult.run (TestResult.java:125)
    at junit.framework.TestCase.run (TestCase.java:129)
    at junit.framework.TestSuite.runTest (TestSuite.java:252)
    at junit.framework.TestSuite.run (TestSuite.java:247)
    at junit.framework.TestSuite.runTest (TestSuite.java:252)
    at junit.framework.TestSuite.run (TestSuite.java:247)
    at org.junit.internal.runners.JUnit38ClassRunner.run (JUnit38ClassRunner.java:86)
    at org.apache.maven.surefire.junit4.JUnit4Provider.execute (JUnit4Provider.java:365)
    at org.apache.maven.surefire.junit4.JUnit4Provider.executeWithRerun (JUnit4Provider.java:273)
    at org.apache.maven.surefire.junit4.JUnit4Provider.executeTestSet (JUnit4Provider.java:238)
    at org.apache.maven.surefire.junit4.JUnit4Provider.invoke (JUnit4Provider.java:159)
    at org.apache.maven.surefire.booter.ForkedBooter.invokeProviderInSameClassLoader (ForkedBooter.java:383)
    at org.apache.maven.surefire.booter.ForkedBooter.runSuitesInProcess (ForkedBooter.java:344)
    at org.apache.maven.surefire.booter.ForkedBooter.execute (ForkedBooter.java:125)
    at org.apache.maven.surefire.booter.ForkedBooter.main (ForkedBooter.java:417)
[ERROR] 
[ERROR] Re-run Maven using the -X switch to enable full debug logging.


Stack Trace:
org.apache.maven.it.VerificationException: 
Exit code was non-zero: 1; command line and log = 
/home/jenkins/jenkins-home/workspace/Maven_maven-box_maven_PR-756/test/core-it-suite/target/apache-maven/bin/mvn --global-settings /home/jenkins/jenkins-home/workspace/Maven_maven-box_maven_PR-756/test/core-it-suite/target/test-classes/settings.xml --settings settings.xml -e --batch-mode -Dmaven.repo.local=/home/jenkins/jenkins-home/workspace/Maven_maven-box_maven_PR-756/test/it-local-repo org.apache.maven.its.plugins:maven-it-plugin-artifact:2.1-SNAPSHOT:deploy-file
[INFO] [jenkins-event-spy] Jenkins Maven Event Spy is disabled
[INFO] Error stacktraces are turned on.
[INFO] Scanning for projects...
[INFO] 
[INFO] ------------------< org.apache.maven:standalone-pom >-------------------
[INFO] Building Maven Stub Project (No POM) 1
[INFO] ------------------------------------------------------------------------
[INFO] BUILD FAILURE
[INFO] ------------------------------------------------------------------------
[INFO] Total time:  0.011 s
[INFO] Finished at: 2022-06-21T22:01:16Z
[INFO] ------------------------------------------------------------------------
[ERROR] NullPointerException
java.lang.NullPointerException
    at org.apache.maven.cli.event.ExecutionEventLogger.projectStarted (ExecutionEventLogger.java:341)
    at org.apache.maven.eventspy.internal.EventSpyExecutionListener.projectStarted (EventSpyExecutionListener.java:76)
    at org.apache.maven.lifecycle.internal.DefaultExecutionEventCatapult.fire (DefaultExecutionEventCatapult.java:71)
    at org.apache.maven.lifecycle.internal.DefaultExecutionEventCatapult.fire (DefaultExecutionEventCatapult.java:42)
    at org.apache.maven.lifecycle.internal.LifecycleModuleBuilder.buildProject (LifecycleModuleBuilder.java:108)
    at org.apache.maven.lifecycle.internal.LifecycleModuleBuilder.buildProject (LifecycleModuleBuilder.java:81)
    at org.apache.maven.lifecycle.internal.builder.singlethreaded.SingleThreadedBuilder.build (SingleThreadedBuilder.java:56)
    at org.apache.maven.lifecycle.internal.LifecycleStarter.execute (LifecycleStarter.java:128)
    at org.apache.maven.DefaultMaven.doExecute (DefaultMaven.java:296)
    at org.apache.maven.DefaultMaven.doExecute (DefaultMaven.java:192)
    at org.apache.maven.DefaultMaven.execute (DefaultMaven.java:105)
    at org.apache.maven.cli.MavenCli.execute (MavenCli.java:960)
    at org.apache.maven.cli.MavenCli.doMain (MavenCli.java:293)
    at org.apache.maven.cli.MavenCli.doMain (MavenCli.java:247)
    at sun.reflect.GeneratedMethodAccessor67.invoke (Unknown Source)
    at sun.reflect.DelegatingMethodAccessorImpl.invoke (DelegatingMethodAccessorImpl.java:43)
    at java.lang.reflect.Method.invoke (Method.java:498)
    at org.apache.maven.it.Embedded3xLauncher.run (Embedded3xLauncher.java:218)
    at org.apache.maven.it.Verifier.executeGoals (Verifier.java:1466)
    at org.apache.maven.it.Verifier.executeGoal (Verifier.java:1368)
    at org.apache.maven.it.Verifier.executeGoal (Verifier.java:1362)
    at org.apache.maven.it.MavenITmng4469AuthenticatedDeploymentToCustomRepoTest.testit (MavenITmng4469AuthenticatedDeploymentToCustomRepoTest.java:155)
    at sun.reflect.NativeMethodAccessorImpl.invoke0 (Native Method)
    at sun.reflect.NativeMethodAccessorImpl.invoke (NativeMethodAccessorImpl.java:62)
    at sun.reflect.DelegatingMethodAccessorImpl.invoke (DelegatingMethodAccessorImpl.java:43)
    at java.lang.reflect.Method.invoke (Method.java:498)
    at junit.framework.TestCase.runTest (TestCase.java:176)
    at org.apache.maven.it.AbstractMavenIntegrationTestCase.runTest (AbstractMavenIntegrationTestCase.java:260)
    at junit.framework.TestCase.runBare (TestCase.java:141)
    at junit.framework.TestResult$1.protect (TestResult.java:122)
    at junit.framework.TestResult.runProtected (TestResult.java:142)
    at junit.framework.TestResult.run (TestResult.java:125)
    at junit.framework.TestCase.run (TestCase.java:129)
    at junit.framework.TestSuite.runTest (TestSuite.java:252)
    at junit.framework.TestSuite.run (TestSuite.java:247)
    at junit.framework.TestSuite.runTest (TestSuite.java:252)
    at junit.framework.TestSuite.run (TestSuite.java:247)
    at org.junit.internal.runners.JUnit38ClassRunner.run (JUnit38ClassRunner.java:86)
    at org.apache.maven.surefire.junit4.JUnit4Provider.execute (JUnit4Provider.java:365)
    at org.apache.maven.surefire.junit4.JUnit4Provider.executeWithRerun (JUnit4Provider.java:273)
    at org.apache.maven.surefire.junit4.JUnit4Provider.executeTestSet (JUnit4Provider.java:238)
    at org.apache.maven.surefire.junit4.JUnit4Provider.invoke (JUnit4Provider.java:159)
    at org.apache.maven.surefire.booter.ForkedBooter.invokeProviderInSameClassLoader (ForkedBooter.java:383)
    at org.apache.maven.surefire.booter.ForkedBooter.runSuitesInProcess (ForkedBooter.java:344)
    at org.apache.maven.surefire.booter.ForkedBooter.execute (ForkedBooter.java:125)
    at org.apache.maven.surefire.booter.ForkedBooter.main (ForkedBooter.java:417)
[ERROR] 
[ERROR] Re-run Maven using the -X switch to enable full debug logging.

	at org.apache.maven.it.MavenITmng4469AuthenticatedDeploymentToCustomRepoTest.testit(MavenITmng4469AuthenticatedDeploymentToCustomRepoTest.java:155)


FAILED:  org.apache.maven.it.MavenITmng3099SettingsProfilesWithNoPomTest.linux-jdk8 / Run ITs Linux Java 8 / testit

Error Message:
Exit code was non-zero: 1; command line and log = 
/home/jenkins/jenkins-home/workspace/Maven_maven-box_maven_PR-756/test/core-it-suite/target/apache-maven/bin/mvn --global-settings /home/jenkins/jenkins-home/workspace/Maven_maven-box_maven_PR-756/test/core-it-suite/target/test-classes/settings.xml -s settings.xml -e --batch-mode -Dmaven.repo.local=/home/jenkins/jenkins-home/workspace/Maven_maven-box_maven_PR-756/test/it-local-repo org.apache.maven.its.mng3099:maven-mng3099-plugin:0.1:touch
[INFO] [jenkins-event-spy] Jenkins Maven Event Spy is disabled
[INFO] Error stacktraces are turned on.
[INFO] Scanning for projects...
[INFO] Downloading from central: file:target/null/org/apache/maven/its/mng3099/maven-mng3099-plugin/0.1/maven-mng3099-plugin-0.1.pom
[INFO] Downloading from maven-core-it: file:///home/jenkins/jenkins-home/workspace/Maven_maven-box_maven_PR-756/test/core-it-suite/target/test-classes/mng-3099/repo/org/apache/maven/its/mng3099/maven-mng3099-plugin/0.1/maven-mng3099-plugin-0.1.pom
[INFO] Downloaded from maven-core-it: file:///home/jenkins/jenkins-home/workspace/Maven_maven-box_maven_PR-756/test/core-it-suite/target/test-classes/mng-3099/repo/org/apache/maven/its/mng3099/maven-mng3099-plugin/0.1/maven-mng3099-plugin-0.1.pom (2.1 kB)
[INFO] Downloading from central: file:target/null/org/apache/maven/its/mng3099/maven-mng3099-plugin/0.1/maven-mng3099-plugin-0.1.jar
[INFO] Downloading from maven-core-it: file:///home/jenkins/jenkins-home/workspace/Maven_maven-box_maven_PR-756/test/core-it-suite/target/test-classes/mng-3099/repo/org/apache/maven/its/mng3099/maven-mng3099-plugin/0.1/maven-mng3099-plugin-0.1.jar
[INFO] Downloaded from maven-core-it: file:///home/jenkins/jenkins-home/workspace/Maven_maven-box_maven_PR-756/test/core-it-suite/target/test-classes/mng-3099/repo/org/apache/maven/its/mng3099/maven-mng3099-plugin/0.1/maven-mng3099-plugin-0.1.jar (7.9 kB at 7.9 MB/s)
[INFO] 
[INFO] ------------------< org.apache.maven:standalone-pom >-------------------
[INFO] Building Maven Stub Project (No POM) 1
[INFO] ------------------------------------------------------------------------
[INFO] BUILD FAILURE
[INFO] ------------------------------------------------------------------------
[INFO] Total time:  0.008 s
[INFO] Finished at: 2022-06-21T22:02:33Z
[INFO] ------------------------------------------------------------------------
[ERROR] NullPointerException
java.lang.NullPointerException
    at org.apache.maven.cli.event.ExecutionEventLogger.projectStarted (ExecutionEventLogger.java:341)
    at org.apache.maven.eventspy.internal.EventSpyExecutionListener.projectStarted (EventSpyExecutionListener.java:76)
    at org.apache.maven.lifecycle.internal.DefaultExecutionEventCatapult.fire (DefaultExecutionEventCatapult.java:71)
    at org.apache.maven.lifecycle.internal.DefaultExecutionEventCatapult.fire (DefaultExecutionEventCatapult.java:42)
    at org.apache.maven.lifecycle.internal.LifecycleModuleBuilder.buildProject (LifecycleModuleBuilder.java:108)
    at org.apache.maven.lifecycle.internal.LifecycleModuleBuilder.buildProject (LifecycleModuleBuilder.java:81)
    at org.apache.maven.lifecycle.internal.builder.singlethreaded.SingleThreadedBuilder.build (SingleThreadedBuilder.java:56)
    at org.apache.maven.lifecycle.internal.LifecycleStarter.execute (LifecycleStarter.java:128)
    at org.apache.maven.DefaultMaven.doExecute (DefaultMaven.java:296)
    at org.apache.maven.DefaultMaven.doExecute (DefaultMaven.java:192)
    at org.apache.maven.DefaultMaven.execute (DefaultMaven.java:105)
    at org.apache.maven.cli.MavenCli.execute (MavenCli.java:960)
    at org.apache.maven.cli.MavenCli.doMain (MavenCli.java:293)
    at org.apache.maven.cli.MavenCli.doMain (MavenCli.java:247)
    at sun.reflect.GeneratedMethodAccessor67.invoke (Unknown Source)
    at sun.reflect.DelegatingMethodAccessorImpl.invoke (DelegatingMethodAccessorImpl.java:43)
    at java.lang.reflect.Method.invoke (Method.java:498)
    at org.apache.maven.it.Embedded3xLauncher.run (Embedded3xLauncher.java:218)
    at org.apache.maven.it.Verifier.executeGoals (Verifier.java:1466)
    at org.apache.maven.it.Verifier.executeGoal (Verifier.java:1368)
    at org.apache.maven.it.Verifier.executeGoal (Verifier.java:1362)
    at org.apache.maven.it.MavenITmng3099SettingsProfilesWithNoPomTest.testit (MavenITmng3099SettingsProfilesWithNoPomTest.java:59)
    at sun.reflect.NativeMethodAccessorImpl.invoke0 (Native Method)
    at sun.reflect.NativeMethodAccessorImpl.invoke (NativeMethodAccessorImpl.java:62)
    at sun.reflect.DelegatingMethodAccessorImpl.invoke (DelegatingMethodAccessorImpl.java:43)
    at java.lang.reflect.Method.invoke (Method.java:498)
    at junit.framework.TestCase.runTest (TestCase.java:176)
    at org.apache.maven.it.AbstractMavenIntegrationTestCase.runTest (AbstractMavenIntegrationTestCase.java:260)
    at junit.framework.TestCase.runBare (TestCase.java:141)
    at junit.framework.TestResult$1.protect (TestResult.java:122)
    at junit.framework.TestResult.runProtected (TestResult.java:142)
    at junit.framework.TestResult.run (TestResult.java:125)
    at junit.framework.TestCase.run (TestCase.java:129)
    at junit.framework.TestSuite.runTest (TestSuite.java:252)
    at junit.framework.TestSuite.run (TestSuite.java:247)
    at junit.framework.TestSuite.runTest (TestSuite.java:252)
    at junit.framework.TestSuite.run (TestSuite.java:247)
    at org.junit.internal.runners.JUnit38ClassRunner.run (JUnit38ClassRunner.java:86)
    at org.apache.maven.surefire.junit4.JUnit4Provider.execute (JUnit4Provider.java:365)
    at org.apache.maven.surefire.junit4.JUnit4Provider.executeWithRerun (JUnit4Provider.java:273)
    at org.apache.maven.surefire.junit4.JUnit4Provider.executeTestSet (JUnit4Provider.java:238)
    at org.apache.maven.surefire.junit4.JUnit4Provider.invoke (JUnit4Provider.java:159)
    at org.apache.maven.surefire.booter.ForkedBooter.invokeProviderInSameClassLoader (ForkedBooter.java:383)
    at org.apache.maven.surefire.booter.ForkedBooter.runSuitesInProcess (ForkedBooter.java:344)
    at org.apache.maven.surefire.booter.ForkedBooter.execute (ForkedBooter.java:125)
    at org.apache.maven.surefire.booter.ForkedBooter.main (ForkedBooter.java:417)
[ERROR] 
[ERROR] Re-run Maven using the -X switch to enable full debug logging.


Stack Trace:
org.apache.maven.it.VerificationException: 
Exit code was non-zero: 1; command line and log = 
/home/jenkins/jenkins-home/workspace/Maven_maven-box_maven_PR-756/test/core-it-suite/target/apache-maven/bin/mvn --global-settings /home/jenkins/jenkins-home/workspace/Maven_maven-box_maven_PR-756/test/core-it-suite/target/test-classes/settings.xml -s settings.xml -e --batch-mode -Dmaven.repo.local=/home/jenkins/jenkins-home/workspace/Maven_maven-box_maven_PR-756/test/it-local-repo org.apache.maven.its.mng3099:maven-mng3099-plugin:0.1:touch
[INFO] [jenkins-event-spy] Jenkins Maven Event Spy is disabled
[INFO] Error stacktraces are turned on.
[INFO] Scanning for projects...
[INFO] Downloading from central: file:target/null/org/apache/maven/its/mng3099/maven-mng3099-plugin/0.1/maven-mng3099-plugin-0.1.pom
[INFO] Downloading from maven-core-it: file:///home/jenkins/jenkins-home/workspace/Maven_maven-box_maven_PR-756/test/core-it-suite/target/test-classes/mng-3099/repo/org/apache/maven/its/mng3099/maven-mng3099-plugin/0.1/maven-mng3099-plugin-0.1.pom
[INFO] Downloaded from maven-core-it: file:///home/jenkins/jenkins-home/workspace/Maven_maven-box_maven_PR-756/test/core-it-suite/target/test-classes/mng-3099/repo/org/apache/maven/its/mng3099/maven-mng3099-plugin/0.1/maven-mng3099-plugin-0.1.pom (2.1 kB)
[INFO] Downloading from central: file:target/null/org/apache/maven/its/mng3099/maven-mng3099-plugin/0.1/maven-mng3099-plugin-0.1.jar
[INFO] Downloading from maven-core-it: file:///home/jenkins/jenkins-home/workspace/Maven_maven-box_maven_PR-756/test/core-it-suite/target/test-classes/mng-3099/repo/org/apache/maven/its/mng3099/maven-mng3099-plugin/0.1/maven-mng3099-plugin-0.1.jar
[INFO] Downloaded from maven-core-it: file:///home/jenkins/jenkins-home/workspace/Maven_maven-box_maven_PR-756/test/core-it-suite/target/test-classes/mng-3099/repo/org/apache/maven/its/mng3099/maven-mng3099-plugin/0.1/maven-mng3099-plugin-0.1.jar (7.9 kB at 7.9 MB/s)
[INFO] 
[INFO] ------------------< org.apache.maven:standalone-pom >-------------------
[INFO] Building Maven Stub Project (No POM) 1
[INFO] ------------------------------------------------------------------------
[INFO] BUILD FAILURE
[INFO] ------------------------------------------------------------------------
[INFO] Total time:  0.008 s
[INFO] Finished at: 2022-06-21T22:02:33Z
[INFO] ------------------------------------------------------------------------
[ERROR] NullPointerException
java.lang.NullPointerException
    at org.apache.maven.cli.event.ExecutionEventLogger.projectStarted (ExecutionEventLogger.java:341)
    at org.apache.maven.eventspy.internal.EventSpyExecutionListener.projectStarted (EventSpyExecutionListener.java:76)
    at org.apache.maven.lifecycle.internal.DefaultExecutionEventCatapult.fire (DefaultExecutionEventCatapult.java:71)
    at org.apache.maven.lifecycle.internal.DefaultExecutionEventCatapult.fire (DefaultExecutionEventCatapult.java:42)
    at org.apache.maven.lifecycle.internal.LifecycleModuleBuilder.buildProject (LifecycleModuleBuilder.java:108)
    at org.apache.maven.lifecycle.internal.LifecycleModuleBuilder.buildProject (LifecycleModuleBuilder.java:81)
    at org.apache.maven.lifecycle.internal.builder.singlethreaded.SingleThreadedBuilder.build (SingleThreadedBuilder.java:56)
    at org.apache.maven.lifecycle.internal.LifecycleStarter.execute (LifecycleStarter.java:128)
    at org.apache.maven.DefaultMaven.doExecute (DefaultMaven.java:296)
    at org.apache.maven.DefaultMaven.doExecute (DefaultMaven.java:192)
    at org.apache.maven.DefaultMaven.execute (DefaultMaven.java:105)
    at org.apache.maven.cli.MavenCli.execute (MavenCli.java:960)
    at org.apache.maven.cli.MavenCli.doMain (MavenCli.java:293)
    at org.apache.maven.cli.MavenCli.doMain (MavenCli.java:247)
    at sun.reflect.GeneratedMethodAccessor67.invoke (Unknown Source)
    at sun.reflect.DelegatingMethodAccessorImpl.invoke (DelegatingMethodAccessorImpl.java:43)
    at java.lang.reflect.Method.invoke (Method.java:498)
    at org.apache.maven.it.Embedded3xLauncher.run (Embedded3xLauncher.java:218)
    at org.apache.maven.it.Verifier.executeGoals (Verifier.java:1466)
    at org.apache.maven.it.Verifier.executeGoal (Verifier.java:1368)
    at org.apache.maven.it.Verifier.executeGoal (Verifier.java:1362)
    at org.apache.maven.it.MavenITmng3099SettingsProfilesWithNoPomTest.testit (MavenITmng3099SettingsProfilesWithNoPomTest.java:59)
    at sun.reflect.NativeMethodAccessorImpl.invoke0 (Native Method)
    at sun.reflect.NativeMethodAccessorImpl.invoke (NativeMethodAccessorImpl.java:62)
    at sun.reflect.DelegatingMethodAccessorImpl.invoke (DelegatingMethodAccessorImpl.java:43)
    at java.lang.reflect.Method.invoke (Method.java:498)
    at junit.framework.TestCase.runTest (TestCase.java:176)
    at org.apache.maven.it.AbstractMavenIntegrationTestCase.runTest (AbstractMavenIntegrationTestCase.java:260)
    at junit.framework.TestCase.runBare (TestCase.java:141)
    at junit.framework.TestResult$1.protect (TestResult.java:122)
    at junit.framework.TestResult.runProtected (TestResult.java:142)
    at junit.framework.TestResult.run (TestResult.java:125)
    at junit.framework.TestCase.run (TestCase.java:129)
    at junit.framework.TestSuite.runTest (TestSuite.java:252)
    at junit.framework.TestSuite.run (TestSuite.java:247)
    at junit.framework.TestSuite.runTest (TestSuite.java:252)
    at junit.framework.TestSuite.run (TestSuite.java:247)
    at org.junit.internal.runners.JUnit38ClassRunner.run (JUnit38ClassRunner.java:86)
    at org.apache.maven.surefire.junit4.JUnit4Provider.execute (JUnit4Provider.java:365)
    at org.apache.maven.surefire.junit4.JUnit4Provider.executeWithRerun (JUnit4Provider.java:273)
    at org.apache.maven.surefire.junit4.JUnit4Provider.executeTestSet (JUnit4Provider.java:238)
    at org.apache.maven.surefire.junit4.JUnit4Provider.invoke (JUnit4Provider.java:159)
    at org.apache.maven.surefire.booter.ForkedBooter.invokeProviderInSameClassLoader (ForkedBooter.java:383)
    at org.apache.maven.surefire.booter.ForkedBooter.runSuitesInProcess (ForkedBooter.java:344)
    at org.apache.maven.surefire.booter.ForkedBooter.execute (ForkedBooter.java:125)
    at org.apache.maven.surefire.booter.ForkedBooter.main (ForkedBooter.java:417)
[ERROR] 
[ERROR] Re-run Maven using the -X switch to enable full debug logging.

	at org.apache.maven.it.MavenITmng3099SettingsProfilesWithNoPomTest.testit(MavenITmng3099SettingsProfilesWithNoPomTest.java:59)


FAILED:  org.apache.maven.it.MavenITmng4469AuthenticatedDeploymentToCustomRepoTest.linux-jdk11 / Run ITs Linux Java 11 / testit

Error Message:
Exit code was non-zero: 1; command line and log = 
/home/jenkins/jenkins-home/workspace/Maven_maven-box_maven_PR-756/test/core-it-suite/target/apache-maven/bin/mvn --global-settings /home/jenkins/jenkins-home/workspace/Maven_maven-box_maven_PR-756/test/core-it-suite/target/test-classes/settings.xml --settings settings.xml -e --batch-mode -Dmaven.repo.local=/home/jenkins/jenkins-home/workspace/Maven_maven-box_maven_PR-756/test/it-local-repo org.apache.maven.its.plugins:maven-it-plugin-artifact:2.1-SNAPSHOT:deploy-file
[INFO] [jenkins-event-spy] Jenkins Maven Event Spy is disabled
[INFO] Error stacktraces are turned on.
[INFO] Scanning for projects...
[INFO] 
[INFO] ------------------< org.apache.maven:standalone-pom >-------------------
[INFO] Building Maven Stub Project (No POM) 1
[INFO] ------------------------------------------------------------------------
[INFO] BUILD FAILURE
[INFO] ------------------------------------------------------------------------
[INFO] Total time:  0.012 s
[INFO] Finished at: 2022-06-21T22:01:57Z
[INFO] ------------------------------------------------------------------------
[ERROR] NullPointerException
java.lang.NullPointerException
    at org.apache.maven.cli.event.ExecutionEventLogger.projectStarted (ExecutionEventLogger.java:341)
    at org.apache.maven.eventspy.internal.EventSpyExecutionListener.projectStarted (EventSpyExecutionListener.java:76)
    at org.apache.maven.lifecycle.internal.DefaultExecutionEventCatapult.fire (DefaultExecutionEventCatapult.java:71)
    at org.apache.maven.lifecycle.internal.DefaultExecutionEventCatapult.fire (DefaultExecutionEventCatapult.java:42)
    at org.apache.maven.lifecycle.internal.LifecycleModuleBuilder.buildProject (LifecycleModuleBuilder.java:108)
    at org.apache.maven.lifecycle.internal.LifecycleModuleBuilder.buildProject (LifecycleModuleBuilder.java:81)
    at org.apache.maven.lifecycle.internal.builder.singlethreaded.SingleThreadedBuilder.build (SingleThreadedBuilder.java:56)
    at org.apache.maven.lifecycle.internal.LifecycleStarter.execute (LifecycleStarter.java:128)
    at org.apache.maven.DefaultMaven.doExecute (DefaultMaven.java:296)
    at org.apache.maven.DefaultMaven.doExecute (DefaultMaven.java:192)
    at org.apache.maven.DefaultMaven.execute (DefaultMaven.java:105)
    at org.apache.maven.cli.MavenCli.execute (MavenCli.java:960)
    at org.apache.maven.cli.MavenCli.doMain (MavenCli.java:293)
    at org.apache.maven.cli.MavenCli.doMain (MavenCli.java:247)
    at jdk.internal.reflect.GeneratedMethodAccessor72.invoke (Unknown Source)
    at jdk.internal.reflect.DelegatingMethodAccessorImpl.invoke (DelegatingMethodAccessorImpl.java:43)
    at java.lang.reflect.Method.invoke (Method.java:566)
    at org.apache.maven.it.Embedded3xLauncher.run (Embedded3xLauncher.java:218)
    at org.apache.maven.it.Verifier.executeGoals (Verifier.java:1466)
    at org.apache.maven.it.Verifier.executeGoal (Verifier.java:1368)
    at org.apache.maven.it.Verifier.executeGoal (Verifier.java:1362)
    at org.apache.maven.it.MavenITmng4469AuthenticatedDeploymentToCustomRepoTest.testit (MavenITmng4469AuthenticatedDeploymentToCustomRepoTest.java:155)
    at jdk.internal.reflect.NativeMethodAccessorImpl.invoke0 (Native Method)
    at jdk.internal.reflect.NativeMethodAccessorImpl.invoke (NativeMethodAccessorImpl.java:62)
    at jdk.internal.reflect.DelegatingMethodAccessorImpl.invoke (DelegatingMethodAccessorImpl.java:43)
    at java.lang.reflect.Method.invoke (Method.java:566)
    at junit.framework.TestCase.runTest (TestCase.java:176)
    at org.apache.maven.it.AbstractMavenIntegrationTestCase.runTest (AbstractMavenIntegrationTestCase.java:260)
    at junit.framework.TestCase.runBare (TestCase.java:141)
    at junit.framework.TestResult$1.protect (TestResult.java:122)
    at junit.framework.TestResult.runProtected (TestResult.java:142)
    at junit.framework.TestResult.run (TestResult.java:125)
    at junit.framework.TestCase.run (TestCase.java:129)
    at junit.framework.TestSuite.runTest (TestSuite.java:252)
    at junit.framework.TestSuite.run (TestSuite.java:247)
    at junit.framework.TestSuite.runTest (TestSuite.java:252)
    at junit.framework.TestSuite.run (TestSuite.java:247)
    at org.junit.internal.runners.JUnit38ClassRunner.run (JUnit38ClassRunner.java:86)
    at org.apache.maven.surefire.junit4.JUnit4Provider.execute (JUnit4Provider.java:365)
    at org.apache.maven.surefire.junit4.JUnit4Provider.executeWithRerun (JUnit4Provider.java:273)
    at org.apache.maven.surefire.junit4.JUnit4Provider.executeTestSet (JUnit4Provider.java:238)
    at org.apache.maven.surefire.junit4.JUnit4Provider.invoke (JUnit4Provider.java:159)
    at org.apache.maven.surefire.booter.ForkedBooter.invokeProviderInSameClassLoader (ForkedBooter.java:383)
    at org.apache.maven.surefire.booter.ForkedBooter.runSuitesInProcess (ForkedBooter.java:344)
    at org.apache.maven.surefire.booter.ForkedBooter.execute (ForkedBooter.java:125)
    at org.apache.maven.surefire.booter.ForkedBooter.main (ForkedBooter.java:417)
[ERROR] 
[ERROR] Re-run Maven using the -X switch to enable full debug logging.


Stack Trace:
org.apache.maven.it.VerificationException: 
Exit code was non-zero: 1; command line and log = 
/home/jenkins/jenkins-home/workspace/Maven_maven-box_maven_PR-756/test/core-it-suite/target/apache-maven/bin/mvn --global-settings /home/jenkins/jenkins-home/workspace/Maven_maven-box_maven_PR-756/test/core-it-suite/target/test-classes/settings.xml --settings settings.xml -e --batch-mode -Dmaven.repo.local=/home/jenkins/jenkins-home/workspace/Maven_maven-box_maven_PR-756/test/it-local-repo org.apache.maven.its.plugins:maven-it-plugin-artifact:2.1-SNAPSHOT:deploy-file
[INFO] [jenkins-event-spy] Jenkins Maven Event Spy is disabled
[INFO] Error stacktraces are turned on.
[INFO] Scanning for projects...
[INFO] 
[INFO] ------------------< org.apache.maven:standalone-pom >-------------------
[INFO] Building Maven Stub Project (No POM) 1
[INFO] ------------------------------------------------------------------------
[INFO] BUILD FAILURE
[INFO] ------------------------------------------------------------------------
[INFO] Total time:  0.012 s
[INFO] Finished at: 2022-06-21T22:01:57Z
[INFO] ------------------------------------------------------------------------
[ERROR] NullPointerException
java.lang.NullPointerException
    at org.apache.maven.cli.event.ExecutionEventLogger.projectStarted (ExecutionEventLogger.java:341)
    at org.apache.maven.eventspy.internal.EventSpyExecutionListener.projectStarted (EventSpyExecutionListener.java:76)
    at org.apache.maven.lifecycle.internal.DefaultExecutionEventCatapult.fire (DefaultExecutionEventCatapult.java:71)
    at org.apache.maven.lifecycle.internal.DefaultExecutionEventCatapult.fire (DefaultExecutionEventCatapult.java:42)
    at org.apache.maven.lifecycle.internal.LifecycleModuleBuilder.buildProject (LifecycleModuleBuilder.java:108)
    at org.apache.maven.lifecycle.internal.LifecycleModuleBuilder.buildProject (LifecycleModuleBuilder.java:81)
    at org.apache.maven.lifecycle.internal.builder.singlethreaded.SingleThreadedBuilder.build (SingleThreadedBuilder.java:56)
    at org.apache.maven.lifecycle.internal.LifecycleStarter.execute (LifecycleStarter.java:128)
    at org.apache.maven.DefaultMaven.doExecute (DefaultMaven.java:296)
    at org.apache.maven.DefaultMaven.doExecute (DefaultMaven.java:192)
    at org.apache.maven.DefaultMaven.execute (DefaultMaven.java:105)
    at org.apache.maven.cli.MavenCli.execute (MavenCli.java:960)
    at org.apache.maven.cli.MavenCli.doMain (MavenCli.java:293)
    at org.apache.maven.cli.MavenCli.doMain (MavenCli.java:247)
    at jdk.internal.reflect.GeneratedMethodAccessor72.invoke (Unknown Source)
    at jdk.internal.reflect.DelegatingMethodAccessorImpl.invoke (DelegatingMethodAccessorImpl.java:43)
    at java.lang.reflect.Method.invoke (Method.java:566)
    at org.apache.maven.it.Embedded3xLauncher.run (Embedded3xLauncher.java:218)
    at org.apache.maven.it.Verifier.executeGoals (Verifier.java:1466)
    at org.apache.maven.it.Verifier.executeGoal (Verifier.java:1368)
    at org.apache.maven.it.Verifier.executeGoal (Verifier.java:1362)
    at org.apache.maven.it.MavenITmng4469AuthenticatedDeploymentToCustomRepoTest.testit (MavenITmng4469AuthenticatedDeploymentToCustomRepoTest.java:155)
    at jdk.internal.reflect.NativeMethodAccessorImpl.invoke0 (Native Method)
    at jdk.internal.reflect.NativeMethodAccessorImpl.invoke (NativeMethodAccessorImpl.java:62)
    at jdk.internal.reflect.DelegatingMethodAccessorImpl.invoke (DelegatingMethodAccessorImpl.java:43)
    at java.lang.reflect.Method.invoke (Method.java:566)
    at junit.framework.TestCase.runTest (TestCase.java:176)
    at org.apache.maven.it.AbstractMavenIntegrationTestCase.runTest (AbstractMavenIntegrationTestCase.java:260)
    at junit.framework.TestCase.runBare (TestCase.java:141)
    at junit.framework.TestResult$1.protect (TestResult.java:122)
    at junit.framework.TestResult.runProtected (TestResult.java:142)
    at junit.framework.TestResult.run (TestResult.java:125)
    at junit.framework.TestCase.run (TestCase.java:129)
    at junit.framework.TestSuite.runTest (TestSuite.java:252)
    at junit.framework.TestSuite.run (TestSuite.java:247)
    at junit.framework.TestSuite.runTest (TestSuite.java:252)
    at junit.framework.TestSuite.run (TestSuite.java:247)
    at org.junit.internal.runners.JUnit38ClassRunner.run (JUnit38ClassRunner.java:86)
    at org.apache.maven.surefire.junit4.JUnit4Provider.execute (JUnit4Provider.java:365)
    at org.apache.maven.surefire.junit4.JUnit4Provider.executeWithRerun (JUnit4Provider.java:273)
    at org.apache.maven.surefire.junit4.JUnit4Provider.executeTestSet (JUnit4Provider.java:238)
    at org.apache.maven.surefire.junit4.JUnit4Provider.invoke (JUnit4Provider.java:159)
    at org.apache.maven.surefire.booter.ForkedBooter.invokeProviderInSameClassLoader (ForkedBooter.java:383)
    at org.apache.maven.surefire.booter.ForkedBooter.runSuitesInProcess (ForkedBooter.java:344)
    at org.apache.maven.surefire.booter.ForkedBooter.execute (ForkedBooter.java:125)
    at org.apache.maven.surefire.booter.ForkedBooter.main (ForkedBooter.java:417)
[ERROR] 
[ERROR] Re-run Maven using the -X switch to enable full debug logging.

	at org.apache.maven.it.MavenITmng4469AuthenticatedDeploymentToCustomRepoTest.testit(MavenITmng4469AuthenticatedDeploymentToCustomRepoTest.java:155)


FAILED:  org.apache.maven.it.MavenITmng3099SettingsProfilesWithNoPomTest.linux-jdk11 / Run ITs Linux Java 11 / testit

Error Message:
Exit code was non-zero: 1; command line and log = 
/home/jenkins/jenkins-home/workspace/Maven_maven-box_maven_PR-756/test/core-it-suite/target/apache-maven/bin/mvn --global-settings /home/jenkins/jenkins-home/workspace/Maven_maven-box_maven_PR-756/test/core-it-suite/target/test-classes/settings.xml -s settings.xml -e --batch-mode -Dmaven.repo.local=/home/jenkins/jenkins-home/workspace/Maven_maven-box_maven_PR-756/test/it-local-repo org.apache.maven.its.mng3099:maven-mng3099-plugin:0.1:touch
[INFO] [jenkins-event-spy] Jenkins Maven Event Spy is disabled
[INFO] Error stacktraces are turned on.
[INFO] Scanning for projects...
[INFO] Downloading from central: file:target/null/org/apache/maven/its/mng3099/maven-mng3099-plugin/0.1/maven-mng3099-plugin-0.1.pom
[INFO] Downloading from maven-core-it: file:///home/jenkins/jenkins-home/workspace/Maven_maven-box_maven_PR-756/test/core-it-suite/target/test-classes/mng-3099/repo/org/apache/maven/its/mng3099/maven-mng3099-plugin/0.1/maven-mng3099-plugin-0.1.pom
[INFO] Downloaded from maven-core-it: file:///home/jenkins/jenkins-home/workspace/Maven_maven-box_maven_PR-756/test/core-it-suite/target/test-classes/mng-3099/repo/org/apache/maven/its/mng3099/maven-mng3099-plugin/0.1/maven-mng3099-plugin-0.1.pom (2.1 kB)
[INFO] Downloading from central: file:target/null/org/apache/maven/its/mng3099/maven-mng3099-plugin/0.1/maven-mng3099-plugin-0.1.jar
[INFO] Downloading from maven-core-it: file:///home/jenkins/jenkins-home/workspace/Maven_maven-box_maven_PR-756/test/core-it-suite/target/test-classes/mng-3099/repo/org/apache/maven/its/mng3099/maven-mng3099-plugin/0.1/maven-mng3099-plugin-0.1.jar
[INFO] Downloaded from maven-core-it: file:///home/jenkins/jenkins-home/workspace/Maven_maven-box_maven_PR-756/test/core-it-suite/target/test-classes/mng-3099/repo/org/apache/maven/its/mng3099/maven-mng3099-plugin/0.1/maven-mng3099-plugin-0.1.jar (7.9 kB)
[INFO] 
[INFO] ------------------< org.apache.maven:standalone-pom >-------------------
[INFO] Building Maven Stub Project (No POM) 1
[INFO] ------------------------------------------------------------------------
[INFO] BUILD FAILURE
[INFO] ------------------------------------------------------------------------
[INFO] Total time:  0.008 s
[INFO] Finished at: 2022-06-21T22:03:23Z
[INFO] ------------------------------------------------------------------------
[ERROR] NullPointerException
java.lang.NullPointerException
    at org.apache.maven.cli.event.ExecutionEventLogger.projectStarted (ExecutionEventLogger.java:341)
    at org.apache.maven.eventspy.internal.EventSpyExecutionListener.projectStarted (EventSpyExecutionListener.java:76)
    at org.apache.maven.lifecycle.internal.DefaultExecutionEventCatapult.fire (DefaultExecutionEventCatapult.java:71)
    at org.apache.maven.lifecycle.internal.DefaultExecutionEventCatapult.fire (DefaultExecutionEventCatapult.java:42)
    at org.apache.maven.lifecycle.internal.LifecycleModuleBuilder.buildProject (LifecycleModuleBuilder.java:108)
    at org.apache.maven.lifecycle.internal.LifecycleModuleBuilder.buildProject (LifecycleModuleBuilder.java:81)
    at org.apache.maven.lifecycle.internal.builder.singlethreaded.SingleThreadedBuilder.build (SingleThreadedBuilder.java:56)
    at org.apache.maven.lifecycle.internal.LifecycleStarter.execute (LifecycleStarter.java:128)
    at org.apache.maven.DefaultMaven.doExecute (DefaultMaven.java:296)
    at org.apache.maven.DefaultMaven.doExecute (DefaultMaven.java:192)
    at org.apache.maven.DefaultMaven.execute (DefaultMaven.java:105)
    at org.apache.maven.cli.MavenCli.execute (MavenCli.java:960)
    at org.apache.maven.cli.MavenCli.doMain (MavenCli.java:293)
    at org.apache.maven.cli.MavenCli.doMain (MavenCli.java:247)
    at jdk.internal.reflect.GeneratedMethodAccessor72.invoke (Unknown Source)
    at jdk.internal.reflect.DelegatingMethodAccessorImpl.invoke (DelegatingMethodAccessorImpl.java:43)
    at java.lang.reflect.Method.invoke (Method.java:566)
    at org.apache.maven.it.Embedded3xLauncher.run (Embedded3xLauncher.java:218)
    at org.apache.maven.it.Verifier.executeGoals (Verifier.java:1466)
    at org.apache.maven.it.Verifier.executeGoal (Verifier.java:1368)
    at org.apache.maven.it.Verifier.executeGoal (Verifier.java:1362)
    at org.apache.maven.it.MavenITmng3099SettingsProfilesWithNoPomTest.testit (MavenITmng3099SettingsProfilesWithNoPomTest.java:59)
    at jdk.internal.reflect.NativeMethodAccessorImpl.invoke0 (Native Method)
    at jdk.internal.reflect.NativeMethodAccessorImpl.invoke (NativeMethodAccessorImpl.java:62)
    at jdk.internal.reflect.DelegatingMethodAccessorImpl.invoke (DelegatingMethodAccessorImpl.java:43)
    at java.lang.reflect.Method.invoke (Method.java:566)
    at junit.framework.TestCase.runTest (TestCase.java:176)
    at org.apache.maven.it.AbstractMavenIntegrationTestCase.runTest (AbstractMavenIntegrationTestCase.java:260)
    at junit.framework.TestCase.runBare (TestCase.java:141)
    at junit.framework.TestResult$1.protect (TestResult.java:122)
    at junit.framework.TestResult.runProtected (TestResult.java:142)
    at junit.framework.TestResult.run (TestResult.java:125)
    at junit.framework.TestCase.run (TestCase.java:129)
    at junit.framework.TestSuite.runTest (TestSuite.java:252)
    at junit.framework.TestSuite.run (TestSuite.java:247)
    at junit.framework.TestSuite.runTest (TestSuite.java:252)
    at junit.framework.TestSuite.run (TestSuite.java:247)
    at org.junit.internal.runners.JUnit38ClassRunner.run (JUnit38ClassRunner.java:86)
    at org.apache.maven.surefire.junit4.JUnit4Provider.execute (JUnit4Provider.java:365)
    at org.apache.maven.surefire.junit4.JUnit4Provider.executeWithRerun (JUnit4Provider.java:273)
    at org.apache.maven.surefire.junit4.JUnit4Provider.executeTestSet (JUnit4Provider.java:238)
    at org.apache.maven.surefire.junit4.JUnit4Provider.invoke (JUnit4Provider.java:159)
    at org.apache.maven.surefire.booter.ForkedBooter.invokeProviderInSameClassLoader (ForkedBooter.java:383)
    at org.apache.maven.surefire.booter.ForkedBooter.runSuitesInProcess (ForkedBooter.java:344)
    at org.apache.maven.surefire.booter.ForkedBooter.execute (ForkedBooter.java:125)
    at org.apache.maven.surefire.booter.ForkedBooter.main (ForkedBooter.java:417)
[ERROR] 
[ERROR] Re-run Maven using the -X switch to enable full debug logging.


Stack Trace:
org.apache.maven.it.VerificationException: 
Exit code was non-zero: 1; command line and log = 
/home/jenkins/jenkins-home/workspace/Maven_maven-box_maven_PR-756/test/core-it-suite/target/apache-maven/bin/mvn --global-settings /home/jenkins/jenkins-home/workspace/Maven_maven-box_maven_PR-756/test/core-it-suite/target/test-classes/settings.xml -s settings.xml -e --batch-mode -Dmaven.repo.local=/home/jenkins/jenkins-home/workspace/Maven_maven-box_maven_PR-756/test/it-local-repo org.apache.maven.its.mng3099:maven-mng3099-plugin:0.1:touch
[INFO] [jenkins-event-spy] Jenkins Maven Event Spy is disabled
[INFO] Error stacktraces are turned on.
[INFO] Scanning for projects...
[INFO] Downloading from central: file:target/null/org/apache/maven/its/mng3099/maven-mng3099-plugin/0.1/maven-mng3099-plugin-0.1.pom
[INFO] Downloading from maven-core-it: file:///home/jenkins/jenkins-home/workspace/Maven_maven-box_maven_PR-756/test/core-it-suite/target/test-classes/mng-3099/repo/org/apache/maven/its/mng3099/maven-mng3099-plugin/0.1/maven-mng3099-plugin-0.1.pom
[INFO] Downloaded from maven-core-it: file:///home/jenkins/jenkins-home/workspace/Maven_maven-box_maven_PR-756/test/core-it-suite/target/test-classes/mng-3099/repo/org/apache/maven/its/mng3099/maven-mng3099-plugin/0.1/maven-mng3099-plugin-0.1.pom (2.1 kB)
[INFO] Downloading from central: file:target/null/org/apache/maven/its/mng3099/maven-mng3099-plugin/0.1/maven-mng3099-plugin-0.1.jar
[INFO] Downloading from maven-core-it: file:///home/jenkins/jenkins-home/workspace/Maven_maven-box_maven_PR-756/test/core-it-suite/target/test-classes/mng-3099/repo/org/apache/maven/its/mng3099/maven-mng3099-plugin/0.1/maven-mng3099-plugin-0.1.jar
[INFO] Downloaded from maven-core-it: file:///home/jenkins/jenkins-home/workspace/Maven_maven-box_maven_PR-756/test/core-it-suite/target/test-classes/mng-3099/repo/org/apache/maven/its/mng3099/maven-mng3099-plugin/0.1/maven-mng3099-plugin-0.1.jar (7.9 kB)
[INFO] 
[INFO] ------------------< org.apache.maven:standalone-pom >-------------------
[INFO] Building Maven Stub Project (No POM) 1
[INFO] ------------------------------------------------------------------------
[INFO] BUILD FAILURE
[INFO] ------------------------------------------------------------------------
[INFO] Total time:  0.008 s
[INFO] Finished at: 2022-06-21T22:03:23Z
[INFO] ------------------------------------------------------------------------
[ERROR] NullPointerException
java.lang.NullPointerException
    at org.apache.maven.cli.event.ExecutionEventLogger.projectStarted (ExecutionEventLogger.java:341)
    at org.apache.maven.eventspy.internal.EventSpyExecutionListener.projectStarted (EventSpyExecutionListener.java:76)
    at org.apache.maven.lifecycle.internal.DefaultExecutionEventCatapult.fire (DefaultExecutionEventCatapult.java:71)
    at org.apache.maven.lifecycle.internal.DefaultExecutionEventCatapult.fire (DefaultExecutionEventCatapult.java:42)
    at org.apache.maven.lifecycle.internal.LifecycleModuleBuilder.buildProject (LifecycleModuleBuilder.java:108)
    at org.apache.maven.lifecycle.internal.LifecycleModuleBuilder.buildProject (LifecycleModuleBuilder.java:81)
    at org.apache.maven.lifecycle.internal.builder.singlethreaded.SingleThreadedBuilder.build (SingleThreadedBuilder.java:56)
    at org.apache.maven.lifecycle.internal.LifecycleStarter.execute (LifecycleStarter.java:128)
    at org.apache.maven.DefaultMaven.doExecute (DefaultMaven.java:296)
    at org.apache.maven.DefaultMaven.doExecute (DefaultMaven.java:192)
    at org.apache.maven.DefaultMaven.execute (DefaultMaven.java:105)
    at org.apache.maven.cli.MavenCli.execute (MavenCli.java:960)
    at org.apache.maven.cli.MavenCli.doMain (MavenCli.java:293)
    at org.apache.maven.cli.MavenCli.doMain (MavenCli.java:247)
    at jdk.internal.reflect.GeneratedMethodAccessor72.invoke (Unknown Source)
    at jdk.internal.reflect.DelegatingMethodAccessorImpl.invoke (DelegatingMethodAccessorImpl.java:43)
    at java.lang.reflect.Method.invoke (Method.java:566)
    at org.apache.maven.it.Embedded3xLauncher.run (Embedded3xLauncher.java:218)
    at org.apache.maven.it.Verifier.executeGoals (Verifier.java:1466)
    at org.apache.maven.it.Verifier.executeGoal (Verifier.java:1368)
    at org.apache.maven.it.Verifier.executeGoal (Verifier.java:1362)
    at org.apache.maven.it.MavenITmng3099SettingsProfilesWithNoPomTest.testit (MavenITmng3099SettingsProfilesWithNoPomTest.java:59)
    at jdk.internal.reflect.NativeMethodAccessorImpl.invoke0 (Native Method)
    at jdk.internal.reflect.NativeMethodAccessorImpl.invoke (NativeMethodAccessorImpl.java:62)
    at jdk.internal.reflect.DelegatingMethodAccessorImpl.invoke (DelegatingMethodAccessorImpl.java:43)
    at java.lang.reflect.Method.invoke (Method.java:566)
    at junit.framework.TestCase.runTest (TestCase.java:176)
    at org.apache.maven.it.AbstractMavenIntegrationTestCase.runTest (AbstractMavenIntegrationTestCase.java:260)
    at junit.framework.TestCase.runBare (TestCase.java:141)
    at junit.framework.TestResult$1.protect (TestResult.java:122)
    at junit.framework.TestResult.runProtected (TestResult.java:142)
    at junit.framework.TestResult.run (TestResult.java:125)
    at junit.framework.TestCase.run (TestCase.java:129)
    at junit.framework.TestSuite.runTest (TestSuite.java:252)
    at junit.framework.TestSuite.run (TestSuite.java:247)
    at junit.framework.TestSuite.runTest (TestSuite.java:252)
    at junit.framework.TestSuite.run (TestSuite.java:247)
    at org.junit.internal.runners.JUnit38ClassRunner.run (JUnit38ClassRunner.java:86)
    at org.apache.maven.surefire.junit4.JUnit4Provider.execute (JUnit4Provider.java:365)
    at org.apache.maven.surefire.junit4.JUnit4Provider.executeWithRerun (JUnit4Provider.java:273)
    at org.apache.maven.surefire.junit4.JUnit4Provider.executeTestSet (JUnit4Provider.java:238)
    at org.apache.maven.surefire.junit4.JUnit4Provider.invoke (JUnit4Provider.java:159)
    at org.apache.maven.surefire.booter.ForkedBooter.invokeProviderInSameClassLoader (ForkedBooter.java:383)
    at org.apache.maven.surefire.booter.ForkedBooter.runSuitesInProcess (ForkedBooter.java:344)
    at org.apache.maven.surefire.booter.ForkedBooter.execute (ForkedBooter.java:125)
    at org.apache.maven.surefire.booter.ForkedBooter.main (ForkedBooter.java:417)
[ERROR] 
[ERROR] Re-run Maven using the -X switch to enable full debug logging.

	at org.apache.maven.it.MavenITmng3099SettingsProfilesWithNoPomTest.testit(MavenITmng3099SettingsProfilesWithNoPomTest.java:59)


FAILED:  org.apache.maven.it.MavenITmng4469AuthenticatedDeploymentToCustomRepoTest.windows-jdk8 / Run ITs Windows Java 8 / testit

Error Message:
Exit code was non-zero: 1; command line and log = 
C:\mvn-it-0.tmp\core-it-suite\target\apache-maven\bin\mvn --global-settings C:\mvn-it-0.tmp\core-it-suite\target\test-classes\settings.xml --settings settings.xml -e --batch-mode -Dmaven.repo.local=c:\mvn-it-0.tmp\it-local-repo org.apache.maven.its.plugins:maven-it-plugin-artifact:2.1-SNAPSHOT:deploy-file
[INFO] [jenkins-event-spy] Jenkins Maven Event Spy is disabled
[INFO] Error stacktraces are turned on.
[INFO] Scanning for projects...
[INFO] 
[INFO] ------------------< org.apache.maven:standalone-pom >-------------------
[INFO] Building Maven Stub Project (No POM) 1
[INFO] ------------------------------------------------------------------------
[INFO] BUILD FAILURE
[INFO] ------------------------------------------------------------------------
[INFO] Total time:  0.020 s
[INFO] Finished at: 2022-06-21T15:05:51-07:00
[INFO] ------------------------------------------------------------------------
[ERROR] NullPointerException
java.lang.NullPointerException
    at org.apache.maven.cli.event.ExecutionEventLogger.projectStarted (ExecutionEventLogger.java:341)
    at org.apache.maven.eventspy.internal.EventSpyExecutionListener.projectStarted (EventSpyExecutionListener.java:76)
    at org.apache.maven.lifecycle.internal.DefaultExecutionEventCatapult.fire (DefaultExecutionEventCatapult.java:71)
    at org.apache.maven.lifecycle.internal.DefaultExecutionEventCatapult.fire (DefaultExecutionEventCatapult.java:42)
    at org.apache.maven.lifecycle.internal.LifecycleModuleBuilder.buildProject (LifecycleModuleBuilder.java:108)
    at org.apache.maven.lifecycle.internal.LifecycleModuleBuilder.buildProject (LifecycleModuleBuilder.java:81)
    at org.apache.maven.lifecycle.internal.builder.singlethreaded.SingleThreadedBuilder.build (SingleThreadedBuilder.java:56)
    at org.apache.maven.lifecycle.internal.LifecycleStarter.execute (LifecycleStarter.java:128)
    at org.apache.maven.DefaultMaven.doExecute (DefaultMaven.java:296)
    at org.apache.maven.DefaultMaven.doExecute (DefaultMaven.java:192)
    at org.apache.maven.DefaultMaven.execute (DefaultMaven.java:105)
    at org.apache.maven.cli.MavenCli.execute (MavenCli.java:960)
    at org.apache.maven.cli.MavenCli.doMain (MavenCli.java:293)
    at org.apache.maven.cli.MavenCli.doMain (MavenCli.java:247)
    at sun.reflect.GeneratedMethodAccessor61.invoke (Unknown Source)
    at sun.reflect.DelegatingMethodAccessorImpl.invoke (DelegatingMethodAccessorImpl.java:43)
    at java.lang.reflect.Method.invoke (Method.java:498)
    at org.apache.maven.it.Embedded3xLauncher.run (Embedded3xLauncher.java:218)
    at org.apache.maven.it.Verifier.executeGoals (Verifier.java:1466)
    at org.apache.maven.it.Verifier.executeGoal (Verifier.java:1368)
    at org.apache.maven.it.Verifier.executeGoal (Verifier.java:1362)
    at org.apache.maven.it.MavenITmng4469AuthenticatedDeploymentToCustomRepoTest.testit (MavenITmng4469AuthenticatedDeploymentToCustomRepoTest.java:155)
    at sun.reflect.NativeMethodAccessorImpl.invoke0 (Native Method)
    at sun.reflect.NativeMethodAccessorImpl.invoke (NativeMethodAccessorImpl.java:62)
    at sun.reflect.DelegatingMethodAccessorImpl.invoke (DelegatingMethodAccessorImpl.java:43)
    at java.lang.reflect.Method.invoke (Method.java:498)
    at junit.framework.TestCase.runTest (TestCase.java:176)
    at org.apache.maven.it.AbstractMavenIntegrationTestCase.runTest (AbstractMavenIntegrationTestCase.java:260)
    at junit.framework.TestCase.runBare (TestCase.java:141)
    at junit.framework.TestResult$1.protect (TestResult.java:122)
    at junit.framework.TestResult.runProtected (TestResult.java:142)
    at junit.framework.TestResult.run (TestResult.java:125)
    at junit.framework.TestCase.run (TestCase.java:129)
    at junit.framework.TestSuite.runTest (TestSuite.java:252)
    at junit.framework.TestSuite.run (TestSuite.java:247)
    at junit.framework.TestSuite.runTest (TestSuite.java:252)
    at junit.framework.TestSuite.run (TestSuite.java:247)
    at org.junit.internal.runners.JUnit38ClassRunner.run (JUnit38ClassRunner.java:86)
    at org.apache.maven.surefire.junit4.JUnit4Provider.execute (JUnit4Provider.java:365)
    at org.apache.maven.surefire.junit4.JUnit4Provider.executeWithRerun (JUnit4Provider.java:273)
    at org.apache.maven.surefire.junit4.JUnit4Provider.executeTestSet (JUnit4Provider.java:238)
    at org.apache.maven.surefire.junit4.JUnit4Provider.invoke (JUnit4Provider.java:159)
    at org.apache.maven.surefire.booter.ForkedBooter.invokeProviderInSameClassLoader (ForkedBooter.java:383)
    at org.apache.maven.surefire.booter.ForkedBooter.runSuitesInProcess (ForkedBooter.java:344)
    at org.apache.maven.surefire.booter.ForkedBooter.execute (ForkedBooter.java:125)
    at org.apache.maven.surefire.booter.ForkedBooter.main (ForkedBooter.java:417)
[ERROR] 
[ERROR] Re-run Maven using the -X switch to enable full debug logging.


Stack Trace:
org.apache.maven.it.VerificationException: 
Exit code was non-zero: 1; command line and log = 
C:\mvn-it-0.tmp\core-it-suite\target\apache-maven\bin\mvn --global-settings C:\mvn-it-0.tmp\core-it-suite\target\test-classes\settings.xml --settings settings.xml -e --batch-mode -Dmaven.repo.local=c:\mvn-it-0.tmp\it-local-repo org.apache.maven.its.plugins:maven-it-plugin-artifact:2.1-SNAPSHOT:deploy-file
[INFO] [jenkins-event-spy] Jenkins Maven Event Spy is disabled
[INFO] Error stacktraces are turned on.
[INFO] Scanning for projects...
[INFO] 
[INFO] ------------------< org.apache.maven:standalone-pom >-------------------
[INFO] Building Maven Stub Project (No POM) 1
[INFO] ------------------------------------------------------------------------
[INFO] BUILD FAILURE
[INFO] ------------------------------------------------------------------------
[INFO] Total time:  0.020 s
[INFO] Finished at: 2022-06-21T15:05:51-07:00
[INFO] ------------------------------------------------------------------------
[ERROR] NullPointerException
java.lang.NullPointerException
    at org.apache.maven.cli.event.ExecutionEventLogger.projectStarted (ExecutionEventLogger.java:341)
    at org.apache.maven.eventspy.internal.EventSpyExecutionListener.projectStarted (EventSpyExecutionListener.java:76)
    at org.apache.maven.lifecycle.internal.DefaultExecutionEventCatapult.fire (DefaultExecutionEventCatapult.java:71)
    at org.apache.maven.lifecycle.internal.DefaultExecutionEventCatapult.fire (DefaultExecutionEventCatapult.java:42)
    at org.apache.maven.lifecycle.internal.LifecycleModuleBuilder.buildProject (LifecycleModuleBuilder.java:108)
    at org.apache.maven.lifecycle.internal.LifecycleModuleBuilder.buildProject (LifecycleModuleBuilder.java:81)
    at org.apache.maven.lifecycle.internal.builder.singlethreaded.SingleThreadedBuilder.build (SingleThreadedBuilder.java:56)
    at org.apache.maven.lifecycle.internal.LifecycleStarter.execute (LifecycleStarter.java:128)
    at org.apache.maven.DefaultMaven.doExecute (DefaultMaven.java:296)
    at org.apache.maven.DefaultMaven.doExecute (DefaultMaven.java:192)
    at org.apache.maven.DefaultMaven.execute (DefaultMaven.java:105)
    at org.apache.maven.cli.MavenCli.execute (MavenCli.java:960)
    at org.apache.maven.cli.MavenCli.doMain (MavenCli.java:293)
    at org.apache.maven.cli.MavenCli.doMain (MavenCli.java:247)
    at sun.reflect.GeneratedMethodAccessor61.invoke (Unknown Source)
    at sun.reflect.DelegatingMethodAccessorImpl.invoke (DelegatingMethodAccessorImpl.java:43)
    at java.lang.reflect.Method.invoke (Method.java:498)
    at org.apache.maven.it.Embedded3xLauncher.run (Embedded3xLauncher.java:218)
    at org.apache.maven.it.Verifier.executeGoals (Verifier.java:1466)
    at org.apache.maven.it.Verifier.executeGoal (Verifier.java:1368)
    at org.apache.maven.it.Verifier.executeGoal (Verifier.java:1362)
    at org.apache.maven.it.MavenITmng4469AuthenticatedDeploymentToCustomRepoTest.testit (MavenITmng4469AuthenticatedDeploymentToCustomRepoTest.java:155)
    at sun.reflect.NativeMethodAccessorImpl.invoke0 (Native Method)
    at sun.reflect.NativeMethodAccessorImpl.invoke (NativeMethodAccessorImpl.java:62)
    at sun.reflect.DelegatingMethodAccessorImpl.invoke (DelegatingMethodAccessorImpl.java:43)
    at java.lang.reflect.Method.invoke (Method.java:498)
    at junit.framework.TestCase.runTest (TestCase.java:176)
    at org.apache.maven.it.AbstractMavenIntegrationTestCase.runTest (AbstractMavenIntegrationTestCase.java:260)
    at junit.framework.TestCase.runBare (TestCase.java:141)
    at junit.framework.TestResult$1.protect (TestResult.java:122)
    at junit.framework.TestResult.runProtected (TestResult.java:142)
    at junit.framework.TestResult.run (TestResult.java:125)
    at junit.framework.TestCase.run (TestCase.java:129)
    at junit.framework.TestSuite.runTest (TestSuite.java:252)
    at junit.framework.TestSuite.run (TestSuite.java:247)
    at junit.framework.TestSuite.runTest (TestSuite.java:252)
    at junit.framework.TestSuite.run (TestSuite.java:247)
    at org.junit.internal.runners.JUnit38ClassRunner.run (JUnit38ClassRunner.java:86)
    at org.apache.maven.surefire.junit4.JUnit4Provider.execute (JUnit4Provider.java:365)
    at org.apache.maven.surefire.junit4.JUnit4Provider.executeWithRerun (JUnit4Provider.java:273)
    at org.apache.maven.surefire.junit4.JUnit4Provider.executeTestSet (JUnit4Provider.java:238)
    at org.apache.maven.surefire.junit4.JUnit4Provider.invoke (JUnit4Provider.java:159)
    at org.apache.maven.surefire.booter.ForkedBooter.invokeProviderInSameClassLoader (ForkedBooter.java:383)
    at org.apache.maven.surefire.booter.ForkedBooter.runSuitesInProcess (ForkedBooter.java:344)
    at org.apache.maven.surefire.booter.ForkedBooter.execute (ForkedBooter.java:125)
    at org.apache.maven.surefire.booter.ForkedBooter.main (ForkedBooter.java:417)
[ERROR] 
[ERROR] Re-run Maven using the -X switch to enable full debug logging.

	at org.apache.maven.it.MavenITmng4469AuthenticatedDeploymentToCustomRepoTest.testit(MavenITmng4469AuthenticatedDeploymentToCustomRepoTest.java:155)


FAILED:  org.apache.maven.it.MavenITmng3099SettingsProfilesWithNoPomTest.windows-jdk8 / Run ITs Windows Java 8 / testit

Error Message:
Exit code was non-zero: 1; command line and log = 
C:\mvn-it-0.tmp\core-it-suite\target\apache-maven\bin\mvn --global-settings C:\mvn-it-0.tmp\core-it-suite\target\test-classes\settings.xml -s settings.xml -e --batch-mode -Dmaven.repo.local=c:\mvn-it-0.tmp\it-local-repo org.apache.maven.its.mng3099:maven-mng3099-plugin:0.1:touch
[INFO] [jenkins-event-spy] Jenkins Maven Event Spy is disabled
[INFO] Error stacktraces are turned on.
[INFO] Scanning for projects...
[INFO] Downloading from central: file:target/null/org/apache/maven/its/mng3099/maven-mng3099-plugin/0.1/maven-mng3099-plugin-0.1.pom
[INFO] Downloading from maven-core-it: file:///C:/mvn-it-0.tmp/core-it-suite/target/test-classes/mng-3099/repo/org/apache/maven/its/mng3099/maven-mng3099-plugin/0.1/maven-mng3099-plugin-0.1.pom
[INFO] Downloaded from maven-core-it: file:///C:/mvn-it-0.tmp/core-it-suite/target/test-classes/mng-3099/repo/org/apache/maven/its/mng3099/maven-mng3099-plugin/0.1/maven-mng3099-plugin-0.1.pom (2.1 kB at 712 kB/s)
[INFO] Downloading from central: file:target/null/org/apache/maven/its/mng3099/maven-mng3099-plugin/0.1/maven-mng3099-plugin-0.1.jar
[INFO] Downloading from maven-core-it: file:///C:/mvn-it-0.tmp/core-it-suite/target/test-classes/mng-3099/repo/org/apache/maven/its/mng3099/maven-mng3099-plugin/0.1/maven-mng3099-plugin-0.1.jar
[INFO] Downloaded from maven-core-it: file:///C:/mvn-it-0.tmp/core-it-suite/target/test-classes/mng-3099/repo/org/apache/maven/its/mng3099/maven-mng3099-plugin/0.1/maven-mng3099-plugin-0.1.jar (7.9 kB at 2.6 MB/s)
[INFO] 
[INFO] ------------------< org.apache.maven:standalone-pom >-------------------
[INFO] Building Maven Stub Project (No POM) 1
[INFO] ------------------------------------------------------------------------
[INFO] BUILD FAILURE
[INFO] ------------------------------------------------------------------------
[INFO] Total time:  0.027 s
[INFO] Finished at: 2022-06-21T15:08:04-07:00
[INFO] ------------------------------------------------------------------------
[ERROR] NullPointerException
java.lang.NullPointerException
    at org.apache.maven.cli.event.ExecutionEventLogger.projectStarted (ExecutionEventLogger.java:341)
    at org.apache.maven.eventspy.internal.EventSpyExecutionListener.projectStarted (EventSpyExecutionListener.java:76)
    at org.apache.maven.lifecycle.internal.DefaultExecutionEventCatapult.fire (DefaultExecutionEventCatapult.java:71)
    at org.apache.maven.lifecycle.internal.DefaultExecutionEventCatapult.fire (DefaultExecutionEventCatapult.java:42)
    at org.apache.maven.lifecycle.internal.LifecycleModuleBuilder.buildProject (LifecycleModuleBuilder.java:108)
    at org.apache.maven.lifecycle.internal.LifecycleModuleBuilder.buildProject (LifecycleModuleBuilder.java:81)
    at org.apache.maven.lifecycle.internal.builder.singlethreaded.SingleThreadedBuilder.build (SingleThreadedBuilder.java:56)
    at org.apache.maven.lifecycle.internal.LifecycleStarter.execute (LifecycleStarter.java:128)
    at org.apache.maven.DefaultMaven.doExecute (DefaultMaven.java:296)
    at org.apache.maven.DefaultMaven.doExecute (DefaultMaven.java:192)
    at org.apache.maven.DefaultMaven.execute (DefaultMaven.java:105)
    at org.apache.maven.cli.MavenCli.execute (MavenCli.java:960)
    at org.apache.maven.cli.MavenCli.doMain (MavenCli.java:293)
    at org.apache.maven.cli.MavenCli.doMain (MavenCli.java:247)
    at sun.reflect.GeneratedMethodAccessor61.invoke (Unknown Source)
    at sun.reflect.DelegatingMethodAccessorImpl.invoke (DelegatingMethodAccessorImpl.java:43)
    at java.lang.reflect.Method.invoke (Method.java:498)
    at org.apache.maven.it.Embedded3xLauncher.run (Embedded3xLauncher.java:218)
    at org.apache.maven.it.Verifier.executeGoals (Verifier.java:1466)
    at org.apache.maven.it.Verifier.executeGoal (Verifier.java:1368)
    at org.apache.maven.it.Verifier.executeGoal (Verifier.java:1362)
    at org.apache.maven.it.MavenITmng3099SettingsProfilesWithNoPomTest.testit (MavenITmng3099SettingsProfilesWithNoPomTest.java:59)
    at sun.reflect.NativeMethodAccessorImpl.invoke0 (Native Method)
    at sun.reflect.NativeMethodAccessorImpl.invoke (NativeMethodAccessorImpl.java:62)
    at sun.reflect.DelegatingMethodAccessorImpl.invoke (DelegatingMethodAccessorImpl.java:43)
    at java.lang.reflect.Method.invoke (Method.java:498)
    at junit.framework.TestCase.runTest (TestCase.java:176)
    at org.apache.maven.it.AbstractMavenIntegrationTestCase.runTest (AbstractMavenIntegrationTestCase.java:260)
    at junit.framework.TestCase.runBare (TestCase.java:141)
    at junit.framework.TestResult$1.protect (TestResult.java:122)
    at junit.framework.TestResult.runProtected (TestResult.java:142)
    at junit.framework.TestResult.run (TestResult.java:125)
    at junit.framework.TestCase.run (TestCase.java:129)
    at junit.framework.TestSuite.runTest (TestSuite.java:252)
    at junit.framework.TestSuite.run (TestSuite.java:247)
    at junit.framework.TestSuite.runTest (TestSuite.java:252)
    at junit.framework.TestSuite.run (TestSuite.java:247)
    at org.junit.internal.runners.JUnit38ClassRunner.run (JUnit38ClassRunner.java:86)
    at org.apache.maven.surefire.junit4.JUnit4Provider.execute (JUnit4Provider.java:365)
    at org.apache.maven.surefire.junit4.JUnit4Provider.executeWithRerun (JUnit4Provider.java:273)
    at org.apache.maven.surefire.junit4.JUnit4Provider.executeTestSet (JUnit4Provider.java:238)
    at org.apache.maven.surefire.junit4.JUnit4Provider.invoke (JUnit4Provider.java:159)
    at org.apache.maven.surefire.booter.ForkedBooter.invokeProviderInSameClassLoader (ForkedBooter.java:383)
    at org.apache.maven.surefire.booter.ForkedBooter.runSuitesInProcess (ForkedBooter.java:344)
    at org.apache.maven.surefire.booter.ForkedBooter.execute (ForkedBooter.java:125)
    at org.apache.maven.surefire.booter.ForkedBooter.main (ForkedBooter.java:417)
[ERROR] 
[ERROR] Re-run Maven using the -X switch to enable full debug logging.


Stack Trace:
org.apache.maven.it.VerificationException: 
Exit code was non-zero: 1; command line and log = 
C:\mvn-it-0.tmp\core-it-suite\target\apache-maven\bin\mvn --global-settings C:\mvn-it-0.tmp\core-it-suite\target\test-classes\settings.xml -s settings.xml -e --batch-mode -Dmaven.repo.local=c:\mvn-it-0.tmp\it-local-repo org.apache.maven.its.mng3099:maven-mng3099-plugin:0.1:touch
[INFO] [jenkins-event-spy] Jenkins Maven Event Spy is disabled
[INFO] Error stacktraces are turned on.
[INFO] Scanning for projects...
[INFO] Downloading from central: file:target/null/org/apache/maven/its/mng3099/maven-mng3099-plugin/0.1/maven-mng3099-plugin-0.1.pom
[INFO] Downloading from maven-core-it: file:///C:/mvn-it-0.tmp/core-it-suite/target/test-classes/mng-3099/repo/org/apache/maven/its/mng3099/maven-mng3099-plugin/0.1/maven-mng3099-plugin-0.1.pom
[INFO] Downloaded from maven-core-it: file:///C:/mvn-it-0.tmp/core-it-suite/target/test-classes/mng-3099/repo/org/apache/maven/its/mng3099/maven-mng3099-plugin/0.1/maven-mng3099-plugin-0.1.pom (2.1 kB at 712 kB/s)
[INFO] Downloading from central: file:target/null/org/apache/maven/its/mng3099/maven-mng3099-plugin/0.1/maven-mng3099-plugin-0.1.jar
[INFO] Downloading from maven-core-it: file:///C:/mvn-it-0.tmp/core-it-suite/target/test-classes/mng-3099/repo/org/apache/maven/its/mng3099/maven-mng3099-plugin/0.1/maven-mng3099-plugin-0.1.jar
[INFO] Downloaded from maven-core-it: file:///C:/mvn-it-0.tmp/core-it-suite/target/test-classes/mng-3099/repo/org/apache/maven/its/mng3099/maven-mng3099-plugin/0.1/maven-mng3099-plugin-0.1.jar (7.9 kB at 2.6 MB/s)
[INFO] 
[INFO] ------------------< org.apache.maven:standalone-pom >-------------------
[INFO] Building Maven Stub Project (No POM) 1
[INFO] ------------------------------------------------------------------------
[INFO] BUILD FAILURE
[INFO] ------------------------------------------------------------------------
[INFO] Total time:  0.027 s
[INFO] Finished at: 2022-06-21T15:08:04-07:00
[INFO] ------------------------------------------------------------------------
[ERROR] NullPointerException
java.lang.NullPointerException
    at org.apache.maven.cli.event.ExecutionEventLogger.projectStarted (ExecutionEventLogger.java:341)
    at org.apache.maven.eventspy.internal.EventSpyExecutionListener.projectStarted (EventSpyExecutionListener.java:76)
    at org.apache.maven.lifecycle.internal.DefaultExecutionEventCatapult.fire (DefaultExecutionEventCatapult.java:71)
    at org.apache.maven.lifecycle.internal.DefaultExecutionEventCatapult.fire (DefaultExecutionEventCatapult.java:42)
    at org.apache.maven.lifecycle.internal.LifecycleModuleBuilder.buildProject (LifecycleModuleBuilder.java:108)
    at org.apache.maven.lifecycle.internal.LifecycleModuleBuilder.buildProject (LifecycleModuleBuilder.java:81)
    at org.apache.maven.lifecycle.internal.builder.singlethreaded.SingleThreadedBuilder.build (SingleThreadedBuilder.java:56)
    at org.apache.maven.lifecycle.internal.LifecycleStarter.execute (LifecycleStarter.java:128)
    at org.apache.maven.DefaultMaven.doExecute (DefaultMaven.java:296)
    at org.apache.maven.DefaultMaven.doExecute (DefaultMaven.java:192)
    at org.apache.maven.DefaultMaven.execute (DefaultMaven.java:105)
    at org.apache.maven.cli.MavenCli.execute (MavenCli.java:960)
    at org.apache.maven.cli.MavenCli.doMain (MavenCli.java:293)
    at org.apache.maven.cli.MavenCli.doMain (MavenCli.java:247)
    at sun.reflect.GeneratedMethodAccessor61.invoke (Unknown Source)
    at sun.reflect.DelegatingMethodAccessorImpl.invoke (DelegatingMethodAccessorImpl.java:43)
    at java.lang.reflect.Method.invoke (Method.java:498)
    at org.apache.maven.it.Embedded3xLauncher.run (Embedded3xLauncher.java:218)
    at org.apache.maven.it.Verifier.executeGoals (Verifier.java:1466)
    at org.apache.maven.it.Verifier.executeGoal (Verifier.java:1368)
    at org.apache.maven.it.Verifier.executeGoal (Verifier.java:1362)
    at org.apache.maven.it.MavenITmng3099SettingsProfilesWithNoPomTest.testit (MavenITmng3099SettingsProfilesWithNoPomTest.java:59)
    at sun.reflect.NativeMethodAccessorImpl.invoke0 (Native Method)
    at sun.reflect.NativeMethodAccessorImpl.invoke (NativeMethodAccessorImpl.java:62)
    at sun.reflect.DelegatingMethodAccessorImpl.invoke (DelegatingMethodAccessorImpl.java:43)
    at java.lang.reflect.Method.invoke (Method.java:498)
    at junit.framework.TestCase.runTest (TestCase.java:176)
    at org.apache.maven.it.AbstractMavenIntegrationTestCase.runTest (AbstractMavenIntegrationTestCase.java:260)
    at junit.framework.TestCase.runBare (TestCase.java:141)
    at junit.framework.TestResult$1.protect (TestResult.java:122)
    at junit.framework.TestResult.runProtected (TestResult.java:142)
    at junit.framework.TestResult.run (TestResult.java:125)
    at junit.framework.TestCase.run (TestCase.java:129)
    at junit.framework.TestSuite.runTest (TestSuite.java:252)
    at junit.framework.TestSuite.run (TestSuite.java:247)
    at junit.framework.TestSuite.runTest (TestSuite.java:252)
    at junit.framework.TestSuite.run (TestSuite.java:247)
    at org.junit.internal.runners.JUnit38ClassRunner.run (JUnit38ClassRunner.java:86)
    at org.apache.maven.surefire.junit4.JUnit4Provider.execute (JUnit4Provider.java:365)
    at org.apache.maven.surefire.junit4.JUnit4Provider.executeWithRerun (JUnit4Provider.java:273)
    at org.apache.maven.surefire.junit4.JUnit4Provider.executeTestSet (JUnit4Provider.java:238)
    at org.apache.maven.surefire.junit4.JUnit4Provider.invoke (JUnit4Provider.java:159)
    at org.apache.maven.surefire.booter.ForkedBooter.invokeProviderInSameClassLoader (ForkedBooter.java:383)
    at org.apache.maven.surefire.booter.ForkedBooter.runSuitesInProcess (ForkedBooter.java:344)
    at org.apache.maven.surefire.booter.ForkedBooter.execute (ForkedBooter.java:125)
    at org.apache.maven.surefire.booter.ForkedBooter.main (ForkedBooter.java:417)
[ERROR] 
[ERROR] Re-run Maven using the -X switch to enable full debug logging.

	at org.apache.maven.it.MavenITmng3099SettingsProfilesWithNoPomTest.testit(MavenITmng3099SettingsProfilesWithNoPomTest.java:59)


FAILED:  org.apache.maven.it.MavenITmng4469AuthenticatedDeploymentToCustomRepoTest.windows-jdk11 / Run ITs Windows Java 11 / testit

Error Message:
Exit code was non-zero: 1; command line and log = 
C:\mvn-it-0.tmp\core-it-suite\target\apache-maven\bin\mvn --global-settings C:\mvn-it-0.tmp\core-it-suite\target\test-classes\settings.xml --settings settings.xml -e --batch-mode -Dmaven.repo.local=c:\mvn-it-0.tmp\it-local-repo org.apache.maven.its.plugins:maven-it-plugin-artifact:2.1-SNAPSHOT:deploy-file
[INFO] [jenkins-event-spy] Jenkins Maven Event Spy is disabled
[INFO] Error stacktraces are turned on.
[INFO] Scanning for projects...
[INFO] 
[INFO] ------------------< org.apache.maven:standalone-pom >-------------------
[INFO] Building Maven Stub Project (No POM) 1
[INFO] ------------------------------------------------------------------------
[INFO] BUILD FAILURE
[INFO] ------------------------------------------------------------------------
[INFO] Total time:  0.019 s
[INFO] Finished at: 2022-06-21T15:06:27-07:00
[INFO] ------------------------------------------------------------------------
[ERROR] NullPointerException
java.lang.NullPointerException
    at org.apache.maven.cli.event.ExecutionEventLogger.projectStarted (ExecutionEventLogger.java:341)
    at org.apache.maven.eventspy.internal.EventSpyExecutionListener.projectStarted (EventSpyExecutionListener.java:76)
    at org.apache.maven.lifecycle.internal.DefaultExecutionEventCatapult.fire (DefaultExecutionEventCatapult.java:71)
    at org.apache.maven.lifecycle.internal.DefaultExecutionEventCatapult.fire (DefaultExecutionEventCatapult.java:42)
    at org.apache.maven.lifecycle.internal.LifecycleModuleBuilder.buildProject (LifecycleModuleBuilder.java:108)
    at org.apache.maven.lifecycle.internal.LifecycleModuleBuilder.buildProject (LifecycleModuleBuilder.java:81)
    at org.apache.maven.lifecycle.internal.builder.singlethreaded.SingleThreadedBuilder.build (SingleThreadedBuilder.java:56)
    at org.apache.maven.lifecycle.internal.LifecycleStarter.execute (LifecycleStarter.java:128)
    at org.apache.maven.DefaultMaven.doExecute (DefaultMaven.java:296)
    at org.apache.maven.DefaultMaven.doExecute (DefaultMaven.java:192)
    at org.apache.maven.DefaultMaven.execute (DefaultMaven.java:105)
    at org.apache.maven.cli.MavenCli.execute (MavenCli.java:960)
    at org.apache.maven.cli.MavenCli.doMain (MavenCli.java:293)
    at org.apache.maven.cli.MavenCli.doMain (MavenCli.java:247)
    at jdk.internal.reflect.GeneratedMethodAccessor67.invoke (Unknown Source)
    at jdk.internal.reflect.DelegatingMethodAccessorImpl.invoke (DelegatingMethodAccessorImpl.java:43)
    at java.lang.reflect.Method.invoke (Method.java:566)
    at org.apache.maven.it.Embedded3xLauncher.run (Embedded3xLauncher.java:218)
    at org.apache.maven.it.Verifier.executeGoals (Verifier.java:1466)
    at org.apache.maven.it.Verifier.executeGoal (Verifier.java:1368)
    at org.apache.maven.it.Verifier.executeGoal (Verifier.java:1362)
    at org.apache.maven.it.MavenITmng4469AuthenticatedDeploymentToCustomRepoTest.testit (MavenITmng4469AuthenticatedDeploymentToCustomRepoTest.java:155)
    at jdk.internal.reflect.NativeMethodAccessorImpl.invoke0 (Native Method)
    at jdk.internal.reflect.NativeMethodAccessorImpl.invoke (NativeMethodAccessorImpl.java:62)
    at jdk.internal.reflect.DelegatingMethodAccessorImpl.invoke (DelegatingMethodAccessorImpl.java:43)
    at java.lang.reflect.Method.invoke (Method.java:566)
    at junit.framework.TestCase.runTest (TestCase.java:176)
    at org.apache.maven.it.AbstractMavenIntegrationTestCase.runTest (AbstractMavenIntegrationTestCase.java:260)
    at junit.framework.TestCase.runBare (TestCase.java:141)
    at junit.framework.TestResult$1.protect (TestResult.java:122)
    at junit.framework.TestResult.runProtected (TestResult.java:142)
    at junit.framework.TestResult.run (TestResult.java:125)
    at junit.framework.TestCase.run (TestCase.java:129)
    at junit.framework.TestSuite.runTest (TestSuite.java:252)
    at junit.framework.TestSuite.run (TestSuite.java:247)
    at junit.framework.TestSuite.runTest (TestSuite.java:252)
    at junit.framework.TestSuite.run (TestSuite.java:247)
    at org.junit.internal.runners.JUnit38ClassRunner.run (JUnit38ClassRunner.java:86)
    at org.apache.maven.surefire.junit4.JUnit4Provider.execute (JUnit4Provider.java:365)
    at org.apache.maven.surefire.junit4.JUnit4Provider.executeWithRerun (JUnit4Provider.java:273)
    at org.apache.maven.surefire.junit4.JUnit4Provider.executeTestSet (JUnit4Provider.java:238)
    at org.apache.maven.surefire.junit4.JUnit4Provider.invoke (JUnit4Provider.java:159)
    at org.apache.maven.surefire.booter.ForkedBooter.invokeProviderInSameClassLoader (ForkedBooter.java:383)
    at org.apache.maven.surefire.booter.ForkedBooter.runSuitesInProcess (ForkedBooter.java:344)
    at org.apache.maven.surefire.booter.ForkedBooter.execute (ForkedBooter.java:125)
    at org.apache.maven.surefire.booter.ForkedBooter.main (ForkedBooter.java:417)
[ERROR] 
[ERROR] Re-run Maven using the -X switch to enable full debug logging.


Stack Trace:
org.apache.maven.it.VerificationException: 
Exit code was non-zero: 1; command line and log = 
C:\mvn-it-0.tmp\core-it-suite\target\apache-maven\bin\mvn --global-settings C:\mvn-it-0.tmp\core-it-suite\target\test-classes\settings.xml --settings settings.xml -e --batch-mode -Dmaven.repo.local=c:\mvn-it-0.tmp\it-local-repo org.apache.maven.its.plugins:maven-it-plugin-artifact:2.1-SNAPSHOT:deploy-file
[INFO] [jenkins-event-spy] Jenkins Maven Event Spy is disabled
[INFO] Error stacktraces are turned on.
[INFO] Scanning for projects...
[INFO] 
[INFO] ------------------< org.apache.maven:standalone-pom >-------------------
[INFO] Building Maven Stub Project (No POM) 1
[INFO] ------------------------------------------------------------------------
[INFO] BUILD FAILURE
[INFO] ------------------------------------------------------------------------
[INFO] Total time:  0.019 s
[INFO] Finished at: 2022-06-21T15:06:27-07:00
[INFO] ------------------------------------------------------------------------
[ERROR] NullPointerException
java.lang.NullPointerException
    at org.apache.maven.cli.event.ExecutionEventLogger.projectStarted (ExecutionEventLogger.java:341)
    at org.apache.maven.eventspy.internal.EventSpyExecutionListener.projectStarted (EventSpyExecutionListener.java:76)
    at org.apache.maven.lifecycle.internal.DefaultExecutionEventCatapult.fire (DefaultExecutionEventCatapult.java:71)
    at org.apache.maven.lifecycle.internal.DefaultExecutionEventCatapult.fire (DefaultExecutionEventCatapult.java:42)
    at org.apache.maven.lifecycle.internal.LifecycleModuleBuilder.buildProject (LifecycleModuleBuilder.java:108)
    at org.apache.maven.lifecycle.internal.LifecycleModuleBuilder.buildProject (LifecycleModuleBuilder.java:81)
    at org.apache.maven.lifecycle.internal.builder.singlethreaded.SingleThreadedBuilder.build (SingleThreadedBuilder.java:56)
    at org.apache.maven.lifecycle.internal.LifecycleStarter.execute (LifecycleStarter.java:128)
    at org.apache.maven.DefaultMaven.doExecute (DefaultMaven.java:296)
    at org.apache.maven.DefaultMaven.doExecute (DefaultMaven.java:192)
    at org.apache.maven.DefaultMaven.execute (DefaultMaven.java:105)
    at org.apache.maven.cli.MavenCli.execute (MavenCli.java:960)
    at org.apache.maven.cli.MavenCli.doMain (MavenCli.java:293)
    at org.apache.maven.cli.MavenCli.doMain (MavenCli.java:247)
    at jdk.internal.reflect.GeneratedMethodAccessor67.invoke (Unknown Source)
    at jdk.internal.reflect.DelegatingMethodAccessorImpl.invoke (DelegatingMethodAccessorImpl.java:43)
    at java.lang.reflect.Method.invoke (Method.java:566)
    at org.apache.maven.it.Embedded3xLauncher.run (Embedded3xLauncher.java:218)
    at org.apache.maven.it.Verifier.executeGoals (Verifier.java:1466)
    at org.apache.maven.it.Verifier.executeGoal (Verifier.java:1368)
    at org.apache.maven.it.Verifier.executeGoal (Verifier.java:1362)
    at org.apache.maven.it.MavenITmng4469AuthenticatedDeploymentToCustomRepoTest.testit (MavenITmng4469AuthenticatedDeploymentToCustomRepoTest.java:155)
    at jdk.internal.reflect.NativeMethodAccessorImpl.invoke0 (Native Method)
    at jdk.internal.reflect.NativeMethodAccessorImpl.invoke (NativeMethodAccessorImpl.java:62)
    at jdk.internal.reflect.DelegatingMethodAccessorImpl.invoke (DelegatingMethodAccessorImpl.java:43)
    at java.lang.reflect.Method.invoke (Method.java:566)
    at junit.framework.TestCase.runTest (TestCase.java:176)
    at org.apache.maven.it.AbstractMavenIntegrationTestCase.runTest (AbstractMavenIntegrationTestCase.java:260)
    at junit.framework.TestCase.runBare (TestCase.java:141)
    at junit.framework.TestResult$1.protect (TestResult.java:122)
    at junit.framework.TestResult.runProtected (TestResult.java:142)
    at junit.framework.TestResult.run (TestResult.java:125)
    at junit.framework.TestCase.run (TestCase.java:129)
    at junit.framework.TestSuite.runTest (TestSuite.java:252)
    at junit.framework.TestSuite.run (TestSuite.java:247)
    at junit.framework.TestSuite.runTest (TestSuite.java:252)
    at junit.framework.TestSuite.run (TestSuite.java:247)
    at org.junit.internal.runners.JUnit38ClassRunner.run (JUnit38ClassRunner.java:86)
    at org.apache.maven.surefire.junit4.JUnit4Provider.execute (JUnit4Provider.java:365)
    at org.apache.maven.surefire.junit4.JUnit4Provider.executeWithRerun (JUnit4Provider.java:273)
    at org.apache.maven.surefire.junit4.JUnit4Provider.executeTestSet (JUnit4Provider.java:238)
    at org.apache.maven.surefire.junit4.JUnit4Provider.invoke (JUnit4Provider.java:159)
    at org.apache.maven.surefire.booter.ForkedBooter.invokeProviderInSameClassLoader (ForkedBooter.java:383)
    at org.apache.maven.surefire.booter.ForkedBooter.runSuitesInProcess (ForkedBooter.java:344)
    at org.apache.maven.surefire.booter.ForkedBooter.execute (ForkedBooter.java:125)
    at org.apache.maven.surefire.booter.ForkedBooter.main (ForkedBooter.java:417)
[ERROR] 
[ERROR] Re-run Maven using the -X switch to enable full debug logging.

	at org.apache.maven.it.MavenITmng4469AuthenticatedDeploymentToCustomRepoTest.testit(MavenITmng4469AuthenticatedDeploymentToCustomRepoTest.java:155)


FAILED:  org.apache.maven.it.MavenITmng3099SettingsProfilesWithNoPomTest.windows-jdk11 / Run ITs Windows Java 11 / testit

Error Message:
Exit code was non-zero: 1; command line and log = 
C:\mvn-it-0.tmp\core-it-suite\target\apache-maven\bin\mvn --global-settings C:\mvn-it-0.tmp\core-it-suite\target\test-classes\settings.xml -s settings.xml -e --batch-mode -Dmaven.repo.local=c:\mvn-it-0.tmp\it-local-repo org.apache.maven.its.mng3099:maven-mng3099-plugin:0.1:touch
[INFO] [jenkins-event-spy] Jenkins Maven Event Spy is disabled
[INFO] Error stacktraces are turned on.
[INFO] Scanning for projects...
[INFO] Downloading from central: file:target/null/org/apache/maven/its/mng3099/maven-mng3099-plugin/0.1/maven-mng3099-plugin-0.1.pom
[INFO] Downloading from maven-core-it: file:///C:/mvn-it-0.tmp/core-it-suite/target/test-classes/mng-3099/repo/org/apache/maven/its/mng3099/maven-mng3099-plugin/0.1/maven-mng3099-plugin-0.1.pom
[INFO] Downloaded from maven-core-it: file:///C:/mvn-it-0.tmp/core-it-suite/target/test-classes/mng-3099/repo/org/apache/maven/its/mng3099/maven-mng3099-plugin/0.1/maven-mng3099-plugin-0.1.pom (2.1 kB at 1.1 MB/s)
[INFO] Downloading from central: file:target/null/org/apache/maven/its/mng3099/maven-mng3099-plugin/0.1/maven-mng3099-plugin-0.1.jar
[INFO] Downloading from maven-core-it: file:///C:/mvn-it-0.tmp/core-it-suite/target/test-classes/mng-3099/repo/org/apache/maven/its/mng3099/maven-mng3099-plugin/0.1/maven-mng3099-plugin-0.1.jar
[INFO] Downloaded from maven-core-it: file:///C:/mvn-it-0.tmp/core-it-suite/target/test-classes/mng-3099/repo/org/apache/maven/its/mng3099/maven-mng3099-plugin/0.1/maven-mng3099-plugin-0.1.jar (7.9 kB at 3.9 MB/s)
[INFO] 
[INFO] ------------------< org.apache.maven:standalone-pom >-------------------
[INFO] Building Maven Stub Project (No POM) 1
[INFO] ------------------------------------------------------------------------
[INFO] BUILD FAILURE
[INFO] ------------------------------------------------------------------------
[INFO] Total time:  0.021 s
[INFO] Finished at: 2022-06-21T15:08:41-07:00
[INFO] ------------------------------------------------------------------------
[ERROR] NullPointerException
java.lang.NullPointerException
    at org.apache.maven.cli.event.ExecutionEventLogger.projectStarted (ExecutionEventLogger.java:341)
    at org.apache.maven.eventspy.internal.EventSpyExecutionListener.projectStarted (EventSpyExecutionListener.java:76)
    at org.apache.maven.lifecycle.internal.DefaultExecutionEventCatapult.fire (DefaultExecutionEventCatapult.java:71)
    at org.apache.maven.lifecycle.internal.DefaultExecutionEventCatapult.fire (DefaultExecutionEventCatapult.java:42)
    at org.apache.maven.lifecycle.internal.LifecycleModuleBuilder.buildProject (LifecycleModuleBuilder.java:108)
    at org.apache.maven.lifecycle.internal.LifecycleModuleBuilder.buildProject (LifecycleModuleBuilder.java:81)
    at org.apache.maven.lifecycle.internal.builder.singlethreaded.SingleThreadedBuilder.build (SingleThreadedBuilder.java:56)
    at org.apache.maven.lifecycle.internal.LifecycleStarter.execute (LifecycleStarter.java:128)
    at org.apache.maven.DefaultMaven.doExecute (DefaultMaven.java:296)
    at org.apache.maven.DefaultMaven.doExecute (DefaultMaven.java:192)
    at org.apache.maven.DefaultMaven.execute (DefaultMaven.java:105)
    at org.apache.maven.cli.MavenCli.execute (MavenCli.java:960)
    at org.apache.maven.cli.MavenCli.doMain (MavenCli.java:293)
    at org.apache.maven.cli.MavenCli.doMain (MavenCli.java:247)
    at jdk.internal.reflect.GeneratedMethodAccessor67.invoke (Unknown Source)
    at jdk.internal.reflect.DelegatingMethodAccessorImpl.invoke (DelegatingMethodAccessorImpl.java:43)
    at java.lang.reflect.Method.invoke (Method.java:566)
    at org.apache.maven.it.Embedded3xLauncher.run (Embedded3xLauncher.java:218)
    at org.apache.maven.it.Verifier.executeGoals (Verifier.java:1466)
    at org.apache.maven.it.Verifier.executeGoal (Verifier.java:1368)
    at org.apache.maven.it.Verifier.executeGoal (Verifier.java:1362)
    at org.apache.maven.it.MavenITmng3099SettingsProfilesWithNoPomTest.testit (MavenITmng3099SettingsProfilesWithNoPomTest.java:59)
    at jdk.internal.reflect.NativeMethodAccessorImpl.invoke0 (Native Method)
    at jdk.internal.reflect.NativeMethodAccessorImpl.invoke (NativeMethodAccessorImpl.java:62)
    at jdk.internal.reflect.DelegatingMethodAccessorImpl.invoke (DelegatingMethodAccessorImpl.java:43)
    at java.lang.reflect.Method.invoke (Method.java:566)
    at junit.framework.TestCase.runTest (TestCase.java:176)
    at org.apache.maven.it.AbstractMavenIntegrationTestCase.runTest (AbstractMavenIntegrationTestCase.java:260)
    at junit.framework.TestCase.runBare (TestCase.java:141)
    at junit.framework.TestResult$1.protect (TestResult.java:122)
    at junit.framework.TestResult.runProtected (TestResult.java:142)
    at junit.framework.TestResult.run (TestResult.java:125)
    at junit.framework.TestCase.run (TestCase.java:129)
    at junit.framework.TestSuite.runTest (TestSuite.java:252)
    at junit.framework.TestSuite.run (TestSuite.java:247)
    at junit.framework.TestSuite.runTest (TestSuite.java:252)
    at junit.framework.TestSuite.run (TestSuite.java:247)
    at org.junit.internal.runners.JUnit38ClassRunner.run (JUnit38ClassRunner.java:86)
    at org.apache.maven.surefire.junit4.JUnit4Provider.execute (JUnit4Provider.java:365)
    at org.apache.maven.surefire.junit4.JUnit4Provider.executeWithRerun (JUnit4Provider.java:273)
    at org.apache.maven.surefire.junit4.JUnit4Provider.executeTestSet (JUnit4Provider.java:238)
    at org.apache.maven.surefire.junit4.JUnit4Provider.invoke (JUnit4Provider.java:159)
    at org.apache.maven.surefire.booter.ForkedBooter.invokeProviderInSameClassLoader (ForkedBooter.java:383)
    at org.apache.maven.surefire.booter.ForkedBooter.runSuitesInProcess (ForkedBooter.java:344)
    at org.apache.maven.surefire.booter.ForkedBooter.execute (ForkedBooter.java:125)
    at org.apache.maven.surefire.booter.ForkedBooter.main (ForkedBooter.java:417)
[ERROR] 
[ERROR] Re-run Maven using the -X switch to enable full debug logging.


Stack Trace:
org.apache.maven.it.VerificationException: 
Exit code was non-zero: 1; command line and log = 
C:\mvn-it-0.tmp\core-it-suite\target\apache-maven\bin\mvn --global-settings C:\mvn-it-0.tmp\core-it-suite\target\test-classes\settings.xml -s settings.xml -e --batch-mode -Dmaven.repo.local=c:\mvn-it-0.tmp\it-local-repo org.apache.maven.its.mng3099:maven-mng3099-plugin:0.1:touch
[INFO] [jenkins-event-spy] Jenkins Maven Event Spy is disabled
[INFO] Error stacktraces are turned on.
[INFO] Scanning for projects...
[INFO] Downloading from central: file:target/null/org/apache/maven/its/mng3099/maven-mng3099-plugin/0.1/maven-mng3099-plugin-0.1.pom
[INFO] Downloading from maven-core-it: file:///C:/mvn-it-0.tmp/core-it-suite/target/test-classes/mng-3099/repo/org/apache/maven/its/mng3099/maven-mng3099-plugin/0.1/maven-mng3099-plugin-0.1.pom
[INFO] Downloaded from maven-core-it: file:///C:/mvn-it-0.tmp/core-it-suite/target/test-classes/mng-3099/repo/org/apache/maven/its/mng3099/maven-mng3099-plugin/0.1/maven-mng3099-plugin-0.1.pom (2.1 kB at 1.1 MB/s)
[INFO] Downloading from central: file:target/null/org/apache/maven/its/mng3099/maven-mng3099-plugin/0.1/maven-mng3099-plugin-0.1.jar
[INFO] Downloading from maven-core-it: file:///C:/mvn-it-0.tmp/core-it-suite/target/test-classes/mng-3099/repo/org/apache/maven/its/mng3099/maven-mng3099-plugin/0.1/maven-mng3099-plugin-0.1.jar
[INFO] Downloaded from maven-core-it: file:///C:/mvn-it-0.tmp/core-it-suite/target/test-classes/mng-3099/repo/org/apache/maven/its/mng3099/maven-mng3099-plugin/0.1/maven-mng3099-plugin-0.1.jar (7.9 kB at 3.9 MB/s)
[INFO] 
[INFO] ------------------< org.apache.maven:standalone-pom >-------------------
[INFO] Building Maven Stub Project (No POM) 1
[INFO] ------------------------------------------------------------------------
[INFO] BUILD FAILURE
[INFO] ------------------------------------------------------------------------
[INFO] Total time:  0.021 s
[INFO] Finished at: 2022-06-21T15:08:41-07:00
[INFO] ------------------------------------------------------------------------
[ERROR] NullPointerException
java.lang.NullPointerException
    at org.apache.maven.cli.event.ExecutionEventLogger.projectStarted (ExecutionEventLogger.java:341)
    at org.apache.maven.eventspy.internal.EventSpyExecutionListener.projectStarted (EventSpyExecutionListener.java:76)
    at org.apache.maven.lifecycle.internal.DefaultExecutionEventCatapult.fire (DefaultExecutionEventCatapult.java:71)
    at org.apache.maven.lifecycle.internal.DefaultExecutionEventCatapult.fire (DefaultExecutionEventCatapult.java:42)
    at org.apache.maven.lifecycle.internal.LifecycleModuleBuilder.buildProject (LifecycleModuleBuilder.java:108)
    at org.apache.maven.lifecycle.internal.LifecycleModuleBuilder.buildProject (LifecycleModuleBuilder.java:81)
    at org.apache.maven.lifecycle.internal.builder.singlethreaded.SingleThreadedBuilder.build (SingleThreadedBuilder.java:56)
    at org.apache.maven.lifecycle.internal.LifecycleStarter.execute (LifecycleStarter.java:128)
    at org.apache.maven.DefaultMaven.doExecute (DefaultMaven.java:296)
    at org.apache.maven.DefaultMaven.doExecute (DefaultMaven.java:192)
    at org.apache.maven.DefaultMaven.execute (DefaultMaven.java:105)
    at org.apache.maven.cli.MavenCli.execute (MavenCli.java:960)
    at org.apache.maven.cli.MavenCli.doMain (MavenCli.java:293)
    at org.apache.maven.cli.MavenCli.doMain (MavenCli.java:247)
    at jdk.internal.reflect.GeneratedMethodAccessor67.invoke (Unknown Source)
    at jdk.internal.reflect.DelegatingMethodAccessorImpl.invoke (DelegatingMethodAccessorImpl.java:43)
    at java.lang.reflect.Method.invoke (Method.java:566)
    at org.apache.maven.it.Embedded3xLauncher.run (Embedded3xLauncher.java:218)
    at org.apache.maven.it.Verifier.executeGoals (Verifier.java:1466)
    at org.apache.maven.it.Verifier.executeGoal (Verifier.java:1368)
    at org.apache.maven.it.Verifier.executeGoal (Verifier.java:1362)
    at org.apache.maven.it.MavenITmng3099SettingsProfilesWithNoPomTest.testit (MavenITmng3099SettingsProfilesWithNoPomTest.java:59)
    at jdk.internal.reflect.NativeMethodAccessorImpl.invoke0 (Native Method)
    at jdk.internal.reflect.NativeMethodAccessorImpl.invoke (NativeMethodAccessorImpl.java:62)
    at jdk.internal.reflect.DelegatingMethodAccessorImpl.invoke (DelegatingMethodAccessorImpl.java:43)
    at java.lang.reflect.Method.invoke (Method.java:566)
    at junit.framework.TestCase.runTest (TestCase.java:176)
    at org.apache.maven.it.AbstractMavenIntegrationTestCase.runTest (AbstractMavenIntegrationTestCase.java:260)
    at junit.framework.TestCase.runBare (TestCase.java:141)
    at junit.framework.TestResult$1.protect (TestResult.java:122)
    at junit.framework.TestResult.runProtected (TestResult.java:142)
    at junit.framework.TestResult.run (TestResult.java:125)
    at junit.framework.TestCase.run (TestCase.java:129)
    at junit.framework.TestSuite.runTest (TestSuite.java:252)
    at junit.framework.TestSuite.run (TestSuite.java:247)
    at junit.framework.TestSuite.runTest (TestSuite.java:252)
    at junit.framework.TestSuite.run (TestSuite.java:247)
    at org.junit.internal.runners.JUnit38ClassRunner.run (JUnit38ClassRunner.java:86)
    at org.apache.maven.surefire.junit4.JUnit4Provider.execute (JUnit4Provider.java:365)
    at org.apache.maven.surefire.junit4.JUnit4Provider.executeWithRerun (JUnit4Provider.java:273)
    at org.apache.maven.surefire.junit4.JUnit4Provider.executeTestSet (JUnit4Provider.java:238)
    at org.apache.maven.surefire.junit4.JUnit4Provider.invoke (JUnit4Provider.java:159)
    at org.apache.maven.surefire.booter.ForkedBooter.invokeProviderInSameClassLoader (ForkedBooter.java:383)
    at org.apache.maven.surefire.booter.ForkedBooter.runSuitesInProcess (ForkedBooter.java:344)
    at org.apache.maven.surefire.booter.ForkedBooter.execute (ForkedBooter.java:125)
    at org.apache.maven.surefire.booter.ForkedBooter.main (ForkedBooter.java:417)
[ERROR] 
[ERROR] Re-run Maven using the -X switch to enable full debug logging.

	at org.apache.maven.it.MavenITmng3099SettingsProfilesWithNoPomTest.testit(MavenITmng3099SettingsProfilesWithNoPomTest.java:59)


FAILED:  org.apache.maven.it.MavenITmng4469AuthenticatedDeploymentToCustomRepoTest.windows-jdk17 / Run ITs Windows Java 17 / testit

Error Message:
Exit code was non-zero: 1; command line and log = 
C:\mvn-it-0.tmp\core-it-suite\target\apache-maven\bin\mvn --global-settings C:\mvn-it-0.tmp\core-it-suite\target\test-classes\settings.xml --settings settings.xml -e --batch-mode -Dmaven.repo.local=c:\mvn-it-0.tmp\it-local-repo org.apache.maven.its.plugins:maven-it-plugin-artifact:2.1-SNAPSHOT:deploy-file
[INFO] [jenkins-event-spy] Jenkins Maven Event Spy is disabled
[INFO] Error stacktraces are turned on.
[INFO] Scanning for projects...
[INFO] 
[INFO] ------------------< org.apache.maven:standalone-pom >-------------------
[INFO] Building Maven Stub Project (No POM) 1
[INFO] ------------------------------------------------------------------------
[INFO] BUILD FAILURE
[INFO] ------------------------------------------------------------------------
[INFO] Total time:  0.020 s
[INFO] Finished at: 2022-06-21T15:08:24-07:00
[INFO] ------------------------------------------------------------------------
[ERROR] Cannot invoke "java.io.File.toPath()" because "rootBasedir" is null
java.lang.NullPointerException: Cannot invoke "java.io.File.toPath()" because "rootBasedir" is null
    at org.apache.maven.cli.event.ExecutionEventLogger.projectStarted (ExecutionEventLogger.java:341)
    at org.apache.maven.eventspy.internal.EventSpyExecutionListener.projectStarted (EventSpyExecutionListener.java:76)
    at org.apache.maven.lifecycle.internal.DefaultExecutionEventCatapult.fire (DefaultExecutionEventCatapult.java:71)
    at org.apache.maven.lifecycle.internal.DefaultExecutionEventCatapult.fire (DefaultExecutionEventCatapult.java:42)
    at org.apache.maven.lifecycle.internal.LifecycleModuleBuilder.buildProject (LifecycleModuleBuilder.java:108)
    at org.apache.maven.lifecycle.internal.LifecycleModuleBuilder.buildProject (LifecycleModuleBuilder.java:81)
    at org.apache.maven.lifecycle.internal.builder.singlethreaded.SingleThreadedBuilder.build (SingleThreadedBuilder.java:56)
    at org.apache.maven.lifecycle.internal.LifecycleStarter.execute (LifecycleStarter.java:128)
    at org.apache.maven.DefaultMaven.doExecute (DefaultMaven.java:296)
    at org.apache.maven.DefaultMaven.doExecute (DefaultMaven.java:192)
    at org.apache.maven.DefaultMaven.execute (DefaultMaven.java:105)
    at org.apache.maven.cli.MavenCli.execute (MavenCli.java:960)
    at org.apache.maven.cli.MavenCli.doMain (MavenCli.java:293)
    at org.apache.maven.cli.MavenCli.doMain (MavenCli.java:247)
    at jdk.internal.reflect.GeneratedMethodAccessor65.invoke (Unknown Source)
    at jdk.internal.reflect.DelegatingMethodAccessorImpl.invoke (DelegatingMethodAccessorImpl.java:43)
    at java.lang.reflect.Method.invoke (Method.java:568)
    at org.apache.maven.it.Embedded3xLauncher.run (Embedded3xLauncher.java:218)
    at org.apache.maven.it.Verifier.executeGoals (Verifier.java:1466)
    at org.apache.maven.it.Verifier.executeGoal (Verifier.java:1368)
    at org.apache.maven.it.Verifier.executeGoal (Verifier.java:1362)
    at org.apache.maven.it.MavenITmng4469AuthenticatedDeploymentToCustomRepoTest.testit (MavenITmng4469AuthenticatedDeploymentToCustomRepoTest.java:155)
    at jdk.internal.reflect.NativeMethodAccessorImpl.invoke0 (Native Method)
    at jdk.internal.reflect.NativeMethodAccessorImpl.invoke (NativeMethodAccessorImpl.java:77)
    at jdk.internal.reflect.DelegatingMethodAccessorImpl.invoke (DelegatingMethodAccessorImpl.java:43)
    at java.lang.reflect.Method.invoke (Method.java:568)
    at junit.framework.TestCase.runTest (TestCase.java:176)
    at org.apache.maven.it.AbstractMavenIntegrationTestCase.runTest (AbstractMavenIntegrationTestCase.java:260)
    at junit.framework.TestCase.runBare (TestCase.java:141)
    at junit.framework.TestResult$1.protect (TestResult.java:122)
    at junit.framework.TestResult.runProtected (TestResult.java:142)
    at junit.framework.TestResult.run (TestResult.java:125)
    at junit.framework.TestCase.run (TestCase.java:129)
    at junit.framework.TestSuite.runTest (TestSuite.java:252)
    at junit.framework.TestSuite.run (TestSuite.java:247)
    at junit.framework.TestSuite.runTest (TestSuite.java:252)
    at junit.framework.TestSuite.run (TestSuite.java:247)
    at org.junit.internal.runners.JUnit38ClassRunner.run (JUnit38ClassRunner.java:86)
    at org.apache.maven.surefire.junit4.JUnit4Provider.execute (JUnit4Provider.java:365)
    at org.apache.maven.surefire.junit4.JUnit4Provider.executeWithRerun (JUnit4Provider.java:273)
    at org.apache.maven.surefire.junit4.JUnit4Provider.executeTestSet (JUnit4Provider.java:238)
    at org.apache.maven.surefire.junit4.JUnit4Provider.invoke (JUnit4Provider.java:159)
    at org.apache.maven.surefire.booter.ForkedBooter.invokeProviderInSameClassLoader (ForkedBooter.java:383)
    at org.apache.maven.surefire.booter.ForkedBooter.runSuitesInProcess (ForkedBooter.java:344)
    at org.apache.maven.surefire.booter.ForkedBooter.execute (ForkedBooter.java:125)
    at org.apache.maven.surefire.booter.ForkedBooter.main (ForkedBooter.java:417)
[ERROR] 
[ERROR] Re-run Maven using the -X switch to enable full debug logging.


Stack Trace:
org.apache.maven.it.VerificationException: 
Exit code was non-zero: 1; command line and log = 
C:\mvn-it-0.tmp\core-it-suite\target\apache-maven\bin\mvn --global-settings C:\mvn-it-0.tmp\core-it-suite\target\test-classes\settings.xml --settings settings.xml -e --batch-mode -Dmaven.repo.local=c:\mvn-it-0.tmp\it-local-repo org.apache.maven.its.plugins:maven-it-plugin-artifact:2.1-SNAPSHOT:deploy-file
[INFO] [jenkins-event-spy] Jenkins Maven Event Spy is disabled
[INFO] Error stacktraces are turned on.
[INFO] Scanning for projects...
[INFO] 
[INFO] ------------------< org.apache.maven:standalone-pom >-------------------
[INFO] Building Maven Stub Project (No POM) 1
[INFO] ------------------------------------------------------------------------
[INFO] BUILD FAILURE
[INFO] ------------------------------------------------------------------------
[INFO] Total time:  0.020 s
[INFO] Finished at: 2022-06-21T15:08:24-07:00
[INFO] ------------------------------------------------------------------------
[ERROR] Cannot invoke "java.io.File.toPath()" because "rootBasedir" is null
java.lang.NullPointerException: Cannot invoke "java.io.File.toPath()" because "rootBasedir" is null
    at org.apache.maven.cli.event.ExecutionEventLogger.projectStarted (ExecutionEventLogger.java:341)
    at org.apache.maven.eventspy.internal.EventSpyExecutionListener.projectStarted (EventSpyExecutionListener.java:76)
    at org.apache.maven.lifecycle.internal.DefaultExecutionEventCatapult.fire (DefaultExecutionEventCatapult.java:71)
    at org.apache.maven.lifecycle.internal.DefaultExecutionEventCatapult.fire (DefaultExecutionEventCatapult.java:42)
    at org.apache.maven.lifecycle.internal.LifecycleModuleBuilder.buildProject (LifecycleModuleBuilder.java:108)
    at org.apache.maven.lifecycle.internal.LifecycleModuleBuilder.buildProject (LifecycleModuleBuilder.java:81)
    at org.apache.maven.lifecycle.internal.builder.singlethreaded.SingleThreadedBuilder.build (SingleThreadedBuilder.java:56)
    at org.apache.maven.lifecycle.internal.LifecycleStarter.execute (LifecycleStarter.java:128)
    at org.apache.maven.DefaultMaven.doExecute (DefaultMaven.java:296)
    at org.apache.maven.DefaultMaven.doExecute (DefaultMaven.java:192)
    at org.apache.maven.DefaultMaven.execute (DefaultMaven.java:105)
    at org.apache.maven.cli.MavenCli.execute (MavenCli.java:960)
    at org.apache.maven.cli.MavenCli.doMain (MavenCli.java:293)
    at org.apache.maven.cli.MavenCli.doMain (MavenCli.java:247)
    at jdk.internal.reflect.GeneratedMethodAccessor65.invoke (Unknown Source)
    at jdk.internal.reflect.DelegatingMethodAccessorImpl.invoke (DelegatingMethodAccessorImpl.java:43)
    at java.lang.reflect.Method.invoke (Method.java:568)
    at org.apache.maven.it.Embedded3xLauncher.run (Embedded3xLauncher.java:218)
    at org.apache.maven.it.Verifier.executeGoals (Verifier.java:1466)
    at org.apache.maven.it.Verifier.executeGoal (Verifier.java:1368)
    at org.apache.maven.it.Verifier.executeGoal (Verifier.java:1362)
    at org.apache.maven.it.MavenITmng4469AuthenticatedDeploymentToCustomRepoTest.testit (MavenITmng4469AuthenticatedDeploymentToCustomRepoTest.java:155)
    at jdk.internal.reflect.NativeMethodAccessorImpl.invoke0 (Native Method)
    at jdk.internal.reflect.NativeMethodAccessorImpl.invoke (NativeMethodAccessorImpl.java:77)
    at jdk.internal.reflect.DelegatingMethodAccessorImpl.invoke (DelegatingMethodAccessorImpl.java:43)
    at java.lang.reflect.Method.invoke (Method.java:568)
    at junit.framework.TestCase.runTest (TestCase.java:176)
    at org.apache.maven.it.AbstractMavenIntegrationTestCase.runTest (AbstractMavenIntegrationTestCase.java:260)
    at junit.framework.TestCase.runBare (TestCase.java:141)
    at junit.framework.TestResult$1.protect (TestResult.java:122)
    at junit.framework.TestResult.runProtected (TestResult.java:142)
    at junit.framework.TestResult.run (TestResult.java:125)
    at junit.framework.TestCase.run (TestCase.java:129)
    at junit.framework.TestSuite.runTest (TestSuite.java:252)
    at junit.framework.TestSuite.run (TestSuite.java:247)
    at junit.framework.TestSuite.runTest (TestSuite.java:252)
    at junit.framework.TestSuite.run (TestSuite.java:247)
    at org.junit.internal.runners.JUnit38ClassRunner.run (JUnit38ClassRunner.java:86)
    at org.apache.maven.surefire.junit4.JUnit4Provider.execute (JUnit4Provider.java:365)
    at org.apache.maven.surefire.junit4.JUnit4Provider.executeWithRerun (JUnit4Provider.java:273)
    at org.apache.maven.surefire.junit4.JUnit4Provider.executeTestSet (JUnit4Provider.java:238)
    at org.apache.maven.surefire.junit4.JUnit4Provider.invoke (JUnit4Provider.java:159)
    at org.apache.maven.surefire.booter.ForkedBooter.invokeProviderInSameClassLoader (ForkedBooter.java:383)
    at org.apache.maven.surefire.booter.ForkedBooter.runSuitesInProcess (ForkedBooter.java:344)
    at org.apache.maven.surefire.booter.ForkedBooter.execute (ForkedBooter.java:125)
    at org.apache.maven.surefire.booter.ForkedBooter.main (ForkedBooter.java:417)
[ERROR] 
[ERROR] Re-run Maven using the -X switch to enable full debug logging.

	at org.apache.maven.it.MavenITmng4469AuthenticatedDeploymentToCustomRepoTest.testit(MavenITmng4469AuthenticatedDeploymentToCustomRepoTest.java:155)


FAILED:  org.apache.maven.it.MavenITmng3099SettingsProfilesWithNoPomTest.windows-jdk17 / Run ITs Windows Java 17 / testit

Error Message:
Exit code was non-zero: 1; command line and log = 
C:\mvn-it-0.tmp\core-it-suite\target\apache-maven\bin\mvn --global-settings C:\mvn-it-0.tmp\core-it-suite\target\test-classes\settings.xml -s settings.xml -e --batch-mode -Dmaven.repo.local=c:\mvn-it-0.tmp\it-local-repo org.apache.maven.its.mng3099:maven-mng3099-plugin:0.1:touch
[INFO] [jenkins-event-spy] Jenkins Maven Event Spy is disabled
[INFO] Error stacktraces are turned on.
[INFO] Scanning for projects...
[INFO] Downloading from central: file:target/null/org/apache/maven/its/mng3099/maven-mng3099-plugin/0.1/maven-mng3099-plugin-0.1.pom
[INFO] Downloading from maven-core-it: file:///C:/mvn-it-0.tmp/core-it-suite/target/test-classes/mng-3099/repo/org/apache/maven/its/mng3099/maven-mng3099-plugin/0.1/maven-mng3099-plugin-0.1.pom
[INFO] Downloaded from maven-core-it: file:///C:/mvn-it-0.tmp/core-it-suite/target/test-classes/mng-3099/repo/org/apache/maven/its/mng3099/maven-mng3099-plugin/0.1/maven-mng3099-plugin-0.1.pom (2.1 kB at 178 kB/s)
[INFO] Downloading from central: file:target/null/org/apache/maven/its/mng3099/maven-mng3099-plugin/0.1/maven-mng3099-plugin-0.1.jar
[INFO] Downloading from maven-core-it: file:///C:/mvn-it-0.tmp/core-it-suite/target/test-classes/mng-3099/repo/org/apache/maven/its/mng3099/maven-mng3099-plugin/0.1/maven-mng3099-plugin-0.1.jar
[INFO] Downloaded from maven-core-it: file:///C:/mvn-it-0.tmp/core-it-suite/target/test-classes/mng-3099/repo/org/apache/maven/its/mng3099/maven-mng3099-plugin/0.1/maven-mng3099-plugin-0.1.jar (7.9 kB at 133 kB/s)
[INFO] 
[INFO] ------------------< org.apache.maven:standalone-pom >-------------------
[INFO] Building Maven Stub Project (No POM) 1
[INFO] ------------------------------------------------------------------------
[INFO] BUILD FAILURE
[INFO] ------------------------------------------------------------------------
[INFO] Total time:  0.114 s
[INFO] Finished at: 2022-06-21T15:11:06-07:00
[INFO] ------------------------------------------------------------------------
[ERROR] Cannot invoke "java.io.File.toPath()" because "rootBasedir" is null
java.lang.NullPointerException: Cannot invoke "java.io.File.toPath()" because "rootBasedir" is null
    at org.apache.maven.cli.event.ExecutionEventLogger.projectStarted (ExecutionEventLogger.java:341)
    at org.apache.maven.eventspy.internal.EventSpyExecutionListener.projectStarted (EventSpyExecutionListener.java:76)
    at org.apache.maven.lifecycle.internal.DefaultExecutionEventCatapult.fire (DefaultExecutionEventCatapult.java:71)
    at org.apache.maven.lifecycle.internal.DefaultExecutionEventCatapult.fire (DefaultExecutionEventCatapult.java:42)
    at org.apache.maven.lifecycle.internal.LifecycleModuleBuilder.buildProject (LifecycleModuleBuilder.java:108)
    at org.apache.maven.lifecycle.internal.LifecycleModuleBuilder.buildProject (LifecycleModuleBuilder.java:81)
    at org.apache.maven.lifecycle.internal.builder.singlethreaded.SingleThreadedBuilder.build (SingleThreadedBuilder.java:56)
    at org.apache.maven.lifecycle.internal.LifecycleStarter.execute (LifecycleStarter.java:128)
    at org.apache.maven.DefaultMaven.doExecute (DefaultMaven.java:296)
    at org.apache.maven.DefaultMaven.doExecute (DefaultMaven.java:192)
    at org.apache.maven.DefaultMaven.execute (DefaultMaven.java:105)
    at org.apache.maven.cli.MavenCli.execute (MavenCli.java:960)
    at org.apache.maven.cli.MavenCli.doMain (MavenCli.java:293)
    at org.apache.maven.cli.MavenCli.doMain (MavenCli.java:247)
    at jdk.internal.reflect.GeneratedMethodAccessor65.invoke (Unknown Source)
    at jdk.internal.reflect.DelegatingMethodAccessorImpl.invoke (DelegatingMethodAccessorImpl.java:43)
    at java.lang.reflect.Method.invoke (Method.java:568)
    at org.apache.maven.it.Embedded3xLauncher.run (Embedded3xLauncher.java:218)
    at org.apache.maven.it.Verifier.executeGoals (Verifier.java:1466)
    at org.apache.maven.it.Verifier.executeGoal (Verifier.java:1368)
    at org.apache.maven.it.Verifier.executeGoal (Verifier.java:1362)
    at org.apache.maven.it.MavenITmng3099SettingsProfilesWithNoPomTest.testit (MavenITmng3099SettingsProfilesWithNoPomTest.java:59)
    at jdk.internal.reflect.NativeMethodAccessorImpl.invoke0 (Native Method)
    at jdk.internal.reflect.NativeMethodAccessorImpl.invoke (NativeMethodAccessorImpl.java:77)
    at jdk.internal.reflect.DelegatingMethodAccessorImpl.invoke (DelegatingMethodAccessorImpl.java:43)
    at java.lang.reflect.Method.invoke (Method.java:568)
    at junit.framework.TestCase.runTest (TestCase.java:176)
    at org.apache.maven.it.AbstractMavenIntegrationTestCase.runTest (AbstractMavenIntegrationTestCase.java:260)
    at junit.framework.TestCase.runBare (TestCase.java:141)
    at junit.framework.TestResult$1.protect (TestResult.java:122)
    at junit.framework.TestResult.runProtected (TestResult.java:142)
    at junit.framework.TestResult.run (TestResult.java:125)
    at junit.framework.TestCase.run (TestCase.java:129)
    at junit.framework.TestSuite.runTest (TestSuite.java:252)
    at junit.framework.TestSuite.run (TestSuite.java:247)
    at junit.framework.TestSuite.runTest (TestSuite.java:252)
    at junit.framework.TestSuite.run (TestSuite.java:247)
    at org.junit.internal.runners.JUnit38ClassRunner.run (JUnit38ClassRunner.java:86)
    at org.apache.maven.surefire.junit4.JUnit4Provider.execute (JUnit4Provider.java:365)
    at org.apache.maven.surefire.junit4.JUnit4Provider.executeWithRerun (JUnit4Provider.java:273)
    at org.apache.maven.surefire.junit4.JUnit4Provider.executeTestSet (JUnit4Provider.java:238)
    at org.apache.maven.surefire.junit4.JUnit4Provider.invoke (JUnit4Provider.java:159)
    at org.apache.maven.surefire.booter.ForkedBooter.invokeProviderInSameClassLoader (ForkedBooter.java:383)
    at org.apache.maven.surefire.booter.ForkedBooter.runSuitesInProcess (ForkedBooter.java:344)
    at org.apache.maven.surefire.booter.ForkedBooter.execute (ForkedBooter.java:125)
    at org.apache.maven.surefire.booter.ForkedBooter.main (ForkedBooter.java:417)
[ERROR] 
[ERROR] Re-run Maven using the -X switch to enable full debug logging.


Stack Trace:
org.apache.maven.it.VerificationException: 
Exit code was non-zero: 1; command line and log = 
C:\mvn-it-0.tmp\core-it-suite\target\apache-maven\bin\mvn --global-settings C:\mvn-it-0.tmp\core-it-suite\target\test-classes\settings.xml -s settings.xml -e --batch-mode -Dmaven.repo.local=c:\mvn-it-0.tmp\it-local-repo org.apache.maven.its.mng3099:maven-mng3099-plugin:0.1:touch
[INFO] [jenkins-event-spy] Jenkins Maven Event Spy is disabled
[INFO] Error stacktraces are turned on.
[INFO] Scanning for projects...
[INFO] Downloading from central: file:target/null/org/apache/maven/its/mng3099/maven-mng3099-plugin/0.1/maven-mng3099-plugin-0.1.pom
[INFO] Downloading from maven-core-it: file:///C:/mvn-it-0.tmp/core-it-suite/target/test-classes/mng-3099/repo/org/apache/maven/its/mng3099/maven-mng3099-plugin/0.1/maven-mng3099-plugin-0.1.pom
[INFO] Downloaded from maven-core-it: file:///C:/mvn-it-0.tmp/core-it-suite/target/test-classes/mng-3099/repo/org/apache/maven/its/mng3099/maven-mng3099-plugin/0.1/maven-mng3099-plugin-0.1.pom (2.1 kB at 178 kB/s)
[INFO] Downloading from central: file:target/null/org/apache/maven/its/mng3099/maven-mng3099-plugin/0.1/maven-mng3099-plugin-0.1.jar
[INFO] Downloading from maven-core-it: file:///C:/mvn-it-0.tmp/core-it-suite/target/test-classes/mng-3099/repo/org/apache/maven/its/mng3099/maven-mng3099-plugin/0.1/maven-mng3099-plugin-0.1.jar
[INFO] Downloaded from maven-core-it: file:///C:/mvn-it-0.tmp/core-it-suite/target/test-classes/mng-3099/repo/org/apache/maven/its/mng3099/maven-mng3099-plugin/0.1/maven-mng3099-plugin-0.1.jar (7.9 kB at 133 kB/s)
[INFO] 
[INFO] ------------------< org.apache.maven:standalone-pom >-------------------
[INFO] Building Maven Stub Project (No POM) 1
[INFO] ------------------------------------------------------------------------
[INFO] BUILD FAILURE
[INFO] ------------------------------------------------------------------------
[INFO] Total time:  0.114 s
[INFO] Finished at: 2022-06-21T15:11:06-07:00
[INFO] ------------------------------------------------------------------------
[ERROR] Cannot invoke "java.io.File.toPath()" because "rootBasedir" is null
java.lang.NullPointerException: Cannot invoke "java.io.File.toPath()" because "rootBasedir" is null
    at org.apache.maven.cli.event.ExecutionEventLogger.projectStarted (ExecutionEventLogger.java:341)
    at org.apache.maven.eventspy.internal.EventSpyExecutionListener.projectStarted (EventSpyExecutionListener.java:76)
    at org.apache.maven.lifecycle.internal.DefaultExecutionEventCatapult.fire (DefaultExecutionEventCatapult.java:71)
    at org.apache.maven.lifecycle.internal.DefaultExecutionEventCatapult.fire (DefaultExecutionEventCatapult.java:42)
    at org.apache.maven.lifecycle.internal.LifecycleModuleBuilder.buildProject (LifecycleModuleBuilder.java:108)
    at org.apache.maven.lifecycle.internal.LifecycleModuleBuilder.buildProject (LifecycleModuleBuilder.java:81)
    at org.apache.maven.lifecycle.internal.builder.singlethreaded.SingleThreadedBuilder.build (SingleThreadedBuilder.java:56)
    at org.apache.maven.lifecycle.internal.LifecycleStarter.execute (LifecycleStarter.java:128)
    at org.apache.maven.DefaultMaven.doExecute (DefaultMaven.java:296)
    at org.apache.maven.DefaultMaven.doExecute (DefaultMaven.java:192)
    at org.apache.maven.DefaultMaven.execute (DefaultMaven.java:105)
    at org.apache.maven.cli.MavenCli.execute (MavenCli.java:960)
    at org.apache.maven.cli.MavenCli.doMain (MavenCli.java:293)
    at org.apache.maven.cli.MavenCli.doMain (MavenCli.java:247)
    at jdk.internal.reflect.GeneratedMethodAccessor65.invoke (Unknown Source)
    at jdk.internal.reflect.DelegatingMethodAccessorImpl.invoke (DelegatingMethodAccessorImpl.java:43)
    at java.lang.reflect.Method.invoke (Method.java:568)
    at org.apache.maven.it.Embedded3xLauncher.run (Embedded3xLauncher.java:218)
    at org.apache.maven.it.Verifier.executeGoals (Verifier.java:1466)
    at org.apache.maven.it.Verifier.executeGoal (Verifier.java:1368)
    at org.apache.maven.it.Verifier.executeGoal (Verifier.java:1362)
    at org.apache.maven.it.MavenITmng3099SettingsProfilesWithNoPomTest.testit (MavenITmng3099SettingsProfilesWithNoPomTest.java:59)
    at jdk.internal.reflect.NativeMethodAccessorImpl.invoke0 (Native Method)
    at jdk.internal.reflect.NativeMethodAccessorImpl.invoke (NativeMethodAccessorImpl.java:77)
    at jdk.internal.reflect.DelegatingMethodAccessorImpl.invoke (DelegatingMethodAccessorImpl.java:43)
    at java.lang.reflect.Method.invoke (Method.java:568)
    at junit.framework.TestCase.runTest (TestCase.java:176)
    at org.apache.maven.it.AbstractMavenIntegrationTestCase.runTest (AbstractMavenIntegrationTestCase.java:260)
    at junit.framework.TestCase.runBare (TestCase.java:141)
    at junit.framework.TestResult$1.protect (TestResult.java:122)
    at junit.framework.TestResult.runProtected (TestResult.java:142)
    at junit.framework.TestResult.run (TestResult.java:125)
    at junit.framework.TestCase.run (TestCase.java:129)
    at junit.framework.TestSuite.runTest (TestSuite.java:252)
    at junit.framework.TestSuite.run (TestSuite.java:247)
    at junit.framework.TestSuite.runTest (TestSuite.java:252)
    at junit.framework.TestSuite.run (TestSuite.java:247)
    at org.junit.internal.runners.JUnit38ClassRunner.run (JUnit38ClassRunner.java:86)
    at org.apache.maven.surefire.junit4.JUnit4Provider.execute (JUnit4Provider.java:365)
    at org.apache.maven.surefire.junit4.JUnit4Provider.executeWithRerun (JUnit4Provider.java:273)
    at org.apache.maven.surefire.junit4.JUnit4Provider.executeTestSet (JUnit4Provider.java:238)
    at org.apache.maven.surefire.junit4.JUnit4Provider.invoke (JUnit4Provider.java:159)
    at org.apache.maven.surefire.booter.ForkedBooter.invokeProviderInSameClassLoader (ForkedBooter.java:383)
    at org.apache.maven.surefire.booter.ForkedBooter.runSuitesInProcess (ForkedBooter.java:344)
    at org.apache.maven.surefire.booter.ForkedBooter.execute (ForkedBooter.java:125)
    at org.apache.maven.surefire.booter.ForkedBooter.main (ForkedBooter.java:417)
[ERROR] 
[ERROR] Re-run Maven using the -X switch to enable full debug logging.

	at org.apache.maven.it.MavenITmng3099SettingsProfilesWithNoPomTest.testit(MavenITmng3099SettingsProfilesWithNoPomTest.java:59)




Build log:
[...truncated 58205 lines...]
[withMaven] artifactsPublisher - Archive artifact core-it-support\core-it-plugins\maven-it-plugin-core-stubs\maven-plugin-plugin\pom.xml under org\apache\maven\plugins\maven-plugin-plugin\0.1-stub-SNAPSHOT\maven-plugin-plugin-0.1-stub-SNAPSHOT.pom
[withMaven] artifactsPublisher - Archive artifact core-it-support\core-it-plugins\maven-it-plugin-core-stubs\maven-plugin-plugin\target\maven-plugin-plugin-0.1-stub-SNAPSHOT.jar under org\apache\maven\plugins\maven-plugin-plugin\0.1-stub-SNAPSHOT\maven-plugin-plugin-0.1-stub-SNAPSHOT.jar
[Pipeline] deleteDir
[withMaven] artifactsPublisher - Archive artifact core-it-support\core-it-plugins\maven-it-plugin-core-stubs\maven-rar-plugin\pom.xml under org\apache\maven\plugins\maven-rar-plugin\0.1-stub-SNAPSHOT\maven-rar-plugin-0.1-stub-SNAPSHOT.pom
[withMaven] artifactsPublisher - Archive artifact core-it-support\core-it-plugins\maven-it-plugin-core-stubs\maven-rar-plugin\target\maven-rar-plugin-0.1-stub-SNAPSHOT.jar under org\apache\maven\plugins\maven-rar-plugin\0.1-stub-SNAPSHOT\maven-rar-plugin-0.1-stub-SNAPSHOT.jar
[withMaven] artifactsPublisher - Archive artifact core-it-support\core-it-plugins\maven-it-plugin-core-stubs\maven-resources-plugin\pom.xml under org\apache\maven\plugins\maven-resources-plugin\0.1-stub-SNAPSHOT\maven-resources-plugin-0.1-stub-SNAPSHOT.pom
[withMaven] artifactsPublisher - Archive artifact core-it-support\core-it-plugins\maven-it-plugin-core-stubs\maven-resources-plugin\target\maven-resources-plugin-0.1-stub-SNAPSHOT.jar under org\apache\maven\plugins\maven-resources-plugin\0.1-stub-SNAPSHOT\maven-resources-plugin-0.1-stub-SNAPSHOT.jar
[withMaven] artifactsPublisher - Archive artifact core-it-support\core-it-plugins\maven-it-plugin-core-stubs\maven-site-plugin\pom.xml under org\apache\maven\plugins\maven-site-plugin\0.1-stub-SNAPSHOT\maven-site-plugin-0.1-stub-SNAPSHOT.pom
[withMaven] artifactsPublisher - Archive artifact core-it-support\core-it-plugins\maven-it-plugin-core-stubs\maven-site-plugin\target\maven-site-plugin-0.1-stub-SNAPSHOT.jar under org\apache\maven\plugins\maven-site-plugin\0.1-stub-SNAPSHOT\maven-site-plugin-0.1-stub-SNAPSHOT.jar
[withMaven] artifactsPublisher - Archive artifact core-it-support\core-it-plugins\maven-it-plugin-core-stubs\maven-source-plugin\pom.xml under org\apache\maven\plugins\maven-source-plugin\0.1-stub-SNAPSHOT\maven-source-plugin-0.1-stub-SNAPSHOT.pom
[withMaven] artifactsPublisher - Archive artifact core-it-support\core-it-plugins\maven-it-plugin-core-stubs\maven-source-plugin\target\maven-source-plugin-0.1-stub-SNAPSHOT.jar under org\apache\maven\plugins\maven-source-plugin\0.1-stub-SNAPSHOT\maven-source-plugin-0.1-stub-SNAPSHOT.jar
[withMaven] artifactsPublisher - Archive artifact core-it-support\core-it-plugins\maven-it-plugin-core-stubs\maven-surefire-plugin\pom.xml under org\apache\maven\plugins\maven-surefire-plugin\0.1-stub-SNAPSHOT\maven-surefire-plugin-0.1-stub-SNAPSHOT.pom
[withMaven] artifactsPublisher - Archive artifact core-it-support\core-it-plugins\maven-it-plugin-core-stubs\maven-surefire-plugin\target\maven-surefire-plugin-0.1-stub-SNAPSHOT.jar under org\apache\maven\plugins\maven-surefire-plugin\0.1-stub-SNAPSHOT\maven-surefire-plugin-0.1-stub-SNAPSHOT.jar
[withMaven] artifactsPublisher - Archive artifact core-it-support\core-it-plugins\maven-it-plugin-core-stubs\maven-war-plugin\pom.xml under org\apache\maven\plugins\maven-war-plugin\0.1-stub-SNAPSHOT\maven-war-plugin-0.1-stub-SNAPSHOT.pom
[withMaven] artifactsPublisher - Archive artifact core-it-support\core-it-plugins\maven-it-plugin-core-stubs\maven-war-plugin\target\maven-war-plugin-0.1-stub-SNAPSHOT.jar under org\apache\maven\plugins\maven-war-plugin\0.1-stub-SNAPSHOT\maven-war-plugin-0.1-stub-SNAPSHOT.jar
[withMaven] artifactsPublisher - Archive artifact core-it-support\core-it-plugins\maven-it-plugin-dependency-collection\pom.xml under org\apache\maven\its\plugins\maven-it-plugin-dependency-collection\2.1-SNAPSHOT\maven-it-plugin-dependency-collection-2.1-SNAPSHOT.pom
[withMaven] artifactsPublisher - Archive artifact core-it-support\core-it-plugins\maven-it-plugin-dependency-collection\target\maven-it-plugin-dependency-collection-2.1-SNAPSHOT.jar under org\apache\maven\its\plugins\maven-it-plugin-dependency-collection\2.1-SNAPSHOT\maven-it-plugin-dependency-collection-2.1-SNAPSHOT.jar
[withMaven] artifactsPublisher - Archive artifact core-it-support\core-it-plugins\maven-it-plugin-dependency-resolution\pom.xml under org\apache\maven\its\plugins\maven-it-plugin-dependency-resolution\2.1-SNAPSHOT\maven-it-plugin-dependency-resolution-2.1-SNAPSHOT.pom
[withMaven] artifactsPublisher - Archive artifact core-it-support\core-it-plugins\maven-it-plugin-dependency-resolution\target\maven-it-plugin-dependency-resolution-2.1-SNAPSHOT.jar under org\apache\maven\its\plugins\maven-it-plugin-dependency-resolution\2.1-SNAPSHOT\maven-it-plugin-dependency-resolution-2.1-SNAPSHOT.jar
[withMaven] artifactsPublisher - Archive artifact core-it-support\core-it-plugins\maven-it-plugin-expression\pom.xml under org\apache\maven\its\plugins\maven-it-plugin-expression\2.1-SNAPSHOT\maven-it-plugin-expression-2.1-SNAPSHOT.pom
[withMaven] artifactsPublisher - Archive artifact core-it-support\core-it-plugins\maven-it-plugin-expression\target\maven-it-plugin-expression-2.1-SNAPSHOT.jar under org\apache\maven\its\plugins\maven-it-plugin-expression\2.1-SNAPSHOT\maven-it-plugin-expression-2.1-SNAPSHOT.jar
[withMaven] artifactsPublisher - Archive artifact core-it-support\core-it-plugins\maven-it-plugin-error\pom.xml under org\apache\maven\its\plugins\maven-it-plugin-error\2.1-SNAPSHOT\maven-it-plugin-error-2.1-SNAPSHOT.pom
[withMaven] artifactsPublisher - Archive artifact core-it-support\core-it-plugins\maven-it-plugin-error\target\maven-it-plugin-error-2.1-SNAPSHOT.jar under org\apache\maven\its\plugins\maven-it-plugin-error\2.1-SNAPSHOT\maven-it-plugin-error-2.1-SNAPSHOT.jar
[withMaven] artifactsPublisher - Archive artifact core-it-support\core-it-component\pom.xml under org\apache\maven\its\core-it-component\2.1-SNAPSHOT\core-it-component-2.1-SNAPSHOT.pom
[withMaven] artifactsPublisher - Archive artifact core-it-support\core-it-component\target\core-it-component-2.1-SNAPSHOT.jar under org\apache\maven\its\core-it-component\2.1-SNAPSHOT\core-it-component-2.1-SNAPSHOT.jar
[withMaven] artifactsPublisher - Archive artifact core-it-support\core-it-plugins\maven-it-plugin-extension-consumer\pom.xml under org\apache\maven\its\plugins\maven-it-plugin-extension-consumer\2.1-SNAPSHOT\maven-it-plugin-extension-consumer-2.1-SNAPSHOT.pom
[withMaven] artifactsPublisher - Archive artifact core-it-support\core-it-plugins\maven-it-plugin-extension-consumer\target\maven-it-plugin-extension-consumer-2.1-SNAPSHOT.jar under org\apache\maven\its\plugins\maven-it-plugin-extension-consumer\2.1-SNAPSHOT\maven-it-plugin-extension-consumer-2.1-SNAPSHOT.jar
[withMaven] artifactsPublisher - Archive artifact core-it-support\core-it-plugins\maven-it-plugin-extension-provider\pom.xml under org\apache\maven\its\plugins\maven-it-plugin-extension-provider\2.1-SNAPSHOT\maven-it-plugin-extension-provider-2.1-SNAPSHOT.pom
[withMaven] artifactsPublisher - Archive artifact core-it-support\core-it-plugins\maven-it-plugin-extension-provider\target\maven-it-plugin-extension-provider-2.1-SNAPSHOT.jar under org\apache\maven\its\plugins\maven-it-plugin-extension-provider\2.1-SNAPSHOT\maven-it-plugin-extension-provider-2.1-SNAPSHOT.jar
[withMaven] artifactsPublisher - Archive artifact core-it-support\core-it-plugins\maven-it-plugin-fork\pom.xml under org\apache\maven\its\plugins\maven-it-plugin-fork\2.1-SNAPSHOT\maven-it-plugin-fork-2.1-SNAPSHOT.pom
[withMaven] artifactsPublisher - Archive artifact core-it-support\core-it-plugins\maven-it-plugin-fork\target\maven-it-plugin-fork-2.1-SNAPSHOT.jar under org\apache\maven\its\plugins\maven-it-plugin-fork\2.1-SNAPSHOT\maven-it-plugin-fork-2.1-SNAPSHOT.jar
[withMaven] artifactsPublisher - Archive artifact core-it-support\core-it-plugins\maven-it-plugin-invalid-descriptor\pom.xml under org\apache\maven\its\plugins\maven-it-plugin-invalid-descriptor\2.1-SNAPSHOT\maven-it-plugin-invalid-descriptor-2.1-SNAPSHOT.pom
[withMaven] artifactsPublisher - Archive artifact core-it-support\core-it-plugins\maven-it-plugin-invalid-descriptor\target\maven-it-plugin-invalid-descriptor-2.1-SNAPSHOT.jar under org\apache\maven\its\plugins\maven-it-plugin-invalid-descriptor\2.1-SNAPSHOT\maven-it-plugin-invalid-descriptor-2.1-SNAPSHOT.jar
[withMaven] artifactsPublisher - Archive artifact core-it-support\core-it-plugins\maven-it-plugin-log-file\pom.xml under org\apache\maven\its\plugins\maven-it-plugin-log-file\2.1-SNAPSHOT\maven-it-plugin-log-file-2.1-SNAPSHOT.pom
[withMaven] artifactsPublisher - Archive artifact core-it-support\core-it-plugins\maven-it-plugin-log-file\target\maven-it-plugin-log-file-2.1-SNAPSHOT.jar under org\apache\maven\its\plugins\maven-it-plugin-log-file\2.1-SNAPSHOT\maven-it-plugin-log-file-2.1-SNAPSHOT.jar
[withMaven] artifactsPublisher - Archive artifact core-it-support\maven-it-helper\pom.xml under org\apache\maven\its\maven-it-helper\2.1-SNAPSHOT\maven-it-helper-2.1-SNAPSHOT.pom
[withMaven] artifactsPublisher - Archive artifact core-it-support\maven-it-helper\target\maven-it-helper-2.1-SNAPSHOT.jar under org\apache\maven\its\maven-it-helper\2.1-SNAPSHOT\maven-it-helper-2.1-SNAPSHOT.jar
[withMaven] artifactsPublisher - Archive artifact core-it-support\core-it-plugins\maven-it-plugin-model-interpolation\pom.xml under org\apache\maven\its\plugins\maven-it-plugin-model-interpolation\2.1-SNAPSHOT\maven-it-plugin-model-interpolation-2.1-SNAPSHOT.pom
[withMaven] artifactsPublisher - Archive artifact core-it-support\core-it-plugins\maven-it-plugin-model-interpolation\target\maven-it-plugin-model-interpolation-2.1-SNAPSHOT.jar under org\apache\maven\its\plugins\maven-it-plugin-model-interpolation\2.1-SNAPSHOT\maven-it-plugin-model-interpolation-2.1-SNAPSHOT.jar
[withMaven] artifactsPublisher - Archive artifact core-it-support\core-it-plugins\maven-it-plugin-no-default-comp\pom.xml under org\apache\maven\its\plugins\maven-it-plugin-no-default-comp\2.1-SNAPSHOT\maven-it-plugin-no-default-comp-2.1-SNAPSHOT.pom
[withMaven] artifactsPublisher - Archive artifact core-it-support\core-it-plugins\maven-it-plugin-no-default-comp\target\maven-it-plugin-no-default-comp-2.1-SNAPSHOT.jar under org\apache\maven\its\plugins\maven-it-plugin-no-default-comp\2.1-SNAPSHOT\maven-it-plugin-no-default-comp-2.1-SNAPSHOT.jar
[withMaven] artifactsPublisher - Archive artifact core-it-support\core-it-plugins\maven-it-plugin-no-project\pom.xml under org\apache\maven\its\plugins\maven-it-plugin-no-project\2.1-SNAPSHOT\maven-it-plugin-no-project-2.1-SNAPSHOT.pom
[withMaven] artifactsPublisher - Archive artifact core-it-support\core-it-plugins\maven-it-plugin-no-project\target\maven-it-plugin-no-project-2.1-SNAPSHOT.jar under org\apache\maven\its\plugins\maven-it-plugin-no-project\2.1-SNAPSHOT\maven-it-plugin-no-project-2.1-SNAPSHOT.jar
[withMaven] artifactsPublisher - Archive artifact core-it-support\core-it-plugins\maven-it-plugin-online\pom.xml under org\apache\maven\its\plugins\maven-it-plugin-online\2.1-SNAPSHOT\maven-it-plugin-online-2.1-SNAPSHOT.pom
[withMaven] artifactsPublisher - Archive artifact core-it-support\core-it-plugins\maven-it-plugin-online\target\maven-it-plugin-online-2.1-SNAPSHOT.jar under org\apache\maven\its\plugins\maven-it-plugin-online\2.1-SNAPSHOT\maven-it-plugin-online-2.1-SNAPSHOT.jar
[withMaven] artifactsPublisher - Archive artifact core-it-support\core-it-plugins\maven-it-plugin-optional-mojos\pom.xml under org\apache\maven\its\plugins\maven-it-plugin-optional-mojos\2.1-SNAPSHOT\maven-it-plugin-optional-mojos-2.1-SNAPSHOT.pom
[withMaven] artifactsPublisher - Archive artifact core-it-support\core-it-plugins\maven-it-plugin-optional-mojos\target\maven-it-plugin-optional-mojos-2.1-SNAPSHOT.jar under org\apache\maven\its\plugins\maven-it-plugin-optional-mojos\2.1-SNAPSHOT\maven-it-plugin-optional-mojos-2.1-SNAPSHOT.jar
[withMaven] artifactsPublisher - Archive artifact core-it-support\core-it-plugins\maven-it-plugin-packaging\pom.xml under org\apache\maven\its\plugins\maven-it-plugin-packaging\2.1-SNAPSHOT\maven-it-plugin-packaging-2.1-SNAPSHOT.pom
[withMaven] artifactsPublisher - Archive artifact core-it-support\core-it-plugins\maven-it-plugin-packaging\target\maven-it-plugin-packaging-2.1-SNAPSHOT.jar under org\apache\maven\its\plugins\maven-it-plugin-packaging\2.1-SNAPSHOT\maven-it-plugin-packaging-2.1-SNAPSHOT.jar
[withMaven] artifactsPublisher - Archive artifact core-it-support\core-it-plugins\maven-it-plugin-parameter-implementation\pom.xml under org\apache\maven\its\plugins\maven-it-plugin-parameter-implementation\2.1-SNAPSHOT\maven-it-plugin-parameter-implementation-2.1-SNAPSHOT.pom
[withMaven] artifactsPublisher - Archive artifact core-it-support\core-it-plugins\maven-it-plugin-parameter-implementation\target\maven-it-plugin-parameter-implementation-2.1-SNAPSHOT.jar under org\apache\maven\its\plugins\maven-it-plugin-parameter-implementation\2.1-SNAPSHOT\maven-it-plugin-parameter-implementation-2.1-SNAPSHOT.jar
[withMaven] artifactsPublisher - Archive artifact core-it-support\core-it-plugins\maven-it-plugin-plugin-dependency\pom.xml under org\apache\maven\its\plugins\maven-it-plugin-plugin-dependency\2.1-SNAPSHOT\maven-it-plugin-plugin-dependency-2.1-SNAPSHOT.pom
[withMaven] artifactsPublisher - Archive artifact core-it-support\core-it-plugins\maven-it-plugin-plugin-dependency\target\maven-it-plugin-plugin-dependency-2.1-SNAPSHOT.jar under org\apache\maven\its\plugins\maven-it-plugin-plugin-dependency\2.1-SNAPSHOT\maven-it-plugin-plugin-dependency-2.1-SNAPSHOT.jar
[withMaven] artifactsPublisher - Archive artifact core-it-support\core-it-plugins\maven-it-plugin-project\pom.xml under org\apache\maven\its\plugins\maven-it-plugin-project\2.1-SNAPSHOT\maven-it-plugin-project-2.1-SNAPSHOT.pom
[withMaven] artifactsPublisher - Archive artifact core-it-support\core-it-plugins\maven-it-plugin-project\target\maven-it-plugin-project-2.1-SNAPSHOT.jar under org\apache\maven\its\plugins\maven-it-plugin-project\2.1-SNAPSHOT\maven-it-plugin-project-2.1-SNAPSHOT.jar
[withMaven] artifactsPublisher - Archive artifact core-it-support\core-it-plugins\maven-it-plugin-project-interpolation\pom.xml under org\apache\maven\its\plugins\maven-it-plugin-project-interpolation\2.1-SNAPSHOT\maven-it-plugin-project-interpolation-2.1-SNAPSHOT.pom
[withMaven] artifactsPublisher - Archive artifact core-it-support\core-it-plugins\maven-it-plugin-project-interpolation\target\maven-it-plugin-project-interpolation-2.1-SNAPSHOT.jar under org\apache\maven\its\plugins\maven-it-plugin-project-interpolation\2.1-SNAPSHOT\maven-it-plugin-project-interpolation-2.1-SNAPSHOT.jar
[withMaven] artifactsPublisher - Archive artifact core-it-support\core-it-plugins\maven-it-plugin-setter\pom.xml under org\apache\maven\its\plugins\maven-it-plugin-setter\2.1-SNAPSHOT\maven-it-plugin-setter-2.1-SNAPSHOT.pom
[withMaven] artifactsPublisher - Archive artifact core-it-support\core-it-plugins\maven-it-plugin-setter\target\maven-it-plugin-setter-2.1-SNAPSHOT.jar under org\apache\maven\its\plugins\maven-it-plugin-setter\2.1-SNAPSHOT\maven-it-plugin-setter-2.1-SNAPSHOT.jar
[withMaven] artifactsPublisher - Archive artifact core-it-support\core-it-plugins\maven-it-plugin-singleton-component\pom.xml under org\apache\maven\its\plugins\maven-it-plugin-singleton-component\2.1-SNAPSHOT\maven-it-plugin-singleton-component-2.1-SNAPSHOT.pom
[withMaven] artifactsPublisher - Archive artifact core-it-support\core-it-plugins\maven-it-plugin-singleton-component\target\maven-it-plugin-singleton-component-2.1-SNAPSHOT.jar under org\apache\maven\its\plugins\maven-it-plugin-singleton-component\2.1-SNAPSHOT\maven-it-plugin-singleton-component-2.1-SNAPSHOT.jar
[withMaven] artifactsPublisher - Archive artifact core-it-support\core-it-plugins\maven-it-plugin-site\pom.xml under org\apache\maven\its\plugins\maven-it-plugin-site\2.1-SNAPSHOT\maven-it-plugin-site-2.1-SNAPSHOT.pom
[withMaven] artifactsPublisher - Archive artifact core-it-support\core-it-plugins\maven-it-plugin-site\target\maven-it-plugin-site-2.1-SNAPSHOT.jar under org\apache\maven\its\plugins\maven-it-plugin-site\2.1-SNAPSHOT\maven-it-plugin-site-2.1-SNAPSHOT.jar
[withMaven] artifactsPublisher - Archive artifact core-it-support\core-it-plugins\maven-it-plugin-toolchain\pom.xml under org\apache\maven\its\plugins\maven-it-plugin-toolchain\2.1-SNAPSHOT\maven-it-plugin-toolchain-2.1-SNAPSHOT.pom
[withMaven] artifactsPublisher - Archive artifact core-it-support\core-it-plugins\maven-it-plugin-toolchain\target\maven-it-plugin-toolchain-2.1-SNAPSHOT.jar under org\apache\maven\its\plugins\maven-it-plugin-toolchain\2.1-SNAPSHOT\maven-it-plugin-toolchain-2.1-SNAPSHOT.jar
[withMaven] artifactsPublisher - Archive artifact core-it-support\core-it-plugins\maven-it-plugin-touch\pom.xml under org\apache\maven\its\plugins\maven-it-plugin-touch\2.1-SNAPSHOT\maven-it-plugin-touch-2.1-SNAPSHOT.pom
[withMaven] artifactsPublisher - Archive artifact core-it-support\core-it-plugins\maven-it-plugin-touch\target\maven-it-plugin-touch-2.1-SNAPSHOT.jar under org\apache\maven\its\plugins\maven-it-plugin-touch\2.1-SNAPSHOT\maven-it-plugin-touch-2.1-SNAPSHOT.jar
[withMaven] artifactsPublisher - Archive artifact core-it-support\core-it-plugins\maven-it-plugin-uses-properties\pom.xml under org\apache\maven\its\plugins\maven-it-plugin-uses-properties\2.1-SNAPSHOT\maven-it-plugin-uses-properties-2.1-SNAPSHOT.pom
[withMaven] artifactsPublisher - Archive artifact core-it-support\core-it-plugins\maven-it-plugin-uses-properties\target\maven-it-plugin-uses-properties-2.1-SNAPSHOT.jar under org\apache\maven\its\plugins\maven-it-plugin-uses-properties\2.1-SNAPSHOT\maven-it-plugin-uses-properties-2.1-SNAPSHOT.jar
[withMaven] artifactsPublisher - Archive artifact core-it-support\core-it-plugins\maven-it-plugin-uses-wagon\pom.xml under org\apache\maven\its\plugins\maven-it-plugin-uses-wagon\2.1-SNAPSHOT\maven-it-plugin-uses-wagon-2.1-SNAPSHOT.pom
[Pipeline] }
[Pipeline] // dir
[Pipeline] }
[Pipeline] // stage
[Pipeline] }
[Pipeline] // node
[Pipeline] }
[withMaven] artifactsPublisher - Archive artifact core-it-support\core-it-plugins\maven-it-plugin-uses-wagon\target\maven-it-plugin-uses-wagon-2.1-SNAPSHOT.jar under org\apache\maven\its\plugins\maven-it-plugin-uses-wagon\2.1-SNAPSHOT\maven-it-plugin-uses-wagon-2.1-SNAPSHOT.jar
[withMaven] artifactsPublisher - Archive artifact core-it-support\core-it-plugins\maven-it-plugin-all\pom.xml under org\apache\maven\its\plugins\maven-it-plugin-all\2.1-SNAPSHOT\maven-it-plugin-all-2.1-SNAPSHOT.pom
[withMaven] artifactsPublisher - Archive artifact core-it-support\core-it-plugins\maven-it-plugin-all\target\maven-it-plugin-all-2.1-SNAPSHOT.jar under org\apache\maven\its\plugins\maven-it-plugin-all\2.1-SNAPSHOT\maven-it-plugin-all-2.1-SNAPSHOT.jar
[withMaven] artifactsPublisher - Archive artifact core-it-support\core-it-plugins\maven-it-plugin-plexus-utils-11\pom.xml under org\apache\maven\its\plugins\maven-it-plugin-plexus-utils-11\2.1-SNAPSHOT\maven-it-plugin-plexus-utils-11-2.1-SNAPSHOT.pom
[withMaven] artifactsPublisher - Archive artifact core-it-support\core-it-plugins\maven-it-plugin-plexus-utils-11\target\maven-it-plugin-plexus-utils-11-2.1-SNAPSHOT.jar under org\apache\maven\its\plugins\maven-it-plugin-plexus-utils-11\2.1-SNAPSHOT\maven-it-plugin-plexus-utils-11-2.1-SNAPSHOT.jar
[withMaven] artifactsPublisher - Archive artifact core-it-support\core-it-plugins\maven-it-plugin-plexus-utils-new\pom.xml under org\apache\maven\its\plugins\maven-it-plugin-plexus-utils-new\2.1-SNAPSHOT\maven-it-plugin-plexus-utils-new-2.1-SNAPSHOT.pom
[withMaven] artifactsPublisher - Archive artifact core-it-support\core-it-plugins\maven-it-plugin-plexus-utils-new\target\maven-it-plugin-plexus-utils-new-2.1-SNAPSHOT.jar under org\apache\maven\its\plugins\maven-it-plugin-plexus-utils-new\2.1-SNAPSHOT\maven-it-plugin-plexus-utils-new-2.1-SNAPSHOT.jar
[withMaven] artifactsPublisher - Archive artifact core-it-support\core-it-plugins\maven-it-plugin-plexus-component-api\pom.xml under org\apache\maven\its\plugins\maven-it-plugin-plexus-component-api\2.1-SNAPSHOT\maven-it-plugin-plexus-component-api-2.1-SNAPSHOT.pom
[withMaven] artifactsPublisher - Archive artifact core-it-support\core-it-plugins\maven-it-plugin-plexus-component-api\target\maven-it-plugin-plexus-component-api-2.1-SNAPSHOT.jar under org\apache\maven\its\plugins\maven-it-plugin-plexus-component-api\2.1-SNAPSHOT\maven-it-plugin-plexus-component-api-2.1-SNAPSHOT.jar
[withMaven] artifactsPublisher - Archive artifact core-it-support\core-it-plugins\maven-it-plugin-log4j\pom.xml under org\apache\maven\its\plugins\maven-it-plugin-log4j\2.1-SNAPSHOT\maven-it-plugin-log4j-2.1-SNAPSHOT.pom
[withMaven] artifactsPublisher - Archive artifact core-it-support\core-it-plugins\maven-it-plugin-log4j\target\maven-it-plugin-log4j-2.1-SNAPSHOT.jar under org\apache\maven\its\plugins\maven-it-plugin-log4j\2.1-SNAPSHOT\maven-it-plugin-log4j-2.1-SNAPSHOT.jar
[withMaven] artifactsPublisher - Archive artifact core-it-support\core-it-plugins\maven-it-plugin-extension1\pom.xml under org\apache\maven\its\plugins\maven-it-plugin-extension1\2.1-SNAPSHOT\maven-it-plugin-extension1-2.1-SNAPSHOT.pom
[withMaven] artifactsPublisher - Archive artifact core-it-support\core-it-plugins\maven-it-plugin-extension1\target\maven-it-plugin-extension1-2.1-SNAPSHOT.jar under org\apache\maven\its\plugins\maven-it-plugin-extension1\2.1-SNAPSHOT\maven-it-plugin-extension1-2.1-SNAPSHOT.jar
[withMaven] artifactsPublisher - Archive artifact core-it-support\core-it-plugins\maven-it-plugin-extension2\pom.xml under org\apache\maven\its\plugins\maven-it-plugin-extension2\2.1-SNAPSHOT\maven-it-plugin-extension2-2.1-SNAPSHOT.pom
[withMaven] artifactsPublisher - Archive artifact core-it-support\core-it-plugins\maven-it-plugin-extension2\target\maven-it-plugin-extension2-2.1-SNAPSHOT.jar under org\apache\maven\its\plugins\maven-it-plugin-extension2\2.1-SNAPSHOT\maven-it-plugin-extension2-2.1-SNAPSHOT.jar
[withMaven] artifactsPublisher - Archive artifact core-it-support\core-it-plugins\maven-it-plugin-plexus-lifecycle\pom.xml under org\apache\maven\its\plugins\maven-it-plugin-plexus-lifecycle\2.1-SNAPSHOT\maven-it-plugin-plexus-lifecycle-2.1-SNAPSHOT.pom
[withMaven] artifactsPublisher - Archive artifact core-it-support\core-it-plugins\maven-it-plugin-plexus-lifecycle\target\maven-it-plugin-plexus-lifecycle-2.1-SNAPSHOT.jar under org\apache\maven\its\plugins\maven-it-plugin-plexus-lifecycle\2.1-SNAPSHOT\maven-it-plugin-plexus-lifecycle-2.1-SNAPSHOT.jar
[withMaven] artifactsPublisher - Archive artifact core-it-support\core-it-plugins\maven-it-plugin-settings\pom.xml under org\apache\maven\its\plugins\maven-it-plugin-settings\2.1-SNAPSHOT\maven-it-plugin-settings-2.1-SNAPSHOT.pom
[withMaven] artifactsPublisher - Archive artifact core-it-support\core-it-plugins\maven-it-plugin-settings\target\maven-it-plugin-settings-2.1-SNAPSHOT.jar under org\apache\maven\its\plugins\maven-it-plugin-settings\2.1-SNAPSHOT\maven-it-plugin-settings-2.1-SNAPSHOT.jar
[withMaven] artifactsPublisher - Archive artifact core-it-support\core-it-plugins\mng5805-extension\pom.xml under org\apache\maven\its\plugins\mng-5805-pkg-type-mojo-configuration-extension\2.1-SNAPSHOT\mng-5805-pkg-type-mojo-configuration-extension-2.1-SNAPSHOT.pom
[withMaven] artifactsPublisher - Archive artifact core-it-support\core-it-plugins\mng5805-extension\target\mng-5805-pkg-type-mojo-configuration-extension-2.1-SNAPSHOT.jar under org\apache\maven\its\plugins\mng-5805-pkg-type-mojo-configuration-extension\2.1-SNAPSHOT\mng-5805-pkg-type-mojo-configuration-extension-2.1-SNAPSHOT.jar
[withMaven] artifactsPublisher - Archive artifact core-it-support\core-it-plugins\mng5805-extension2\pom.xml under org\apache\maven\its\plugins\mng-5805-pkg-type-mojo-configuration-extension2\2.1-SNAPSHOT\mng-5805-pkg-type-mojo-configuration-extension2-2.1-SNAPSHOT.pom
[withMaven] artifactsPublisher - Archive artifact core-it-support\core-it-plugins\mng5805-extension2\target\mng-5805-pkg-type-mojo-configuration-extension2-2.1-SNAPSHOT.jar under org\apache\maven\its\plugins\mng-5805-pkg-type-mojo-configuration-extension2\2.1-SNAPSHOT\mng-5805-pkg-type-mojo-configuration-extension2-2.1-SNAPSHOT.jar
[withMaven] artifactsPublisher - Archive artifact core-it-support\core-it-plugins\mng5805-plugin\pom.xml under org\apache\maven\its\plugins\mng-5805-pkg-type-mojo-configuration-plugin\2.1-SNAPSHOT\mng-5805-pkg-type-mojo-configuration-plugin-2.1-SNAPSHOT.pom
[withMaven] artifactsPublisher - Archive artifact core-it-support\core-it-plugins\mng5805-plugin\target\mng-5805-pkg-type-mojo-configuration-plugin-2.1-SNAPSHOT.jar under org\apache\maven\its\plugins\mng-5805-pkg-type-mojo-configuration-plugin\2.1-SNAPSHOT\mng-5805-pkg-type-mojo-configuration-plugin-2.1-SNAPSHOT.jar
[withMaven] artifactsPublisher - Archive artifact core-it-support\core-it-plugins\mng5805-plugin-dep\pom.xml under org\apache\maven\its\plugins\mng-5805-pkg-type-mojo-configuration-plugin-dep\2.1-SNAPSHOT\mng-5805-pkg-type-mojo-configuration-plugin-dep-2.1-SNAPSHOT.pom
[withMaven] artifactsPublisher - Archive artifact core-it-support\core-it-plugins\mng5805-plugin-dep\target\mng-5805-pkg-type-mojo-configuration-plugin-dep-2.1-SNAPSHOT.jar under org\apache\maven\its\plugins\mng-5805-pkg-type-mojo-configuration-plugin-dep\2.1-SNAPSHOT\mng-5805-pkg-type-mojo-configuration-plugin-dep-2.1-SNAPSHOT.jar
[withMaven] artifactsPublisher - Archive artifact core-it-support\core-it-plugins\mng5958-extension\pom.xml under org\apache\maven\its\plugins\mng-5958-pkg-type-extension\2.1-SNAPSHOT\mng-5958-pkg-type-extension-2.1-SNAPSHOT.pom
[withMaven] artifactsPublisher - Archive artifact core-it-support\core-it-plugins\mng5958-extension\target\mng-5958-pkg-type-extension-2.1-SNAPSHOT.jar under org\apache\maven\its\plugins\mng-5958-pkg-type-extension\2.1-SNAPSHOT\mng-5958-pkg-type-extension-2.1-SNAPSHOT.jar
[withMaven] artifactsPublisher - Archive artifact core-it-support\core-it-plugins\mng6759-plugin-resolves-project-dependencies\pom.xml under org\apache\maven\its\plugins\mng-6759-resolves-project-dependencies-plugin\2.1-SNAPSHOT\mng-6759-resolves-project-dependencies-plugin-2.1-SNAPSHOT.pom
[withMaven] artifactsPublisher - Archive artifact core-it-support\core-it-plugins\mng6759-plugin-resolves-project-dependencies\target\mng-6759-resolves-project-dependencies-plugin-2.1-SNAPSHOT.jar under org\apache\maven\its\plugins\mng-6759-resolves-project-dependencies-plugin\2.1-SNAPSHOT\mng-6759-resolves-project-dependencies-plugin-2.1-SNAPSHOT.jar
[withMaven] artifactsPublisher - Archive artifact core-it-support\core-it-toolchain\pom.xml under org\apache\maven\its\core-it-toolchain\2.1-SNAPSHOT\core-it-toolchain-2.1-SNAPSHOT.pom
[withMaven] artifactsPublisher - Archive artifact core-it-support\core-it-toolchain\target\core-it-toolchain-2.1-SNAPSHOT.jar under org\apache\maven\its\core-it-toolchain\2.1-SNAPSHOT\core-it-toolchain-2.1-SNAPSHOT.jar
[withMaven] artifactsPublisher - Archive artifact core-it-support\core-it-wagon\pom.xml under org\apache\maven\its\core-it-wagon\2.1-SNAPSHOT\core-it-wagon-2.1-SNAPSHOT.pom
[withMaven] artifactsPublisher - Archive artifact core-it-support\core-it-wagon\target\core-it-wagon-2.1-SNAPSHOT.jar under org\apache\maven\its\core-it-wagon\2.1-SNAPSHOT\core-it-wagon-2.1-SNAPSHOT.jar
[withMaven] artifactsPublisher - Archive artifact core-it-support\core-it-support-artifacts\pom.xml under org\apache\maven\its\core-it-support-artifacts\2.1-SNAPSHOT\core-it-support-artifacts-2.1-SNAPSHOT.pom
[withMaven] artifactsPublisher - Archive artifact core-it-support\core-it-support-artifacts\target\core-it-support-artifacts-2.1-SNAPSHOT-repo.zip under org\apache\maven\its\core-it-support-artifacts\2.1-SNAPSHOT\core-it-support-artifacts-2.1-SNAPSHOT-repo.zip
[withMaven] artifactsPublisher - Archive artifact core-it-support\core-it-extension\pom.xml under org\apache\maven\its\core-it-extension\2.1-SNAPSHOT\core-it-extension-2.1-SNAPSHOT.pom
[withMaven] artifactsPublisher - Archive artifact core-it-support\core-it-extension\target\core-it-extension-2.1-SNAPSHOT.jar under org\apache\maven\its\core-it-extension\2.1-SNAPSHOT\core-it-extension-2.1-SNAPSHOT.jar
[withMaven] artifactsPublisher - Archive artifact core-it-support\core-it-javaagent\pom.xml under mng-coreit\javaagent\1.0-SNAPSHOT\javaagent-1.0-SNAPSHOT.pom
[withMaven] artifactsPublisher - Archive artifact core-it-support\core-it-javaagent\target\javaagent-1.0-SNAPSHOT.jar under mng-coreit\javaagent\1.0-SNAPSHOT\javaagent-1.0-SNAPSHOT.jar
[withMaven] artifactsPublisher - Archive artifact core-it-suite\pom.xml under org\apache\maven\its\core-it-suite\2.1-SNAPSHOT\core-it-suite-2.1-SNAPSHOT.pom
[withMaven] artifactsPublisher - Archive artifact core-it-suite\target\core-it-suite-2.1-SNAPSHOT.jar under org\apache\maven\its\core-it-suite\2.1-SNAPSHOT\core-it-suite-2.1-SNAPSHOT.jar
[withMaven] artifactsPublisher - Archive artifact core-it-suite\target\core-it-suite-2.1-SNAPSHOT-tests.jar under org\apache\maven\its\core-it-suite\2.1-SNAPSHOT\core-it-suite-2.1-SNAPSHOT-tests.jar
[Fast Archiver] Compressed 9.65 MB of artifacts by 32.4% relative to #4
[withMaven] junitPublisher - Archive test results for Maven artifact org.apache.maven.its.plugins:maven-it-plugin-active-collection:maven-plugin:2.1-SNAPSHOT generated by maven-surefire-plugin:test (default-test): core-it-support\core-it-plugins\maven-it-plugin-active-collection\target\surefire-reports\*.xml
[withMaven] junitPublisher - Archive test results for Maven artifact org.apache.maven.its.plugins:maven-it-plugin-ant-based:maven-plugin:2.1-SNAPSHOT generated by maven-surefire-plugin:test (default-test): core-it-support\core-it-plugins\maven-it-plugin-ant-based\target\surefire-reports\*.xml
[withMaven] junitPublisher - Archive test results for Maven artifact org.apache.maven.its.plugins:maven-it-plugin-artifact:maven-plugin:2.1-SNAPSHOT generated by maven-surefire-plugin:test (default-test): core-it-support\core-it-plugins\maven-it-plugin-artifact\target\surefire-reports\*.xml
[withMaven] junitPublisher - Archive test results for Maven artifact org.apache.maven.its.plugins.class-loader:dep-a:jar:2.1-SNAPSHOT generated by maven-surefire-plugin:test (default-test): core-it-support\core-it-plugins\maven-it-plugin-class-loader\dep-a\target\surefire-reports\*.xml
[withMaven] junitPublisher - Archive test results for Maven artifact org.apache.maven.its.plugins.class-loader:dep-b:jar:2.1-SNAPSHOT generated by maven-surefire-plugin:test (default-test): core-it-support\core-it-plugins\maven-it-plugin-class-loader\dep-b\target\surefire-reports\*.xml
[withMaven] junitPublisher - Archive test results for Maven artifact org.apache.maven.its.plugins.class-loader:dep-c:jar:2.1-SNAPSHOT generated by maven-surefire-plugin:test (default-test): core-it-support\core-it-plugins\maven-it-plugin-class-loader\dep-c\target\surefire-reports\*.xml
[withMaven] junitPublisher - Archive test results for Maven artifact org.apache.maven.its.plugins:maven-it-plugin-class-loader:maven-plugin:2.1-SNAPSHOT generated by maven-surefire-plugin:test (default-test): core-it-support\core-it-plugins\maven-it-plugin-class-loader\maven-it-plugin-class-loader\target\surefire-reports\*.xml
[withMaven] junitPublisher - Archive test results for Maven artifact org.apache.maven.its.plugins:maven-it-plugin-configuration:maven-plugin:2.1-SNAPSHOT generated by maven-surefire-plugin:test (default-test): core-it-support\core-it-plugins\maven-it-plugin-configuration\target\surefire-reports\*.xml
[withMaven] junitPublisher - Archive test results for Maven artifact org.apache.maven.its.plugins:maven-it-plugin-context-passing:maven-plugin:2.1-SNAPSHOT generated by maven-surefire-plugin:test (default-test): core-it-support\core-it-plugins\maven-it-plugin-context-passing\target\surefire-reports\*.xml
[withMaven] junitPublisher - Archive test results for Maven artifact org.apache.maven.plugins:maven-clean-plugin:maven-plugin:0.1-stub-SNAPSHOT generated by maven-surefire-plugin:test (default-test): core-it-support\core-it-plugins\maven-it-plugin-core-stubs\maven-clean-plugin\target\surefire-reports\*.xml
[withMaven] junitPublisher - Archive test results for Maven artifact org.apache.maven.plugins:maven-compiler-plugin:maven-plugin:0.1-stub-SNAPSHOT generated by maven-surefire-plugin:test (default-test): core-it-support\core-it-plugins\maven-it-plugin-core-stubs\maven-compiler-plugin\target\surefire-reports\*.xml
[withMaven] junitPublisher - Archive test results for Maven artifact org.apache.maven.plugins:maven-deploy-plugin:maven-plugin:0.1-stub-SNAPSHOT generated by maven-surefire-plugin:test (default-test): core-it-support\core-it-plugins\maven-it-plugin-core-stubs\maven-deploy-plugin\target\surefire-reports\*.xml
[withMaven] junitPublisher - Archive test results for Maven artifact org.apache.maven.plugins:maven-ear-plugin:maven-plugin:0.1-stub-SNAPSHOT generated by maven-surefire-plugin:test (default-test): core-it-support\core-it-plugins\maven-it-plugin-core-stubs\maven-ear-plugin\target\surefire-reports\*.xml
[withMaven] junitPublisher - Archive test results for Maven artifact org.apache.maven.plugins:maven-ejb-plugin:maven-plugin:0.1-stub-SNAPSHOT generated by maven-surefire-plugin:test (default-test): core-it-support\core-it-plugins\maven-it-plugin-core-stubs\maven-ejb-plugin\target\surefire-reports\*.xml
[withMaven] junitPublisher - Archive test results for Maven artifact org.apache.maven.plugins:maven-install-plugin:maven-plugin:0.1-stub-SNAPSHOT generated by maven-surefire-plugin:test (default-test): core-it-support\core-it-plugins\maven-it-plugin-core-stubs\maven-install-plugin\target\surefire-reports\*.xml
[withMaven] junitPublisher - Archive test results for Maven artifact org.apache.maven.plugins:maven-jar-plugin:maven-plugin:0.1-stub-SNAPSHOT generated by maven-surefire-plugin:test (default-test): core-it-support\core-it-plugins\maven-it-plugin-core-stubs\maven-jar-plugin\target\surefire-reports\*.xml
[withMaven] junitPublisher - Archive test results for Maven artifact org.apache.maven.plugins:maven-javadoc-plugin:maven-plugin:0.1-stub-SNAPSHOT generated by maven-surefire-plugin:test (default-test): core-it-support\core-it-plugins\maven-it-plugin-core-stubs\maven-javadoc-plugin\target\surefire-reports\*.xml
[withMaven] junitPublisher - Archive test results for Maven artifact org.apache.maven.plugins:maven-plugin-plugin:maven-plugin:0.1-stub-SNAPSHOT generated by maven-surefire-plugin:test (default-test): core-it-support\core-it-plugins\maven-it-plugin-core-stubs\maven-plugin-plugin\target\surefire-reports\*.xml
[withMaven] junitPublisher - Archive test results for Maven artifact org.apache.maven.plugins:maven-rar-plugin:maven-plugin:0.1-stub-SNAPSHOT generated by maven-surefire-plugin:test (default-test): core-it-support\core-it-plugins\maven-it-plugin-core-stubs\maven-rar-plugin\target\surefire-reports\*.xml
[withMaven] junitPublisher - Archive test results for Maven artifact org.apache.maven.plugins:maven-resources-plugin:maven-plugin:0.1-stub-SNAPSHOT generated by maven-surefire-plugin:test (default-test): core-it-support\core-it-plugins\maven-it-plugin-core-stubs\maven-resources-plugin\target\surefire-reports\*.xml
[withMaven] junitPublisher - Archive test results for Maven artifact org.apache.maven.plugins:maven-site-plugin:maven-plugin:0.1-stub-SNAPSHOT generated by maven-surefire-plugin:test (default-test): core-it-support\core-it-plugins\maven-it-plugin-core-stubs\maven-site-plugin\target\surefire-reports\*.xml
[withMaven] junitPublisher - Archive test results for Maven artifact org.apache.maven.plugins:maven-source-plugin:maven-plugin:0.1-stub-SNAPSHOT generated by maven-surefire-plugin:test (default-test): core-it-support\core-it-plugins\maven-it-plugin-core-stubs\maven-source-plugin\target\surefire-reports\*.xml
[withMaven] junitPublisher - Archive test results for Maven artifact org.apache.maven.plugins:maven-surefire-plugin:maven-plugin:0.1-stub-SNAPSHOT generated by maven-surefire-plugin:test (default-test): core-it-support\core-it-plugins\maven-it-plugin-core-stubs\maven-surefire-plugin\target\surefire-reports\*.xml
[withMaven] junitPublisher - Archive test results for Maven artifact org.apache.maven.plugins:maven-war-plugin:maven-plugin:0.1-stub-SNAPSHOT generated by maven-surefire-plugin:test (default-test): core-it-support\core-it-plugins\maven-it-plugin-core-stubs\maven-war-plugin\target\surefire-reports\*.xml
[withMaven] junitPublisher - Archive test results for Maven artifact org.apache.maven.its.plugins:maven-it-plugin-dependency-collection:maven-plugin:2.1-SNAPSHOT generated by maven-surefire-plugin:test (default-test): core-it-support\core-it-plugins\maven-it-plugin-dependency-collection\target\surefire-reports\*.xml
[withMaven] junitPublisher - Archive test results for Maven artifact org.apache.maven.its.plugins:maven-it-plugin-dependency-resolution:maven-plugin:2.1-SNAPSHOT generated by maven-surefire-plugin:test (default-test): core-it-support\core-it-plugins\maven-it-plugin-dependency-resolution\target\surefire-reports\*.xml
[withMaven] junitPublisher - Archive test results for Maven artifact org.apache.maven.its.plugins:maven-it-plugin-expression:maven-plugin:2.1-SNAPSHOT generated by maven-surefire-plugin:test (default-test): core-it-support\core-it-plugins\maven-it-plugin-expression\target\surefire-reports\*.xml
[withMaven] junitPublisher - Archive test results for Maven artifact org.apache.maven.its.plugins:maven-it-plugin-error:maven-plugin:2.1-SNAPSHOT generated by maven-surefire-plugin:test (default-test): core-it-support\core-it-plugins\maven-it-plugin-error\target\surefire-reports\*.xml
[withMaven] junitPublisher - Archive test results for Maven artifact org.apache.maven.its:core-it-component:jar:2.1-SNAPSHOT generated by maven-surefire-plugin:test (default-test): core-it-support\core-it-component\target\surefire-reports\*.xml
[withMaven] junitPublisher - Archive test results for Maven artifact org.apache.maven.its.plugins:maven-it-plugin-extension-consumer:maven-plugin:2.1-SNAPSHOT generated by maven-surefire-plugin:test (default-test): core-it-support\core-it-plugins\maven-it-plugin-extension-consumer\target\surefire-reports\*.xml
[withMaven] junitPublisher - Archive test results for Maven artifact org.apache.maven.its.plugins:maven-it-plugin-extension-provider:maven-plugin:2.1-SNAPSHOT generated by maven-surefire-plugin:test (default-test): core-it-support\core-it-plugins\maven-it-plugin-extension-provider\target\surefire-reports\*.xml
[withMaven] junitPublisher - Archive test results for Maven artifact org.apache.maven.its.plugins:maven-it-plugin-fork:maven-plugin:2.1-SNAPSHOT generated by maven-surefire-plugin:test (default-test): core-it-support\core-it-plugins\maven-it-plugin-fork\target\surefire-reports\*.xml
[withMaven] junitPublisher - Archive test results for Maven artifact org.apache.maven.its.plugins:maven-it-plugin-invalid-descriptor:maven-plugin:2.1-SNAPSHOT generated by maven-surefire-plugin:test (default-test): core-it-support\core-it-plugins\maven-it-plugin-invalid-descriptor\target\surefire-reports\*.xml
[withMaven] junitPublisher - Archive test results for Maven artifact org.apache.maven.its.plugins:maven-it-plugin-log-file:maven-plugin:2.1-SNAPSHOT generated by maven-surefire-plugin:test (default-test): core-it-support\core-it-plugins\maven-it-plugin-log-file\target\surefire-reports\*.xml
[withMaven] junitPublisher - Archive test results for Maven artifact org.apache.maven.its:maven-it-helper:jar:2.1-SNAPSHOT generated by maven-surefire-plugin:test (default-test): core-it-support\maven-it-helper\target\surefire-reports\*.xml
[withMaven] junitPublisher - Archive test results for Maven artifact org.apache.maven.its.plugins:maven-it-plugin-model-interpolation:maven-plugin:2.1-SNAPSHOT generated by maven-surefire-plugin:test (default-test): core-it-support\core-it-plugins\maven-it-plugin-model-interpolation\target\surefire-reports\*.xml
[withMaven] junitPublisher - Archive test results for Maven artifact org.apache.maven.its.plugins:maven-it-plugin-no-default-comp:maven-plugin:2.1-SNAPSHOT generated by maven-surefire-plugin:test (default-test): core-it-support\core-it-plugins\maven-it-plugin-no-default-comp\target\surefire-reports\*.xml
[withMaven] junitPublisher - Archive test results for Maven artifact org.apache.maven.its.plugins:maven-it-plugin-no-project:maven-plugin:2.1-SNAPSHOT generated by maven-surefire-plugin:test (default-test): core-it-support\core-it-plugins\maven-it-plugin-no-project\target\surefire-reports\*.xml
[withMaven] junitPublisher - Archive test results for Maven artifact org.apache.maven.its.plugins:maven-it-plugin-online:maven-plugin:2.1-SNAPSHOT generated by maven-surefire-plugin:test (default-test): core-it-support\core-it-plugins\maven-it-plugin-online\target\surefire-reports\*.xml
[withMaven] junitPublisher - Archive test results for Maven artifact org.apache.maven.its.plugins:maven-it-plugin-optional-mojos:maven-plugin:2.1-SNAPSHOT generated by maven-surefire-plugin:test (default-test): core-it-support\core-it-plugins\maven-it-plugin-optional-mojos\target\surefire-reports\*.xml
[withMaven] junitPublisher - Archive test results for Maven artifact org.apache.maven.its.plugins:maven-it-plugin-packaging:maven-plugin:2.1-SNAPSHOT generated by maven-surefire-plugin:test (default-test): core-it-support\core-it-plugins\maven-it-plugin-packaging\target\surefire-reports\*.xml
[withMaven] junitPublisher - Archive test results for Maven artifact org.apache.maven.its.plugins:maven-it-plugin-parameter-implementation:maven-plugin:2.1-SNAPSHOT generated by maven-surefire-plugin:test (default-test): core-it-support\core-it-plugins\maven-it-plugin-parameter-implementation\target\surefire-reports\*.xml
[withMaven] junitPublisher - Archive test results for Maven artifact org.apache.maven.its.plugins:maven-it-plugin-plugin-dependency:maven-plugin:2.1-SNAPSHOT generated by maven-surefire-plugin:test (default-test): core-it-support\core-it-plugins\maven-it-plugin-plugin-dependency\target\surefire-reports\*.xml
[withMaven] junitPublisher - Archive test results for Maven artifact org.apache.maven.its.plugins:maven-it-plugin-project:maven-plugin:2.1-SNAPSHOT generated by maven-surefire-plugin:test (default-test): core-it-support\core-it-plugins\maven-it-plugin-project\target\surefire-reports\*.xml
[withMaven] junitPublisher - Archive test results for Maven artifact org.apache.maven.its.plugins:maven-it-plugin-project-interpolation:maven-plugin:2.1-SNAPSHOT generated by maven-surefire-plugin:test (default-test): core-it-support\core-it-plugins\maven-it-plugin-project-interpolation\target\surefire-reports\*.xml
[withMaven] junitPublisher - Archive test results for Maven artifact org.apache.maven.its.plugins:maven-it-plugin-setter:maven-plugin:2.1-SNAPSHOT generated by maven-surefire-plugin:test (default-test): core-it-support\core-it-plugins\maven-it-plugin-setter\target\surefire-reports\*.xml
[withMaven] junitPublisher - Archive test results for Maven artifact org.apache.maven.its.plugins:maven-it-plugin-singleton-component:maven-plugin:2.1-SNAPSHOT generated by maven-surefire-plugin:test (default-test): core-it-support\core-it-plugins\maven-it-plugin-singleton-component\target\surefire-reports\*.xml
[withMaven] junitPublisher - Archive test results for Maven artifact org.apache.maven.its.plugins:maven-it-plugin-site:maven-plugin:2.1-SNAPSHOT generated by maven-surefire-plugin:test (default-test): core-it-support\core-it-plugins\maven-it-plugin-site\target\surefire-reports\*.xml
[withMaven] junitPublisher - Archive test results for Maven artifact org.apache.maven.its.plugins:maven-it-plugin-toolchain:maven-plugin:2.1-SNAPSHOT generated by maven-surefire-plugin:test (default-test): core-it-support\core-it-plugins\maven-it-plugin-toolchain\target\surefire-reports\*.xml
[withMaven] junitPublisher - Archive test results for Maven artifact org.apache.maven.its.plugins:maven-it-plugin-touch:maven-plugin:2.1-SNAPSHOT generated by maven-surefire-plugin:test (default-test): core-it-support\core-it-plugins\maven-it-plugin-touch\target\surefire-reports\*.xml
[withMaven] junitPublisher - Archive test results for Maven artifact org.apache.maven.its.plugins:maven-it-plugin-uses-properties:maven-plugin:2.1-SNAPSHOT generated by maven-surefire-plugin:test (default-test): core-it-support\core-it-plugins\maven-it-plugin-uses-properties\target\surefire-reports\*.xml
[withMaven] junitPublisher - Archive test results for Maven artifact org.apache.maven.its.plugins:maven-it-plugin-uses-wagon:maven-plugin:2.1-SNAPSHOT generated by maven-surefire-plugin:test (default-test): core-it-support\core-it-plugins\maven-it-plugin-uses-wagon\target\surefire-reports\*.xml
[withMaven] junitPublisher - Archive test results for Maven artifact org.apache.maven.its.plugins:maven-it-plugin-all:maven-plugin:2.1-SNAPSHOT generated by maven-surefire-plugin:test (default-test): core-it-support\core-it-plugins\maven-it-plugin-all\target\surefire-reports\*.xml
[withMaven] junitPublisher - Archive test results for Maven artifact org.apache.maven.its.plugins:maven-it-plugin-plexus-utils-11:maven-plugin:2.1-SNAPSHOT generated by maven-surefire-plugin:test (default-test): core-it-support\core-it-plugins\maven-it-plugin-plexus-utils-11\target\surefire-reports\*.xml
[withMaven] junitPublisher - Archive test results for Maven artifact org.apache.maven.its.plugins:maven-it-plugin-plexus-utils-new:maven-plugin:2.1-SNAPSHOT generated by maven-surefire-plugin:test (default-test): core-it-support\core-it-plugins\maven-it-plugin-plexus-utils-new\target\surefire-reports\*.xml
[withMaven] junitPublisher - Archive test results for Maven artifact org.apache.maven.its.plugins:maven-it-plugin-plexus-component-api:maven-plugin:2.1-SNAPSHOT generated by maven-surefire-plugin:test (default-test): core-it-support\core-it-plugins\maven-it-plugin-plexus-component-api\target\surefire-reports\*.xml
[withMaven] junitPublisher - Archive test results for Maven artifact org.apache.maven.its.plugins:maven-it-plugin-log4j:maven-plugin:2.1-SNAPSHOT generated by maven-surefire-plugin:test (default-test): core-it-support\core-it-plugins\maven-it-plugin-log4j\target\surefire-reports\*.xml
[withMaven] junitPublisher - Archive test results for Maven artifact org.apache.maven.its.plugins:maven-it-plugin-extension1:maven-plugin:2.1-SNAPSHOT generated by maven-surefire-plugin:test (default-test): core-it-support\core-it-plugins\maven-it-plugin-extension1\target\surefire-reports\*.xml
[withMaven] junitPublisher - Archive test results for Maven artifact org.apache.maven.its.plugins:maven-it-plugin-extension2:maven-plugin:2.1-SNAPSHOT generated by maven-surefire-plugin:test (default-test): core-it-support\core-it-plugins\maven-it-plugin-extension2\target\surefire-reports\*.xml
[withMaven] junitPublisher - Archive test results for Maven artifact org.apache.maven.its.plugins:maven-it-plugin-plexus-lifecycle:maven-plugin:2.1-SNAPSHOT generated by maven-surefire-plugin:test (default-test): core-it-support\core-it-plugins\maven-it-plugin-plexus-lifecycle\target\surefire-reports\*.xml
[withMaven] junitPublisher - Archive test results for Maven artifact org.apache.maven.its.plugins:maven-it-plugin-settings:maven-plugin:2.1-SNAPSHOT generated by maven-surefire-plugin:test (default-test): core-it-support\core-it-plugins\maven-it-plugin-settings\target\surefire-reports\*.xml
[withMaven] junitPublisher - Archive test results for Maven artifact org.apache.maven.its.plugins:mng-5805-pkg-type-mojo-configuration-extension:jar:2.1-SNAPSHOT generated by maven-surefire-plugin:test (default-test): core-it-support\core-it-plugins\mng5805-extension\target\surefire-reports\*.xml
[withMaven] junitPublisher - Archive test results for Maven artifact org.apache.maven.its.plugins:mng-5805-pkg-type-mojo-configuration-extension2:jar:2.1-SNAPSHOT generated by maven-surefire-plugin:test (default-test): core-it-support\core-it-plugins\mng5805-extension2\target\surefire-reports\*.xml
[withMaven] junitPublisher - Archive test results for Maven artifact org.apache.maven.its.plugins:mng-5805-pkg-type-mojo-configuration-plugin:maven-plugin:2.1-SNAPSHOT generated by maven-surefire-plugin:test (default-test): core-it-support\core-it-plugins\mng5805-plugin\target\surefire-reports\*.xml
[withMaven] junitPublisher - Archive test results for Maven artifact org.apache.maven.its.plugins:mng-5805-pkg-type-mojo-configuration-plugin-dep:jar:2.1-SNAPSHOT generated by maven-surefire-plugin:test (default-test): core-it-support\core-it-plugins\mng5805-plugin-dep\target\surefire-reports\*.xml
[withMaven] junitPublisher - Archive test results for Maven artifact org.apache.maven.its.plugins:mng-5958-pkg-type-extension:jar:2.1-SNAPSHOT generated by maven-surefire-plugin:test (default-test): core-it-support\core-it-plugins\mng5958-extension\target\surefire-reports\*.xml
[withMaven] junitPublisher - Archive test results for Maven artifact org.apache.maven.its.plugins:mng-6759-resolves-project-dependencies-plugin:maven-plugin:2.1-SNAPSHOT generated by maven-surefire-plugin:test (default-test): core-it-support\core-it-plugins\mng6759-plugin-resolves-project-dependencies\target\surefire-reports\*.xml
[withMaven] junitPublisher - Archive test results for Maven artifact org.apache.maven.its:core-it-toolchain:jar:2.1-SNAPSHOT generated by maven-surefire-plugin:test (default-test): core-it-support\core-it-toolchain\target\surefire-reports\*.xml
[withMaven] junitPublisher - Archive test results for Maven artifact org.apache.maven.its:core-it-wagon:jar:2.1-SNAPSHOT generated by maven-surefire-plugin:test (default-test): core-it-support\core-it-wagon\target\surefire-reports\*.xml
[withMaven] junitPublisher - Archive test results for Maven artifact org.apache.maven.its:core-it-extension:jar:2.1-SNAPSHOT generated by maven-surefire-plugin:test (default-test): core-it-support\core-it-extension\target\surefire-reports\*.xml
[withMaven] junitPublisher - Archive test results for Maven artifact mng-coreit:javaagent:jar:1.0-SNAPSHOT generated by maven-surefire-plugin:test (default-test): core-it-support\core-it-javaagent\target\surefire-reports\*.xml
[withMaven] junitPublisher - Archive test results for Maven artifact org.apache.maven.its:core-it-suite:jar:2.1-SNAPSHOT generated by maven-surefire-plugin:test (default-test): core-it-suite\target\surefire-reports\*.xml
Recording test results
[DevOpticsMavenPublisher] dependencies consumed: 5, artifacts produced: 156
[withMaven] Publishers: Pipeline Graph Publisher: 24 ms, Generated Artifacts Publisher: 46566 ms, Invoker Publisher: 2 ms, Junit Publisher: 355165 ms, Concordion Publisher: 1 ms, Dependencies Fingerprint Publisher: 1665 ms, Findbugs Publisher: 1 ms, JGiven Publisher: 1 ms, Jacoco Publisher: 1 ms, SpotBugs Publisher: 1 ms, Open Task Scanner Publisher: 1 ms, CloudBees DevOptics Gate Artifact Publisher: 162686 ms
[Pipeline] // withMaven
[Pipeline] fileExists
[Pipeline] zip
Compress c:\mvn-it-0.tmp\core-it-suite\target\test-classes to c:\mvn-it-0.tmp\core-it-suite-logs-windows-jdk11.zip
[withMaven] Jenkins Task Scanner Plugin not found, don't display results of source code scanning for 'TODO' and 'FIXME' in pipeline screen.
Compressed 9039 entries.
Archiving c:\mvn-it-0.tmp\core-it-suite-logs-windows-jdk11.zip
[Pipeline] fileExists
[Pipeline] zip
Compress c:\mvn-it-0.tmp\core-it-suite\target\surefire-reports to c:\mvn-it-0.tmp\core-it-suite-reports-windows-jdk11.zip
Compressed 4 entries.
Archiving c:\mvn-it-0.tmp\core-it-suite-reports-windows-jdk11.zip
[Pipeline] deleteDir
[Pipeline] }
[Pipeline] // dir
[Pipeline] }
[Pipeline] // stage
[Pipeline] }
[Pipeline] // node
[Pipeline] }
[DevOpticsMavenPublisher] dependencies consumed: 5, artifacts produced: 156
[withMaven] Publishers: Pipeline Graph Publisher: 26 ms, Generated Artifacts Publisher: 245672 ms, Invoker Publisher: 2 ms, Junit Publisher: 205640 ms, Concordion Publisher: 1 ms, Dependencies Fingerprint Publisher: 1669 ms, Findbugs Publisher: 1 ms, JGiven Publisher: 1 ms, Jacoco Publisher: 1 ms, SpotBugs Publisher: 1 ms, Open Task Scanner Publisher: 1 ms, CloudBees DevOptics Gate Artifact Publisher: 163949 ms
[Pipeline] // withMaven
[Pipeline] fileExists
[Pipeline] zip
Compress c:\mvn-it-0.tmp\core-it-suite\target\test-classes to c:\mvn-it-0.tmp\core-it-suite-logs-windows-jdk17.zip
Compressed 9039 entries.
Archiving c:\mvn-it-0.tmp\core-it-suite-logs-windows-jdk17.zip
[Pipeline] fileExists
[Pipeline] zip
Compress c:\mvn-it-0.tmp\core-it-suite\target\surefire-reports to c:\mvn-it-0.tmp\core-it-suite-reports-windows-jdk17.zip
Compressed 4 entries.
Archiving c:\mvn-it-0.tmp\core-it-suite-reports-windows-jdk17.zip
[Pipeline] deleteDir
[Pipeline] }
[Pipeline] // dir
[Pipeline] }
[Pipeline] // stage
[Pipeline] }
[Pipeline] // node
[Pipeline] }
[Pipeline] // parallel
[Pipeline] stage
[Pipeline] { (Notifications)
[Pipeline] echo
Build result: UNSTABLE
[Pipeline] jiraIssueSelector
[Pipeline] echo
The authors of changes [hboutemy].
[Pipeline] echo
Sending email ...
[Pipeline] emailext

Build succeeded in Jenkins: Maven » Maven TLP » maven » PR-756 #7

Posted by Apache Jenkins Server <je...@builds.apache.org>.
See https://ci-maven.apache.org/job/Maven/job/maven-box/job/maven/job/PR-756/7/

Changes:

* [MNG-7504] Don't print warning unsupported reportPlugins for m-site-p
* [MNG-6965] Extensions suddenly have org.codehaus.plexus:plexus-utils:jar:1.1 on their classpath
* [MNG-7501] add relative path to pom.xml in module build start output

All tests passed

Build unstable in Jenkins: Maven » Maven TLP » maven » PR-756 #6

Posted by Apache Jenkins Server <je...@builds.apache.org>.
See https://ci-maven.apache.org/job/Maven/job/maven-box/job/maven/job/PR-756/6/

Changes:

* POM can be null when using a mojo without project
* Demonstrating that importing a BOM works even when it declares those same components in dependency management. (#25)
* [MNG-6965] Extensions suddenly have org.codehaus.plexus:plexus-utils:jar:1.1 on their classpath

6 tests failed.
FAILED:  org.apache.maven.it.MavenITmng5783PluginDependencyFiltering.linux-jdk17 / Run ITs Linux Java 17 / testSLF4j

Error Message:
expected:<2> but was:<3>

Stack Trace:
junit.framework.AssertionFailedError: expected:<2> but was:<3>
	at org.apache.maven.it.MavenITmng5783PluginDependencyFiltering.testSLF4j(MavenITmng5783PluginDependencyFiltering.java:40)


FAILED:  org.apache.maven.it.MavenITmng5783PluginDependencyFiltering.linux-jdk8 / Run ITs Linux Java 8 / testSLF4j

Error Message:
expected:<2> but was:<3>

Stack Trace:
junit.framework.AssertionFailedError: expected:<2> but was:<3>
	at org.apache.maven.it.MavenITmng5783PluginDependencyFiltering.testSLF4j(MavenITmng5783PluginDependencyFiltering.java:40)


FAILED:  org.apache.maven.it.MavenITmng5783PluginDependencyFiltering.linux-jdk11 / Run ITs Linux Java 11 / testSLF4j

Error Message:
expected:<2> but was:<3>

Stack Trace:
junit.framework.AssertionFailedError: expected:<2> but was:<3>
	at org.apache.maven.it.MavenITmng5783PluginDependencyFiltering.testSLF4j(MavenITmng5783PluginDependencyFiltering.java:40)


FAILED:  org.apache.maven.it.MavenITmng5783PluginDependencyFiltering.windows-jdk17 / Run ITs Windows Java 17 / testSLF4j

Error Message:
expected:<2> but was:<3>

Stack Trace:
junit.framework.AssertionFailedError: expected:<2> but was:<3>
	at org.apache.maven.it.MavenITmng5783PluginDependencyFiltering.testSLF4j(MavenITmng5783PluginDependencyFiltering.java:40)


FAILED:  org.apache.maven.it.MavenITmng5783PluginDependencyFiltering.windows-jdk11 / Run ITs Windows Java 11 / testSLF4j

Error Message:
expected:<2> but was:<3>

Stack Trace:
junit.framework.AssertionFailedError: expected:<2> but was:<3>
	at org.apache.maven.it.MavenITmng5783PluginDependencyFiltering.testSLF4j(MavenITmng5783PluginDependencyFiltering.java:40)


FAILED:  org.apache.maven.it.MavenITmng5783PluginDependencyFiltering.windows-jdk8 / Run ITs Windows Java 8 / testSLF4j

Error Message:
expected:<2> but was:<3>

Stack Trace:
junit.framework.AssertionFailedError: expected:<2> but was:<3>
	at org.apache.maven.it.MavenITmng5783PluginDependencyFiltering.testSLF4j(MavenITmng5783PluginDependencyFiltering.java:40)




Build log:
[...truncated 57368 lines...]
[withMaven] artifactsPublisher - Archive artifact core-it-support\core-it-plugins\maven-it-plugin-core-stubs\maven-surefire-plugin\target\maven-surefire-plugin-0.1-stub-SNAPSHOT.jar under org\apache\maven\plugins\maven-surefire-plugin\0.1-stub-SNAPSHOT\maven-surefire-plugin-0.1-stub-SNAPSHOT.jar
[withMaven] artifactsPublisher - Archive artifact core-it-support\core-it-plugins\maven-it-plugin-core-stubs\maven-war-plugin\pom.xml under org\apache\maven\plugins\maven-war-plugin\0.1-stub-SNAPSHOT\maven-war-plugin-0.1-stub-SNAPSHOT.pom
[withMaven] artifactsPublisher - Archive artifact core-it-support\core-it-plugins\maven-it-plugin-core-stubs\maven-war-plugin\target\maven-war-plugin-0.1-stub-SNAPSHOT.jar under org\apache\maven\plugins\maven-war-plugin\0.1-stub-SNAPSHOT\maven-war-plugin-0.1-stub-SNAPSHOT.jar
[withMaven] artifactsPublisher - Archive artifact core-it-support\core-it-plugins\maven-it-plugin-dependency-collection\pom.xml under org\apache\maven\its\plugins\maven-it-plugin-dependency-collection\2.1-SNAPSHOT\maven-it-plugin-dependency-collection-2.1-SNAPSHOT.pom
[withMaven] artifactsPublisher - Archive artifact core-it-support\core-it-plugins\maven-it-plugin-dependency-collection\target\maven-it-plugin-dependency-collection-2.1-SNAPSHOT.jar under org\apache\maven\its\plugins\maven-it-plugin-dependency-collection\2.1-SNAPSHOT\maven-it-plugin-dependency-collection-2.1-SNAPSHOT.jar
[withMaven] artifactsPublisher - Archive artifact core-it-support\core-it-plugins\maven-it-plugin-dependency-resolution\pom.xml under org\apache\maven\its\plugins\maven-it-plugin-dependency-resolution\2.1-SNAPSHOT\maven-it-plugin-dependency-resolution-2.1-SNAPSHOT.pom
[withMaven] artifactsPublisher - Archive artifact core-it-support\core-it-plugins\maven-it-plugin-dependency-resolution\target\maven-it-plugin-dependency-resolution-2.1-SNAPSHOT.jar under org\apache\maven\its\plugins\maven-it-plugin-dependency-resolution\2.1-SNAPSHOT\maven-it-plugin-dependency-resolution-2.1-SNAPSHOT.jar
[withMaven] artifactsPublisher - Archive artifact core-it-support\core-it-plugins\maven-it-plugin-expression\pom.xml under org\apache\maven\its\plugins\maven-it-plugin-expression\2.1-SNAPSHOT\maven-it-plugin-expression-2.1-SNAPSHOT.pom
[withMaven] artifactsPublisher - Archive artifact core-it-support\core-it-plugins\maven-it-plugin-expression\target\maven-it-plugin-expression-2.1-SNAPSHOT.jar under org\apache\maven\its\plugins\maven-it-plugin-expression\2.1-SNAPSHOT\maven-it-plugin-expression-2.1-SNAPSHOT.jar
[withMaven] artifactsPublisher - Archive artifact core-it-support\core-it-plugins\maven-it-plugin-error\pom.xml under org\apache\maven\its\plugins\maven-it-plugin-error\2.1-SNAPSHOT\maven-it-plugin-error-2.1-SNAPSHOT.pom
[withMaven] artifactsPublisher - Archive artifact core-it-support\core-it-plugins\maven-it-plugin-error\target\maven-it-plugin-error-2.1-SNAPSHOT.jar under org\apache\maven\its\plugins\maven-it-plugin-error\2.1-SNAPSHOT\maven-it-plugin-error-2.1-SNAPSHOT.jar
[withMaven] artifactsPublisher - Archive artifact core-it-support\core-it-component\pom.xml under org\apache\maven\its\core-it-component\2.1-SNAPSHOT\core-it-component-2.1-SNAPSHOT.pom
[withMaven] artifactsPublisher - Archive artifact core-it-support\core-it-component\target\core-it-component-2.1-SNAPSHOT.jar under org\apache\maven\its\core-it-component\2.1-SNAPSHOT\core-it-component-2.1-SNAPSHOT.jar
[Pipeline] fileExists
[Pipeline] zip
Compress c:\mvn-it-0.tmp\core-it-suite\target\test-classes to c:\mvn-it-0.tmp\core-it-suite-logs-windows-jdk17.zip
[withMaven] Jenkins Task Scanner Plugin not found, don't display results of source code scanning for 'TODO' and 'FIXME' in pipeline screen.
[withMaven] artifactsPublisher - Archive artifact core-it-support\core-it-plugins\maven-it-plugin-extension-consumer\pom.xml under org\apache\maven\its\plugins\maven-it-plugin-extension-consumer\2.1-SNAPSHOT\maven-it-plugin-extension-consumer-2.1-SNAPSHOT.pom
[withMaven] artifactsPublisher - Archive artifact core-it-support\core-it-plugins\maven-it-plugin-extension-consumer\target\maven-it-plugin-extension-consumer-2.1-SNAPSHOT.jar under org\apache\maven\its\plugins\maven-it-plugin-extension-consumer\2.1-SNAPSHOT\maven-it-plugin-extension-consumer-2.1-SNAPSHOT.jar
[withMaven] artifactsPublisher - Archive artifact core-it-support\core-it-plugins\maven-it-plugin-extension-provider\pom.xml under org\apache\maven\its\plugins\maven-it-plugin-extension-provider\2.1-SNAPSHOT\maven-it-plugin-extension-provider-2.1-SNAPSHOT.pom
[withMaven] artifactsPublisher - Archive artifact core-it-support\core-it-plugins\maven-it-plugin-extension-provider\target\maven-it-plugin-extension-provider-2.1-SNAPSHOT.jar under org\apache\maven\its\plugins\maven-it-plugin-extension-provider\2.1-SNAPSHOT\maven-it-plugin-extension-provider-2.1-SNAPSHOT.jar
[withMaven] artifactsPublisher - Archive artifact core-it-support\core-it-plugins\maven-it-plugin-fork\pom.xml under org\apache\maven\its\plugins\maven-it-plugin-fork\2.1-SNAPSHOT\maven-it-plugin-fork-2.1-SNAPSHOT.pom
[withMaven] artifactsPublisher - Archive artifact core-it-support\core-it-plugins\maven-it-plugin-fork\target\maven-it-plugin-fork-2.1-SNAPSHOT.jar under org\apache\maven\its\plugins\maven-it-plugin-fork\2.1-SNAPSHOT\maven-it-plugin-fork-2.1-SNAPSHOT.jar
[withMaven] artifactsPublisher - Archive artifact core-it-support\core-it-plugins\maven-it-plugin-invalid-descriptor\pom.xml under org\apache\maven\its\plugins\maven-it-plugin-invalid-descriptor\2.1-SNAPSHOT\maven-it-plugin-invalid-descriptor-2.1-SNAPSHOT.pom
[withMaven] artifactsPublisher - Archive artifact core-it-support\core-it-plugins\maven-it-plugin-invalid-descriptor\target\maven-it-plugin-invalid-descriptor-2.1-SNAPSHOT.jar under org\apache\maven\its\plugins\maven-it-plugin-invalid-descriptor\2.1-SNAPSHOT\maven-it-plugin-invalid-descriptor-2.1-SNAPSHOT.jar
[withMaven] artifactsPublisher - Archive artifact core-it-support\core-it-plugins\maven-it-plugin-log-file\pom.xml under org\apache\maven\its\plugins\maven-it-plugin-log-file\2.1-SNAPSHOT\maven-it-plugin-log-file-2.1-SNAPSHOT.pom
[withMaven] artifactsPublisher - Archive artifact core-it-support\core-it-plugins\maven-it-plugin-log-file\target\maven-it-plugin-log-file-2.1-SNAPSHOT.jar under org\apache\maven\its\plugins\maven-it-plugin-log-file\2.1-SNAPSHOT\maven-it-plugin-log-file-2.1-SNAPSHOT.jar
[withMaven] artifactsPublisher - Archive artifact core-it-support\maven-it-helper\pom.xml under org\apache\maven\its\maven-it-helper\2.1-SNAPSHOT\maven-it-helper-2.1-SNAPSHOT.pom
[withMaven] artifactsPublisher - Archive artifact core-it-support\maven-it-helper\target\maven-it-helper-2.1-SNAPSHOT.jar under org\apache\maven\its\maven-it-helper\2.1-SNAPSHOT\maven-it-helper-2.1-SNAPSHOT.jar
[withMaven] artifactsPublisher - Archive artifact core-it-support\core-it-plugins\maven-it-plugin-model-interpolation\pom.xml under org\apache\maven\its\plugins\maven-it-plugin-model-interpolation\2.1-SNAPSHOT\maven-it-plugin-model-interpolation-2.1-SNAPSHOT.pom
[withMaven] artifactsPublisher - Archive artifact core-it-support\core-it-plugins\maven-it-plugin-model-interpolation\target\maven-it-plugin-model-interpolation-2.1-SNAPSHOT.jar under org\apache\maven\its\plugins\maven-it-plugin-model-interpolation\2.1-SNAPSHOT\maven-it-plugin-model-interpolation-2.1-SNAPSHOT.jar
[withMaven] artifactsPublisher - Archive artifact core-it-support\core-it-plugins\maven-it-plugin-no-default-comp\pom.xml under org\apache\maven\its\plugins\maven-it-plugin-no-default-comp\2.1-SNAPSHOT\maven-it-plugin-no-default-comp-2.1-SNAPSHOT.pom
[withMaven] artifactsPublisher - Archive artifact core-it-support\core-it-plugins\maven-it-plugin-no-default-comp\target\maven-it-plugin-no-default-comp-2.1-SNAPSHOT.jar under org\apache\maven\its\plugins\maven-it-plugin-no-default-comp\2.1-SNAPSHOT\maven-it-plugin-no-default-comp-2.1-SNAPSHOT.jar
[withMaven] artifactsPublisher - Archive artifact core-it-support\core-it-plugins\maven-it-plugin-no-project\pom.xml under org\apache\maven\its\plugins\maven-it-plugin-no-project\2.1-SNAPSHOT\maven-it-plugin-no-project-2.1-SNAPSHOT.pom
[withMaven] artifactsPublisher - Archive artifact core-it-support\core-it-plugins\maven-it-plugin-no-project\target\maven-it-plugin-no-project-2.1-SNAPSHOT.jar under org\apache\maven\its\plugins\maven-it-plugin-no-project\2.1-SNAPSHOT\maven-it-plugin-no-project-2.1-SNAPSHOT.jar
[withMaven] artifactsPublisher - Archive artifact core-it-support\core-it-plugins\maven-it-plugin-online\pom.xml under org\apache\maven\its\plugins\maven-it-plugin-online\2.1-SNAPSHOT\maven-it-plugin-online-2.1-SNAPSHOT.pom
[withMaven] artifactsPublisher - Archive artifact core-it-support\core-it-plugins\maven-it-plugin-online\target\maven-it-plugin-online-2.1-SNAPSHOT.jar under org\apache\maven\its\plugins\maven-it-plugin-online\2.1-SNAPSHOT\maven-it-plugin-online-2.1-SNAPSHOT.jar
[withMaven] artifactsPublisher - Archive artifact core-it-support\core-it-plugins\maven-it-plugin-optional-mojos\pom.xml under org\apache\maven\its\plugins\maven-it-plugin-optional-mojos\2.1-SNAPSHOT\maven-it-plugin-optional-mojos-2.1-SNAPSHOT.pom
[withMaven] artifactsPublisher - Archive artifact core-it-support\core-it-plugins\maven-it-plugin-optional-mojos\target\maven-it-plugin-optional-mojos-2.1-SNAPSHOT.jar under org\apache\maven\its\plugins\maven-it-plugin-optional-mojos\2.1-SNAPSHOT\maven-it-plugin-optional-mojos-2.1-SNAPSHOT.jar
Compressed 9120 entries.
Archiving c:\mvn-it-0.tmp\core-it-suite-logs-windows-jdk17.zip
[withMaven] artifactsPublisher - Archive artifact core-it-support\core-it-plugins\maven-it-plugin-packaging\pom.xml under org\apache\maven\its\plugins\maven-it-plugin-packaging\2.1-SNAPSHOT\maven-it-plugin-packaging-2.1-SNAPSHOT.pom
[withMaven] artifactsPublisher - Archive artifact core-it-support\core-it-plugins\maven-it-plugin-packaging\target\maven-it-plugin-packaging-2.1-SNAPSHOT.jar under org\apache\maven\its\plugins\maven-it-plugin-packaging\2.1-SNAPSHOT\maven-it-plugin-packaging-2.1-SNAPSHOT.jar
[withMaven] artifactsPublisher - Archive artifact core-it-support\core-it-plugins\maven-it-plugin-parameter-implementation\pom.xml under org\apache\maven\its\plugins\maven-it-plugin-parameter-implementation\2.1-SNAPSHOT\maven-it-plugin-parameter-implementation-2.1-SNAPSHOT.pom
[withMaven] artifactsPublisher - Archive artifact core-it-support\core-it-plugins\maven-it-plugin-parameter-implementation\target\maven-it-plugin-parameter-implementation-2.1-SNAPSHOT.jar under org\apache\maven\its\plugins\maven-it-plugin-parameter-implementation\2.1-SNAPSHOT\maven-it-plugin-parameter-implementation-2.1-SNAPSHOT.jar
[withMaven] artifactsPublisher - Archive artifact core-it-support\core-it-plugins\maven-it-plugin-plugin-dependency\pom.xml under org\apache\maven\its\plugins\maven-it-plugin-plugin-dependency\2.1-SNAPSHOT\maven-it-plugin-plugin-dependency-2.1-SNAPSHOT.pom
[withMaven] artifactsPublisher - Archive artifact core-it-support\core-it-plugins\maven-it-plugin-plugin-dependency\target\maven-it-plugin-plugin-dependency-2.1-SNAPSHOT.jar under org\apache\maven\its\plugins\maven-it-plugin-plugin-dependency\2.1-SNAPSHOT\maven-it-plugin-plugin-dependency-2.1-SNAPSHOT.jar
[Pipeline] fileExists
[Pipeline] zip
Compress c:\mvn-it-0.tmp\core-it-suite\target\surefire-reports to c:\mvn-it-0.tmp\core-it-suite-reports-windows-jdk17.zip
Compressed 4 entries.
Archiving c:\mvn-it-0.tmp\core-it-suite-reports-windows-jdk17.zip
[withMaven] artifactsPublisher - Archive artifact core-it-support\core-it-plugins\maven-it-plugin-project\pom.xml under org\apache\maven\its\plugins\maven-it-plugin-project\2.1-SNAPSHOT\maven-it-plugin-project-2.1-SNAPSHOT.pom
[withMaven] artifactsPublisher - Archive artifact core-it-support\core-it-plugins\maven-it-plugin-project\target\maven-it-plugin-project-2.1-SNAPSHOT.jar under org\apache\maven\its\plugins\maven-it-plugin-project\2.1-SNAPSHOT\maven-it-plugin-project-2.1-SNAPSHOT.jar
[Pipeline] deleteDir
[withMaven] artifactsPublisher - Archive artifact core-it-support\core-it-plugins\maven-it-plugin-project-interpolation\pom.xml under org\apache\maven\its\plugins\maven-it-plugin-project-interpolation\2.1-SNAPSHOT\maven-it-plugin-project-interpolation-2.1-SNAPSHOT.pom
[withMaven] artifactsPublisher - Archive artifact core-it-support\core-it-plugins\maven-it-plugin-project-interpolation\target\maven-it-plugin-project-interpolation-2.1-SNAPSHOT.jar under org\apache\maven\its\plugins\maven-it-plugin-project-interpolation\2.1-SNAPSHOT\maven-it-plugin-project-interpolation-2.1-SNAPSHOT.jar
[withMaven] artifactsPublisher - Archive artifact core-it-support\core-it-plugins\maven-it-plugin-setter\pom.xml under org\apache\maven\its\plugins\maven-it-plugin-setter\2.1-SNAPSHOT\maven-it-plugin-setter-2.1-SNAPSHOT.pom
[withMaven] artifactsPublisher - Archive artifact core-it-support\core-it-plugins\maven-it-plugin-setter\target\maven-it-plugin-setter-2.1-SNAPSHOT.jar under org\apache\maven\its\plugins\maven-it-plugin-setter\2.1-SNAPSHOT\maven-it-plugin-setter-2.1-SNAPSHOT.jar
[withMaven] artifactsPublisher - Archive artifact core-it-support\core-it-plugins\maven-it-plugin-singleton-component\pom.xml under org\apache\maven\its\plugins\maven-it-plugin-singleton-component\2.1-SNAPSHOT\maven-it-plugin-singleton-component-2.1-SNAPSHOT.pom
[withMaven] artifactsPublisher - Archive artifact core-it-support\core-it-plugins\maven-it-plugin-singleton-component\target\maven-it-plugin-singleton-component-2.1-SNAPSHOT.jar under org\apache\maven\its\plugins\maven-it-plugin-singleton-component\2.1-SNAPSHOT\maven-it-plugin-singleton-component-2.1-SNAPSHOT.jar
[withMaven] artifactsPublisher - Archive artifact core-it-support\core-it-plugins\maven-it-plugin-site\pom.xml under org\apache\maven\its\plugins\maven-it-plugin-site\2.1-SNAPSHOT\maven-it-plugin-site-2.1-SNAPSHOT.pom
[withMaven] artifactsPublisher - Archive artifact core-it-support\core-it-plugins\maven-it-plugin-site\target\maven-it-plugin-site-2.1-SNAPSHOT.jar under org\apache\maven\its\plugins\maven-it-plugin-site\2.1-SNAPSHOT\maven-it-plugin-site-2.1-SNAPSHOT.jar
[withMaven] artifactsPublisher - Archive artifact core-it-support\core-it-plugins\maven-it-plugin-toolchain\pom.xml under org\apache\maven\its\plugins\maven-it-plugin-toolchain\2.1-SNAPSHOT\maven-it-plugin-toolchain-2.1-SNAPSHOT.pom
[withMaven] artifactsPublisher - Archive artifact core-it-support\core-it-plugins\maven-it-plugin-toolchain\target\maven-it-plugin-toolchain-2.1-SNAPSHOT.jar under org\apache\maven\its\plugins\maven-it-plugin-toolchain\2.1-SNAPSHOT\maven-it-plugin-toolchain-2.1-SNAPSHOT.jar
[withMaven] artifactsPublisher - Archive artifact core-it-support\core-it-plugins\maven-it-plugin-touch\pom.xml under org\apache\maven\its\plugins\maven-it-plugin-touch\2.1-SNAPSHOT\maven-it-plugin-touch-2.1-SNAPSHOT.pom
[withMaven] artifactsPublisher - Archive artifact core-it-support\core-it-plugins\maven-it-plugin-touch\target\maven-it-plugin-touch-2.1-SNAPSHOT.jar under org\apache\maven\its\plugins\maven-it-plugin-touch\2.1-SNAPSHOT\maven-it-plugin-touch-2.1-SNAPSHOT.jar
[withMaven] artifactsPublisher - Archive artifact core-it-support\core-it-plugins\maven-it-plugin-uses-properties\pom.xml under org\apache\maven\its\plugins\maven-it-plugin-uses-properties\2.1-SNAPSHOT\maven-it-plugin-uses-properties-2.1-SNAPSHOT.pom
[withMaven] artifactsPublisher - Archive artifact core-it-support\core-it-plugins\maven-it-plugin-uses-properties\target\maven-it-plugin-uses-properties-2.1-SNAPSHOT.jar under org\apache\maven\its\plugins\maven-it-plugin-uses-properties\2.1-SNAPSHOT\maven-it-plugin-uses-properties-2.1-SNAPSHOT.jar
[withMaven] artifactsPublisher - Archive artifact core-it-support\core-it-plugins\maven-it-plugin-uses-wagon\pom.xml under org\apache\maven\its\plugins\maven-it-plugin-uses-wagon\2.1-SNAPSHOT\maven-it-plugin-uses-wagon-2.1-SNAPSHOT.pom
[withMaven] artifactsPublisher - Archive artifact core-it-support\core-it-plugins\maven-it-plugin-uses-wagon\target\maven-it-plugin-uses-wagon-2.1-SNAPSHOT.jar under org\apache\maven\its\plugins\maven-it-plugin-uses-wagon\2.1-SNAPSHOT\maven-it-plugin-uses-wagon-2.1-SNAPSHOT.jar
[withMaven] artifactsPublisher - Archive artifact core-it-support\core-it-plugins\maven-it-plugin-all\pom.xml under org\apache\maven\its\plugins\maven-it-plugin-all\2.1-SNAPSHOT\maven-it-plugin-all-2.1-SNAPSHOT.pom
[withMaven] artifactsPublisher - Archive artifact core-it-support\core-it-plugins\maven-it-plugin-all\target\maven-it-plugin-all-2.1-SNAPSHOT.jar under org\apache\maven\its\plugins\maven-it-plugin-all\2.1-SNAPSHOT\maven-it-plugin-all-2.1-SNAPSHOT.jar
[withMaven] artifactsPublisher - Archive artifact core-it-support\core-it-plugins\maven-it-plugin-plexus-utils-11\pom.xml under org\apache\maven\its\plugins\maven-it-plugin-plexus-utils-11\2.1-SNAPSHOT\maven-it-plugin-plexus-utils-11-2.1-SNAPSHOT.pom
[withMaven] artifactsPublisher - Archive artifact core-it-support\core-it-plugins\maven-it-plugin-plexus-utils-11\target\maven-it-plugin-plexus-utils-11-2.1-SNAPSHOT.jar under org\apache\maven\its\plugins\maven-it-plugin-plexus-utils-11\2.1-SNAPSHOT\maven-it-plugin-plexus-utils-11-2.1-SNAPSHOT.jar
[withMaven] artifactsPublisher - Archive artifact core-it-support\core-it-plugins\maven-it-plugin-plexus-utils-new\pom.xml under org\apache\maven\its\plugins\maven-it-plugin-plexus-utils-new\2.1-SNAPSHOT\maven-it-plugin-plexus-utils-new-2.1-SNAPSHOT.pom
[withMaven] artifactsPublisher - Archive artifact core-it-support\core-it-plugins\maven-it-plugin-plexus-utils-new\target\maven-it-plugin-plexus-utils-new-2.1-SNAPSHOT.jar under org\apache\maven\its\plugins\maven-it-plugin-plexus-utils-new\2.1-SNAPSHOT\maven-it-plugin-plexus-utils-new-2.1-SNAPSHOT.jar
[withMaven] artifactsPublisher - Archive artifact core-it-support\core-it-plugins\maven-it-plugin-plexus-component-api\pom.xml under org\apache\maven\its\plugins\maven-it-plugin-plexus-component-api\2.1-SNAPSHOT\maven-it-plugin-plexus-component-api-2.1-SNAPSHOT.pom
[withMaven] artifactsPublisher - Archive artifact core-it-support\core-it-plugins\maven-it-plugin-plexus-component-api\target\maven-it-plugin-plexus-component-api-2.1-SNAPSHOT.jar under org\apache\maven\its\plugins\maven-it-plugin-plexus-component-api\2.1-SNAPSHOT\maven-it-plugin-plexus-component-api-2.1-SNAPSHOT.jar
[withMaven] artifactsPublisher - Archive artifact core-it-support\core-it-plugins\maven-it-plugin-log4j\pom.xml under org\apache\maven\its\plugins\maven-it-plugin-log4j\2.1-SNAPSHOT\maven-it-plugin-log4j-2.1-SNAPSHOT.pom
[withMaven] artifactsPublisher - Archive artifact core-it-support\core-it-plugins\maven-it-plugin-log4j\target\maven-it-plugin-log4j-2.1-SNAPSHOT.jar under org\apache\maven\its\plugins\maven-it-plugin-log4j\2.1-SNAPSHOT\maven-it-plugin-log4j-2.1-SNAPSHOT.jar
[withMaven] artifactsPublisher - Archive artifact core-it-support\core-it-plugins\maven-it-plugin-extension1\pom.xml under org\apache\maven\its\plugins\maven-it-plugin-extension1\2.1-SNAPSHOT\maven-it-plugin-extension1-2.1-SNAPSHOT.pom
[withMaven] artifactsPublisher - Archive artifact core-it-support\core-it-plugins\maven-it-plugin-extension1\target\maven-it-plugin-extension1-2.1-SNAPSHOT.jar under org\apache\maven\its\plugins\maven-it-plugin-extension1\2.1-SNAPSHOT\maven-it-plugin-extension1-2.1-SNAPSHOT.jar
[withMaven] artifactsPublisher - Archive artifact core-it-support\core-it-plugins\maven-it-plugin-extension2\pom.xml under org\apache\maven\its\plugins\maven-it-plugin-extension2\2.1-SNAPSHOT\maven-it-plugin-extension2-2.1-SNAPSHOT.pom
[withMaven] artifactsPublisher - Archive artifact core-it-support\core-it-plugins\maven-it-plugin-extension2\target\maven-it-plugin-extension2-2.1-SNAPSHOT.jar under org\apache\maven\its\plugins\maven-it-plugin-extension2\2.1-SNAPSHOT\maven-it-plugin-extension2-2.1-SNAPSHOT.jar
[withMaven] artifactsPublisher - Archive artifact core-it-support\core-it-plugins\maven-it-plugin-plexus-lifecycle\pom.xml under org\apache\maven\its\plugins\maven-it-plugin-plexus-lifecycle\2.1-SNAPSHOT\maven-it-plugin-plexus-lifecycle-2.1-SNAPSHOT.pom
[withMaven] artifactsPublisher - Archive artifact core-it-support\core-it-plugins\maven-it-plugin-plexus-lifecycle\target\maven-it-plugin-plexus-lifecycle-2.1-SNAPSHOT.jar under org\apache\maven\its\plugins\maven-it-plugin-plexus-lifecycle\2.1-SNAPSHOT\maven-it-plugin-plexus-lifecycle-2.1-SNAPSHOT.jar
[withMaven] artifactsPublisher - Archive artifact core-it-support\core-it-plugins\maven-it-plugin-settings\pom.xml under org\apache\maven\its\plugins\maven-it-plugin-settings\2.1-SNAPSHOT\maven-it-plugin-settings-2.1-SNAPSHOT.pom
[DevOpticsMavenPublisher] dependencies consumed: 5, artifacts produced: 156
[withMaven] Publishers: Pipeline Graph Publisher: 24 ms, Generated Artifacts Publisher: 10842 ms, Invoker Publisher: 5 ms, Junit Publisher: 15757 ms, Concordion Publisher: 4 ms, Dependencies Fingerprint Publisher: 140 ms, Findbugs Publisher: 1 ms, Jacoco Publisher: 1 ms, Open Task Scanner Publisher: 1 ms, CloudBees DevOptics Gate Artifact Publisher: 15927 ms
[Pipeline] // withMaven
[withMaven] artifactsPublisher - Archive artifact core-it-support\core-it-plugins\maven-it-plugin-settings\target\maven-it-plugin-settings-2.1-SNAPSHOT.jar under org\apache\maven\its\plugins\maven-it-plugin-settings\2.1-SNAPSHOT\maven-it-plugin-settings-2.1-SNAPSHOT.jar
[Pipeline] fileExists
[Pipeline] zip
Compress c:\mvn-it-0.tmp\core-it-suite\target\test-classes to c:\mvn-it-0.tmp\core-it-suite-logs-windows-jdk11.zip
[withMaven] artifactsPublisher - Archive artifact core-it-support\core-it-plugins\mng5805-extension\pom.xml under org\apache\maven\its\plugins\mng-5805-pkg-type-mojo-configuration-extension\2.1-SNAPSHOT\mng-5805-pkg-type-mojo-configuration-extension-2.1-SNAPSHOT.pom
[withMaven] artifactsPublisher - Archive artifact core-it-support\core-it-plugins\mng5805-extension\target\mng-5805-pkg-type-mojo-configuration-extension-2.1-SNAPSHOT.jar under org\apache\maven\its\plugins\mng-5805-pkg-type-mojo-configuration-extension\2.1-SNAPSHOT\mng-5805-pkg-type-mojo-configuration-extension-2.1-SNAPSHOT.jar
[withMaven] artifactsPublisher - Archive artifact core-it-support\core-it-plugins\mng5805-extension2\pom.xml under org\apache\maven\its\plugins\mng-5805-pkg-type-mojo-configuration-extension2\2.1-SNAPSHOT\mng-5805-pkg-type-mojo-configuration-extension2-2.1-SNAPSHOT.pom
[withMaven] artifactsPublisher - Archive artifact core-it-support\core-it-plugins\mng5805-extension2\target\mng-5805-pkg-type-mojo-configuration-extension2-2.1-SNAPSHOT.jar under org\apache\maven\its\plugins\mng-5805-pkg-type-mojo-configuration-extension2\2.1-SNAPSHOT\mng-5805-pkg-type-mojo-configuration-extension2-2.1-SNAPSHOT.jar
[withMaven] artifactsPublisher - Archive artifact core-it-support\core-it-plugins\mng5805-plugin\pom.xml under org\apache\maven\its\plugins\mng-5805-pkg-type-mojo-configuration-plugin\2.1-SNAPSHOT\mng-5805-pkg-type-mojo-configuration-plugin-2.1-SNAPSHOT.pom
[withMaven] artifactsPublisher - Archive artifact core-it-support\core-it-plugins\mng5805-plugin\target\mng-5805-pkg-type-mojo-configuration-plugin-2.1-SNAPSHOT.jar under org\apache\maven\its\plugins\mng-5805-pkg-type-mojo-configuration-plugin\2.1-SNAPSHOT\mng-5805-pkg-type-mojo-configuration-plugin-2.1-SNAPSHOT.jar
[withMaven] artifactsPublisher - Archive artifact core-it-support\core-it-plugins\mng5805-plugin-dep\pom.xml under org\apache\maven\its\plugins\mng-5805-pkg-type-mojo-configuration-plugin-dep\2.1-SNAPSHOT\mng-5805-pkg-type-mojo-configuration-plugin-dep-2.1-SNAPSHOT.pom
[withMaven] artifactsPublisher - Archive artifact core-it-support\core-it-plugins\mng5805-plugin-dep\target\mng-5805-pkg-type-mojo-configuration-plugin-dep-2.1-SNAPSHOT.jar under org\apache\maven\its\plugins\mng-5805-pkg-type-mojo-configuration-plugin-dep\2.1-SNAPSHOT\mng-5805-pkg-type-mojo-configuration-plugin-dep-2.1-SNAPSHOT.jar
[withMaven] artifactsPublisher - Archive artifact core-it-support\core-it-plugins\mng5958-extension\pom.xml under org\apache\maven\its\plugins\mng-5958-pkg-type-extension\2.1-SNAPSHOT\mng-5958-pkg-type-extension-2.1-SNAPSHOT.pom
[withMaven] artifactsPublisher - Archive artifact core-it-support\core-it-plugins\mng5958-extension\target\mng-5958-pkg-type-extension-2.1-SNAPSHOT.jar under org\apache\maven\its\plugins\mng-5958-pkg-type-extension\2.1-SNAPSHOT\mng-5958-pkg-type-extension-2.1-SNAPSHOT.jar
[withMaven] artifactsPublisher - Archive artifact core-it-support\core-it-plugins\mng6759-plugin-resolves-project-dependencies\pom.xml under org\apache\maven\its\plugins\mng-6759-resolves-project-dependencies-plugin\2.1-SNAPSHOT\mng-6759-resolves-project-dependencies-plugin-2.1-SNAPSHOT.pom
[withMaven] artifactsPublisher - Archive artifact core-it-support\core-it-plugins\mng6759-plugin-resolves-project-dependencies\target\mng-6759-resolves-project-dependencies-plugin-2.1-SNAPSHOT.jar under org\apache\maven\its\plugins\mng-6759-resolves-project-dependencies-plugin\2.1-SNAPSHOT\mng-6759-resolves-project-dependencies-plugin-2.1-SNAPSHOT.jar
[Pipeline] }
[Pipeline] // dir
[Pipeline] }
[Pipeline] // stage
[Pipeline] }
[Pipeline] // node
[Pipeline] }
[withMaven] artifactsPublisher - Archive artifact core-it-support\core-it-toolchain\pom.xml under org\apache\maven\its\core-it-toolchain\2.1-SNAPSHOT\core-it-toolchain-2.1-SNAPSHOT.pom
[withMaven] artifactsPublisher - Archive artifact core-it-support\core-it-toolchain\target\core-it-toolchain-2.1-SNAPSHOT.jar under org\apache\maven\its\core-it-toolchain\2.1-SNAPSHOT\core-it-toolchain-2.1-SNAPSHOT.jar
[withMaven] artifactsPublisher - Archive artifact core-it-support\core-it-wagon\pom.xml under org\apache\maven\its\core-it-wagon\2.1-SNAPSHOT\core-it-wagon-2.1-SNAPSHOT.pom
[withMaven] artifactsPublisher - Archive artifact core-it-support\core-it-wagon\target\core-it-wagon-2.1-SNAPSHOT.jar under org\apache\maven\its\core-it-wagon\2.1-SNAPSHOT\core-it-wagon-2.1-SNAPSHOT.jar
[withMaven] artifactsPublisher - Archive artifact core-it-support\core-it-support-artifacts\pom.xml under org\apache\maven\its\core-it-support-artifacts\2.1-SNAPSHOT\core-it-support-artifacts-2.1-SNAPSHOT.pom
[withMaven] artifactsPublisher - Archive artifact core-it-support\core-it-support-artifacts\target\core-it-support-artifacts-2.1-SNAPSHOT-repo.zip under org\apache\maven\its\core-it-support-artifacts\2.1-SNAPSHOT\core-it-support-artifacts-2.1-SNAPSHOT-repo.zip
[withMaven] artifactsPublisher - Archive artifact core-it-support\core-it-extension\pom.xml under org\apache\maven\its\core-it-extension\2.1-SNAPSHOT\core-it-extension-2.1-SNAPSHOT.pom
[withMaven] artifactsPublisher - Archive artifact core-it-support\core-it-extension\target\core-it-extension-2.1-SNAPSHOT.jar under org\apache\maven\its\core-it-extension\2.1-SNAPSHOT\core-it-extension-2.1-SNAPSHOT.jar
[withMaven] artifactsPublisher - Archive artifact core-it-support\core-it-javaagent\pom.xml under mng-coreit\javaagent\1.0-SNAPSHOT\javaagent-1.0-SNAPSHOT.pom
[withMaven] artifactsPublisher - Archive artifact core-it-support\core-it-javaagent\target\javaagent-1.0-SNAPSHOT.jar under mng-coreit\javaagent\1.0-SNAPSHOT\javaagent-1.0-SNAPSHOT.jar
[withMaven] artifactsPublisher - Archive artifact core-it-suite\pom.xml under org\apache\maven\its\core-it-suite\2.1-SNAPSHOT\core-it-suite-2.1-SNAPSHOT.pom
Compressed 9120 entries.
Archiving c:\mvn-it-0.tmp\core-it-suite-logs-windows-jdk11.zip
[withMaven] artifactsPublisher - Archive artifact core-it-suite\target\core-it-suite-2.1-SNAPSHOT.jar under org\apache\maven\its\core-it-suite\2.1-SNAPSHOT\core-it-suite-2.1-SNAPSHOT.jar
[withMaven] artifactsPublisher - Archive artifact core-it-suite\target\core-it-suite-2.1-SNAPSHOT-tests.jar under org\apache\maven\its\core-it-suite\2.1-SNAPSHOT\core-it-suite-2.1-SNAPSHOT-tests.jar
[Pipeline] fileExists
[Pipeline] zip
Compress c:\mvn-it-0.tmp\core-it-suite\target\surefire-reports to c:\mvn-it-0.tmp\core-it-suite-reports-windows-jdk11.zip
Compressed 4 entries.
Archiving c:\mvn-it-0.tmp\core-it-suite-reports-windows-jdk11.zip
[Pipeline] deleteDir
[withMaven] junitPublisher - Archive test results for Maven artifact org.apache.maven.its.plugins:maven-it-plugin-active-collection:maven-plugin:2.1-SNAPSHOT generated by maven-surefire-plugin:test (default-test): core-it-support\core-it-plugins\maven-it-plugin-active-collection\target\surefire-reports\*.xml
[withMaven] junitPublisher - Archive test results for Maven artifact org.apache.maven.its.plugins:maven-it-plugin-ant-based:maven-plugin:2.1-SNAPSHOT generated by maven-surefire-plugin:test (default-test): core-it-support\core-it-plugins\maven-it-plugin-ant-based\target\surefire-reports\*.xml
[withMaven] junitPublisher - Archive test results for Maven artifact org.apache.maven.its.plugins:maven-it-plugin-artifact:maven-plugin:2.1-SNAPSHOT generated by maven-surefire-plugin:test (default-test): core-it-support\core-it-plugins\maven-it-plugin-artifact\target\surefire-reports\*.xml
[withMaven] junitPublisher - Archive test results for Maven artifact org.apache.maven.its.plugins.class-loader:dep-a:jar:2.1-SNAPSHOT generated by maven-surefire-plugin:test (default-test): core-it-support\core-it-plugins\maven-it-plugin-class-loader\dep-a\target\surefire-reports\*.xml
[withMaven] junitPublisher - Archive test results for Maven artifact org.apache.maven.its.plugins.class-loader:dep-b:jar:2.1-SNAPSHOT generated by maven-surefire-plugin:test (default-test): core-it-support\core-it-plugins\maven-it-plugin-class-loader\dep-b\target\surefire-reports\*.xml
[withMaven] junitPublisher - Archive test results for Maven artifact org.apache.maven.its.plugins.class-loader:dep-c:jar:2.1-SNAPSHOT generated by maven-surefire-plugin:test (default-test): core-it-support\core-it-plugins\maven-it-plugin-class-loader\dep-c\target\surefire-reports\*.xml
[withMaven] junitPublisher - Archive test results for Maven artifact org.apache.maven.its.plugins:maven-it-plugin-class-loader:maven-plugin:2.1-SNAPSHOT generated by maven-surefire-plugin:test (default-test): core-it-support\core-it-plugins\maven-it-plugin-class-loader\maven-it-plugin-class-loader\target\surefire-reports\*.xml
[withMaven] junitPublisher - Archive test results for Maven artifact org.apache.maven.its.plugins:maven-it-plugin-configuration:maven-plugin:2.1-SNAPSHOT generated by maven-surefire-plugin:test (default-test): core-it-support\core-it-plugins\maven-it-plugin-configuration\target\surefire-reports\*.xml
[withMaven] junitPublisher - Archive test results for Maven artifact org.apache.maven.its.plugins:maven-it-plugin-context-passing:maven-plugin:2.1-SNAPSHOT generated by maven-surefire-plugin:test (default-test): core-it-support\core-it-plugins\maven-it-plugin-context-passing\target\surefire-reports\*.xml
[withMaven] junitPublisher - Archive test results for Maven artifact org.apache.maven.plugins:maven-clean-plugin:maven-plugin:0.1-stub-SNAPSHOT generated by maven-surefire-plugin:test (default-test): core-it-support\core-it-plugins\maven-it-plugin-core-stubs\maven-clean-plugin\target\surefire-reports\*.xml
[withMaven] junitPublisher - Archive test results for Maven artifact org.apache.maven.plugins:maven-compiler-plugin:maven-plugin:0.1-stub-SNAPSHOT generated by maven-surefire-plugin:test (default-test): core-it-support\core-it-plugins\maven-it-plugin-core-stubs\maven-compiler-plugin\target\surefire-reports\*.xml
[withMaven] junitPublisher - Archive test results for Maven artifact org.apache.maven.plugins:maven-deploy-plugin:maven-plugin:0.1-stub-SNAPSHOT generated by maven-surefire-plugin:test (default-test): core-it-support\core-it-plugins\maven-it-plugin-core-stubs\maven-deploy-plugin\target\surefire-reports\*.xml
[withMaven] junitPublisher - Archive test results for Maven artifact org.apache.maven.plugins:maven-ear-plugin:maven-plugin:0.1-stub-SNAPSHOT generated by maven-surefire-plugin:test (default-test): core-it-support\core-it-plugins\maven-it-plugin-core-stubs\maven-ear-plugin\target\surefire-reports\*.xml
[withMaven] junitPublisher - Archive test results for Maven artifact org.apache.maven.plugins:maven-ejb-plugin:maven-plugin:0.1-stub-SNAPSHOT generated by maven-surefire-plugin:test (default-test): core-it-support\core-it-plugins\maven-it-plugin-core-stubs\maven-ejb-plugin\target\surefire-reports\*.xml
[withMaven] junitPublisher - Archive test results for Maven artifact org.apache.maven.plugins:maven-install-plugin:maven-plugin:0.1-stub-SNAPSHOT generated by maven-surefire-plugin:test (default-test): core-it-support\core-it-plugins\maven-it-plugin-core-stubs\maven-install-plugin\target\surefire-reports\*.xml
[withMaven] junitPublisher - Archive test results for Maven artifact org.apache.maven.plugins:maven-jar-plugin:maven-plugin:0.1-stub-SNAPSHOT generated by maven-surefire-plugin:test (default-test): core-it-support\core-it-plugins\maven-it-plugin-core-stubs\maven-jar-plugin\target\surefire-reports\*.xml
[withMaven] junitPublisher - Archive test results for Maven artifact org.apache.maven.plugins:maven-javadoc-plugin:maven-plugin:0.1-stub-SNAPSHOT generated by maven-surefire-plugin:test (default-test): core-it-support\core-it-plugins\maven-it-plugin-core-stubs\maven-javadoc-plugin\target\surefire-reports\*.xml
[withMaven] junitPublisher - Archive test results for Maven artifact org.apache.maven.plugins:maven-plugin-plugin:maven-plugin:0.1-stub-SNAPSHOT generated by maven-surefire-plugin:test (default-test): core-it-support\core-it-plugins\maven-it-plugin-core-stubs\maven-plugin-plugin\target\surefire-reports\*.xml
[withMaven] junitPublisher - Archive test results for Maven artifact org.apache.maven.plugins:maven-rar-plugin:maven-plugin:0.1-stub-SNAPSHOT generated by maven-surefire-plugin:test (default-test): core-it-support\core-it-plugins\maven-it-plugin-core-stubs\maven-rar-plugin\target\surefire-reports\*.xml
[withMaven] junitPublisher - Archive test results for Maven artifact org.apache.maven.plugins:maven-resources-plugin:maven-plugin:0.1-stub-SNAPSHOT generated by maven-surefire-plugin:test (default-test): core-it-support\core-it-plugins\maven-it-plugin-core-stubs\maven-resources-plugin\target\surefire-reports\*.xml
[withMaven] junitPublisher - Archive test results for Maven artifact org.apache.maven.plugins:maven-site-plugin:maven-plugin:0.1-stub-SNAPSHOT generated by maven-surefire-plugin:test (default-test): core-it-support\core-it-plugins\maven-it-plugin-core-stubs\maven-site-plugin\target\surefire-reports\*.xml
[withMaven] junitPublisher - Archive test results for Maven artifact org.apache.maven.plugins:maven-source-plugin:maven-plugin:0.1-stub-SNAPSHOT generated by maven-surefire-plugin:test (default-test): core-it-support\core-it-plugins\maven-it-plugin-core-stubs\maven-source-plugin\target\surefire-reports\*.xml
[withMaven] junitPublisher - Archive test results for Maven artifact org.apache.maven.plugins:maven-surefire-plugin:maven-plugin:0.1-stub-SNAPSHOT generated by maven-surefire-plugin:test (default-test): core-it-support\core-it-plugins\maven-it-plugin-core-stubs\maven-surefire-plugin\target\surefire-reports\*.xml
[withMaven] junitPublisher - Archive test results for Maven artifact org.apache.maven.plugins:maven-war-plugin:maven-plugin:0.1-stub-SNAPSHOT generated by maven-surefire-plugin:test (default-test): core-it-support\core-it-plugins\maven-it-plugin-core-stubs\maven-war-plugin\target\surefire-reports\*.xml
[withMaven] junitPublisher - Archive test results for Maven artifact org.apache.maven.its.plugins:maven-it-plugin-dependency-collection:maven-plugin:2.1-SNAPSHOT generated by maven-surefire-plugin:test (default-test): core-it-support\core-it-plugins\maven-it-plugin-dependency-collection\target\surefire-reports\*.xml
[withMaven] junitPublisher - Archive test results for Maven artifact org.apache.maven.its.plugins:maven-it-plugin-dependency-resolution:maven-plugin:2.1-SNAPSHOT generated by maven-surefire-plugin:test (default-test): core-it-support\core-it-plugins\maven-it-plugin-dependency-resolution\target\surefire-reports\*.xml
[withMaven] junitPublisher - Archive test results for Maven artifact org.apache.maven.its.plugins:maven-it-plugin-expression:maven-plugin:2.1-SNAPSHOT generated by maven-surefire-plugin:test (default-test): core-it-support\core-it-plugins\maven-it-plugin-expression\target\surefire-reports\*.xml
[withMaven] junitPublisher - Archive test results for Maven artifact org.apache.maven.its.plugins:maven-it-plugin-error:maven-plugin:2.1-SNAPSHOT generated by maven-surefire-plugin:test (default-test): core-it-support\core-it-plugins\maven-it-plugin-error\target\surefire-reports\*.xml
[withMaven] junitPublisher - Archive test results for Maven artifact org.apache.maven.its:core-it-component:jar:2.1-SNAPSHOT generated by maven-surefire-plugin:test (default-test): core-it-support\core-it-component\target\surefire-reports\*.xml
[withMaven] junitPublisher - Archive test results for Maven artifact org.apache.maven.its.plugins:maven-it-plugin-extension-consumer:maven-plugin:2.1-SNAPSHOT generated by maven-surefire-plugin:test (default-test): core-it-support\core-it-plugins\maven-it-plugin-extension-consumer\target\surefire-reports\*.xml
[withMaven] junitPublisher - Archive test results for Maven artifact org.apache.maven.its.plugins:maven-it-plugin-extension-provider:maven-plugin:2.1-SNAPSHOT generated by maven-surefire-plugin:test (default-test): core-it-support\core-it-plugins\maven-it-plugin-extension-provider\target\surefire-reports\*.xml
[withMaven] junitPublisher - Archive test results for Maven artifact org.apache.maven.its.plugins:maven-it-plugin-fork:maven-plugin:2.1-SNAPSHOT generated by maven-surefire-plugin:test (default-test): core-it-support\core-it-plugins\maven-it-plugin-fork\target\surefire-reports\*.xml
[withMaven] junitPublisher - Archive test results for Maven artifact org.apache.maven.its.plugins:maven-it-plugin-invalid-descriptor:maven-plugin:2.1-SNAPSHOT generated by maven-surefire-plugin:test (default-test): core-it-support\core-it-plugins\maven-it-plugin-invalid-descriptor\target\surefire-reports\*.xml
[withMaven] junitPublisher - Archive test results for Maven artifact org.apache.maven.its.plugins:maven-it-plugin-log-file:maven-plugin:2.1-SNAPSHOT generated by maven-surefire-plugin:test (default-test): core-it-support\core-it-plugins\maven-it-plugin-log-file\target\surefire-reports\*.xml
[withMaven] junitPublisher - Archive test results for Maven artifact org.apache.maven.its:maven-it-helper:jar:2.1-SNAPSHOT generated by maven-surefire-plugin:test (default-test): core-it-support\maven-it-helper\target\surefire-reports\*.xml
[withMaven] junitPublisher - Archive test results for Maven artifact org.apache.maven.its.plugins:maven-it-plugin-model-interpolation:maven-plugin:2.1-SNAPSHOT generated by maven-surefire-plugin:test (default-test): core-it-support\core-it-plugins\maven-it-plugin-model-interpolation\target\surefire-reports\*.xml
[withMaven] junitPublisher - Archive test results for Maven artifact org.apache.maven.its.plugins:maven-it-plugin-no-default-comp:maven-plugin:2.1-SNAPSHOT generated by maven-surefire-plugin:test (default-test): core-it-support\core-it-plugins\maven-it-plugin-no-default-comp\target\surefire-reports\*.xml
[withMaven] junitPublisher - Archive test results for Maven artifact org.apache.maven.its.plugins:maven-it-plugin-no-project:maven-plugin:2.1-SNAPSHOT generated by maven-surefire-plugin:test (default-test): core-it-support\core-it-plugins\maven-it-plugin-no-project\target\surefire-reports\*.xml
[withMaven] junitPublisher - Archive test results for Maven artifact org.apache.maven.its.plugins:maven-it-plugin-online:maven-plugin:2.1-SNAPSHOT generated by maven-surefire-plugin:test (default-test): core-it-support\core-it-plugins\maven-it-plugin-online\target\surefire-reports\*.xml
[withMaven] junitPublisher - Archive test results for Maven artifact org.apache.maven.its.plugins:maven-it-plugin-optional-mojos:maven-plugin:2.1-SNAPSHOT generated by maven-surefire-plugin:test (default-test): core-it-support\core-it-plugins\maven-it-plugin-optional-mojos\target\surefire-reports\*.xml
[withMaven] junitPublisher - Archive test results for Maven artifact org.apache.maven.its.plugins:maven-it-plugin-packaging:maven-plugin:2.1-SNAPSHOT generated by maven-surefire-plugin:test (default-test): core-it-support\core-it-plugins\maven-it-plugin-packaging\target\surefire-reports\*.xml
[withMaven] junitPublisher - Archive test results for Maven artifact org.apache.maven.its.plugins:maven-it-plugin-parameter-implementation:maven-plugin:2.1-SNAPSHOT generated by maven-surefire-plugin:test (default-test): core-it-support\core-it-plugins\maven-it-plugin-parameter-implementation\target\surefire-reports\*.xml
[withMaven] junitPublisher - Archive test results for Maven artifact org.apache.maven.its.plugins:maven-it-plugin-plugin-dependency:maven-plugin:2.1-SNAPSHOT generated by maven-surefire-plugin:test (default-test): core-it-support\core-it-plugins\maven-it-plugin-plugin-dependency\target\surefire-reports\*.xml
[withMaven] junitPublisher - Archive test results for Maven artifact org.apache.maven.its.plugins:maven-it-plugin-project:maven-plugin:2.1-SNAPSHOT generated by maven-surefire-plugin:test (default-test): core-it-support\core-it-plugins\maven-it-plugin-project\target\surefire-reports\*.xml
[withMaven] junitPublisher - Archive test results for Maven artifact org.apache.maven.its.plugins:maven-it-plugin-project-interpolation:maven-plugin:2.1-SNAPSHOT generated by maven-surefire-plugin:test (default-test): core-it-support\core-it-plugins\maven-it-plugin-project-interpolation\target\surefire-reports\*.xml
[withMaven] junitPublisher - Archive test results for Maven artifact org.apache.maven.its.plugins:maven-it-plugin-setter:maven-plugin:2.1-SNAPSHOT generated by maven-surefire-plugin:test (default-test): core-it-support\core-it-plugins\maven-it-plugin-setter\target\surefire-reports\*.xml
[withMaven] junitPublisher - Archive test results for Maven artifact org.apache.maven.its.plugins:maven-it-plugin-singleton-component:maven-plugin:2.1-SNAPSHOT generated by maven-surefire-plugin:test (default-test): core-it-support\core-it-plugins\maven-it-plugin-singleton-component\target\surefire-reports\*.xml
[withMaven] junitPublisher - Archive test results for Maven artifact org.apache.maven.its.plugins:maven-it-plugin-site:maven-plugin:2.1-SNAPSHOT generated by maven-surefire-plugin:test (default-test): core-it-support\core-it-plugins\maven-it-plugin-site\target\surefire-reports\*.xml
[withMaven] junitPublisher - Archive test results for Maven artifact org.apache.maven.its.plugins:maven-it-plugin-toolchain:maven-plugin:2.1-SNAPSHOT generated by maven-surefire-plugin:test (default-test): core-it-support\core-it-plugins\maven-it-plugin-toolchain\target\surefire-reports\*.xml
[withMaven] junitPublisher - Archive test results for Maven artifact org.apache.maven.its.plugins:maven-it-plugin-touch:maven-plugin:2.1-SNAPSHOT generated by maven-surefire-plugin:test (default-test): core-it-support\core-it-plugins\maven-it-plugin-touch\target\surefire-reports\*.xml
[withMaven] junitPublisher - Archive test results for Maven artifact org.apache.maven.its.plugins:maven-it-plugin-uses-properties:maven-plugin:2.1-SNAPSHOT generated by maven-surefire-plugin:test (default-test): core-it-support\core-it-plugins\maven-it-plugin-uses-properties\target\surefire-reports\*.xml
[withMaven] junitPublisher - Archive test results for Maven artifact org.apache.maven.its.plugins:maven-it-plugin-uses-wagon:maven-plugin:2.1-SNAPSHOT generated by maven-surefire-plugin:test (default-test): core-it-support\core-it-plugins\maven-it-plugin-uses-wagon\target\surefire-reports\*.xml
[withMaven] junitPublisher - Archive test results for Maven artifact org.apache.maven.its.plugins:maven-it-plugin-all:maven-plugin:2.1-SNAPSHOT generated by maven-surefire-plugin:test (default-test): core-it-support\core-it-plugins\maven-it-plugin-all\target\surefire-reports\*.xml
[withMaven] junitPublisher - Archive test results for Maven artifact org.apache.maven.its.plugins:maven-it-plugin-plexus-utils-11:maven-plugin:2.1-SNAPSHOT generated by maven-surefire-plugin:test (default-test): core-it-support\core-it-plugins\maven-it-plugin-plexus-utils-11\target\surefire-reports\*.xml
[withMaven] junitPublisher - Archive test results for Maven artifact org.apache.maven.its.plugins:maven-it-plugin-plexus-utils-new:maven-plugin:2.1-SNAPSHOT generated by maven-surefire-plugin:test (default-test): core-it-support\core-it-plugins\maven-it-plugin-plexus-utils-new\target\surefire-reports\*.xml
[withMaven] junitPublisher - Archive test results for Maven artifact org.apache.maven.its.plugins:maven-it-plugin-plexus-component-api:maven-plugin:2.1-SNAPSHOT generated by maven-surefire-plugin:test (default-test): core-it-support\core-it-plugins\maven-it-plugin-plexus-component-api\target\surefire-reports\*.xml
[withMaven] junitPublisher - Archive test results for Maven artifact org.apache.maven.its.plugins:maven-it-plugin-log4j:maven-plugin:2.1-SNAPSHOT generated by maven-surefire-plugin:test (default-test): core-it-support\core-it-plugins\maven-it-plugin-log4j\target\surefire-reports\*.xml
[withMaven] junitPublisher - Archive test results for Maven artifact org.apache.maven.its.plugins:maven-it-plugin-extension1:maven-plugin:2.1-SNAPSHOT generated by maven-surefire-plugin:test (default-test): core-it-support\core-it-plugins\maven-it-plugin-extension1\target\surefire-reports\*.xml
[withMaven] junitPublisher - Archive test results for Maven artifact org.apache.maven.its.plugins:maven-it-plugin-extension2:maven-plugin:2.1-SNAPSHOT generated by maven-surefire-plugin:test (default-test): core-it-support\core-it-plugins\maven-it-plugin-extension2\target\surefire-reports\*.xml
[withMaven] junitPublisher - Archive test results for Maven artifact org.apache.maven.its.plugins:maven-it-plugin-plexus-lifecycle:maven-plugin:2.1-SNAPSHOT generated by maven-surefire-plugin:test (default-test): core-it-support\core-it-plugins\maven-it-plugin-plexus-lifecycle\target\surefire-reports\*.xml
[withMaven] junitPublisher - Archive test results for Maven artifact org.apache.maven.its.plugins:maven-it-plugin-settings:maven-plugin:2.1-SNAPSHOT generated by maven-surefire-plugin:test (default-test): core-it-support\core-it-plugins\maven-it-plugin-settings\target\surefire-reports\*.xml
[withMaven] junitPublisher - Archive test results for Maven artifact org.apache.maven.its.plugins:mng-5805-pkg-type-mojo-configuration-extension:jar:2.1-SNAPSHOT generated by maven-surefire-plugin:test (default-test): core-it-support\core-it-plugins\mng5805-extension\target\surefire-reports\*.xml
[withMaven] junitPublisher - Archive test results for Maven artifact org.apache.maven.its.plugins:mng-5805-pkg-type-mojo-configuration-extension2:jar:2.1-SNAPSHOT generated by maven-surefire-plugin:test (default-test): core-it-support\core-it-plugins\mng5805-extension2\target\surefire-reports\*.xml
[withMaven] junitPublisher - Archive test results for Maven artifact org.apache.maven.its.plugins:mng-5805-pkg-type-mojo-configuration-plugin:maven-plugin:2.1-SNAPSHOT generated by maven-surefire-plugin:test (default-test): core-it-support\core-it-plugins\mng5805-plugin\target\surefire-reports\*.xml
[withMaven] junitPublisher - Archive test results for Maven artifact org.apache.maven.its.plugins:mng-5805-pkg-type-mojo-configuration-plugin-dep:jar:2.1-SNAPSHOT generated by maven-surefire-plugin:test (default-test): core-it-support\core-it-plugins\mng5805-plugin-dep\target\surefire-reports\*.xml
[withMaven] junitPublisher - Archive test results for Maven artifact org.apache.maven.its.plugins:mng-5958-pkg-type-extension:jar:2.1-SNAPSHOT generated by maven-surefire-plugin:test (default-test): core-it-support\core-it-plugins\mng5958-extension\target\surefire-reports\*.xml
[withMaven] junitPublisher - Archive test results for Maven artifact org.apache.maven.its.plugins:mng-6759-resolves-project-dependencies-plugin:maven-plugin:2.1-SNAPSHOT generated by maven-surefire-plugin:test (default-test): core-it-support\core-it-plugins\mng6759-plugin-resolves-project-dependencies\target\surefire-reports\*.xml
[withMaven] junitPublisher - Archive test results for Maven artifact org.apache.maven.its:core-it-toolchain:jar:2.1-SNAPSHOT generated by maven-surefire-plugin:test (default-test): core-it-support\core-it-toolchain\target\surefire-reports\*.xml
[withMaven] junitPublisher - Archive test results for Maven artifact org.apache.maven.its:core-it-wagon:jar:2.1-SNAPSHOT generated by maven-surefire-plugin:test (default-test): core-it-support\core-it-wagon\target\surefire-reports\*.xml
[withMaven] junitPublisher - Archive test results for Maven artifact org.apache.maven.its:core-it-extension:jar:2.1-SNAPSHOT generated by maven-surefire-plugin:test (default-test): core-it-support\core-it-extension\target\surefire-reports\*.xml
[withMaven] junitPublisher - Archive test results for Maven artifact mng-coreit:javaagent:jar:1.0-SNAPSHOT generated by maven-surefire-plugin:test (default-test): core-it-support\core-it-javaagent\target\surefire-reports\*.xml
[withMaven] junitPublisher - Archive test results for Maven artifact org.apache.maven.its:core-it-suite:jar:2.1-SNAPSHOT generated by maven-surefire-plugin:test (default-test): core-it-suite\target\surefire-reports\*.xml
Recording test results
[Pipeline] }
[Pipeline] // dir
[Pipeline] }
[Pipeline] // stage
[Pipeline] }
[Pipeline] // node
[Pipeline] }
[withMaven] Jenkins Task Scanner Plugin not found, don't display results of source code scanning for 'TODO' and 'FIXME' in pipeline screen.
[DevOpticsMavenPublisher] dependencies consumed: 5, artifacts produced: 156
[withMaven] Publishers: Pipeline Graph Publisher: 41 ms, Generated Artifacts Publisher: 45615 ms, Invoker Publisher: 2 ms, Junit Publisher: 194282 ms, Concordion Publisher: 1 ms, Dependencies Fingerprint Publisher: 1575 ms, Findbugs Publisher: 1 ms, JGiven Publisher: 1 ms, Jacoco Publisher: 1 ms, SpotBugs Publisher: 1 ms, Open Task Scanner Publisher: 6 ms, CloudBees DevOptics Gate Artifact Publisher: 154389 ms
[Pipeline] // withMaven
[Pipeline] fileExists
[Pipeline] zip
Compress c:\mvn-it-0.tmp\core-it-suite\target\test-classes to c:\mvn-it-0.tmp\core-it-suite-logs-windows-jdk8.zip
Compressed 9120 entries.
Archiving c:\mvn-it-0.tmp\core-it-suite-logs-windows-jdk8.zip
[Pipeline] fileExists
[Pipeline] zip
Compress c:\mvn-it-0.tmp\core-it-suite\target\surefire-reports to c:\mvn-it-0.tmp\core-it-suite-reports-windows-jdk8.zip
Compressed 4 entries.
Archiving c:\mvn-it-0.tmp\core-it-suite-reports-windows-jdk8.zip
[Pipeline] deleteDir
[Pipeline] }
[Pipeline] // dir
[Pipeline] }
[Pipeline] // stage
[Pipeline] }
[Pipeline] // node
[Pipeline] }
[Pipeline] // parallel
[Pipeline] stage
[Pipeline] { (Notifications)
[Pipeline] echo
Build result: UNSTABLE
[Pipeline] jiraIssueSelector
[Pipeline] jiraComment
[Pipeline] echo
The authors of changes [hboutemy, noreply, michaelo].
[Pipeline] echo
Sending email ...
[Pipeline] emailext