You are viewing a plain text version of this content. The canonical link for it is here.
Posted to builds@solr.apache.org by Apache Jenkins Server <je...@builds.apache.org> on 2024/02/03 00:41:23 UTC
[JENKINS] Solr » Solr-Check-9.x (Crave) - Build # 6241 - Still Failing!
Build: https://ci-builds.apache.org/job/Solr/job/Solr-Check-9.x%20(Crave)/6241/
No tests ran.
Build Log:
[...truncated 14277 lines...]
# ERROR: Solr is not running on url https://localhost:34598/solr after 5 seconds
#
# Please find the SOLR_HOME snapshot for failed test #5 at: /tmp/src/solr/solr/packaging/build/test-output/failure-snapshots/64-5
# Last output:
# INFO - 2024-02-03 00:36:27.439; org.apache.solr.util.configuration.SSLConfigurations; Setting javax.net.ssl.keyStorePassword
# INFO - 2024-02-03 00:36:27.444; org.apache.solr.util.configuration.SSLConfigurations; Setting javax.net.ssl.trustStorePassword
# WARN - 2024-02-03 00:36:28.292; org.apache.solr.common.cloud.SolrZkClient; Using default ZkCredentialsInjector. ZkCredentialsInjector is not secure, it creates an empty list of credentials which leads to 'OPEN_ACL_UNSAFE' ACLs to Zookeeper nodes
# WARN - 2024-02-03 00:36:28.331; org.apache.solr.common.cloud.SolrZkClient; Using default ZkACLProvider. DefaultZkACLProvider is not secure, it creates 'OPEN_ACL_UNSAFE' ACLs to Zookeeper nodes
ok 65 start solr with mTLS wanted in 56511ms
ok 66 test keystore reload in 81516ms
ok 67 SOLR-11740 check 'solr stop' connection in 28853ms
ok 68 stop command for single port in 31793ms
ok 69 status detects locally running solr in 14825ms
ok 70 status does not expose cli parameters to end user in 292ms
ok 71 listing out files in 2389ms
ok 72 copying files around in 7297ms
ok 73 upconfig in 3003ms
ok 74 zkcli.sh gets 'solrhome' from 'solr.home' system property in 1275ms
ok 75 zkcli.sh gets 'solrhome' from 'solrhome' command line option in 1276ms
ok 76 Cleanup in 1302ms
> Task :solr:packaging:integrationTests FAILED
ERROR: The following test(s) have failed:
- org.apache.solr.cloud.RollingRestartTest.test (:solr:core)
Test output: /tmp/src/solr/solr/core/build/test-results/test/outputs/OUTPUT-org.apache.solr.cloud.RollingRestartTest.txt
Reproduce with: gradlew :solr:core:test --tests "org.apache.solr.cloud.RollingRestartTest.test" -Ptests.jvms=96 "-Ptests.jvmargs=-XX:TieredStopAtLevel=1 -XX:+UseParallelGC -XX:ActiveProcessorCount=1 -XX:ReservedCodeCacheSize=120m" -Ptests.seed=3865B1E45D0040C2 -Ptests.file.encoding=ISO-8859-1
- org.apache.solr.cloud.api.collections.TestCollectionAPI.testRecreateCollectionAfterFailure (:solr:core)
Test output: /tmp/src/solr/solr/core/build/test-results/test/outputs/OUTPUT-org.apache.solr.cloud.api.collections.TestCollectionAPI.txt
Reproduce with: gradlew :solr:core:test --tests "org.apache.solr.cloud.api.collections.TestCollectionAPI.testRecreateCollectionAfterFailure" -Ptests.jvms=96 "-Ptests.jvmargs=-XX:TieredStopAtLevel=1 -XX:+UseParallelGC -XX:ActiveProcessorCount=1 -XX:ReservedCodeCacheSize=120m" -Ptests.seed=3865B1E45D0040C2 -Ptests.file.encoding=ISO-8859-1
- org.apache.solr.cloud.DistribCursorPagingTest.test (:solr:core)
Test output: /tmp/src/solr/solr/core/build/test-results/test/outputs/OUTPUT-org.apache.solr.cloud.DistribCursorPagingTest.txt
Reproduce with: gradlew :solr:core:test --tests "org.apache.solr.cloud.DistribCursorPagingTest.test" -Ptests.jvms=96 "-Ptests.jvmargs=-XX:TieredStopAtLevel=1 -XX:+UseParallelGC -XX:ActiveProcessorCount=1 -XX:ReservedCodeCacheSize=120m" -Ptests.seed=3865B1E45D0040C2 -Ptests.file.encoding=ISO-8859-1
- org.apache.solr.cloud.TestDistribDocBasedVersion.test (:solr:core)
Test output: /tmp/src/solr/solr/core/build/test-results/test/outputs/OUTPUT-org.apache.solr.cloud.TestDistribDocBasedVersion.txt
Reproduce with: gradlew :solr:core:test --tests "org.apache.solr.cloud.TestDistribDocBasedVersion.test" -Ptests.jvms=96 "-Ptests.jvmargs=-XX:TieredStopAtLevel=1 -XX:+UseParallelGC -XX:ActiveProcessorCount=1 -XX:ReservedCodeCacheSize=120m" -Ptests.seed=3865B1E45D0040C2 -Ptests.file.encoding=ISO-8859-1
- org.apache.solr.cloud.BasicDistributedZk2Test.test (:solr:core)
Test output: /tmp/src/solr/solr/core/build/test-results/test/outputs/OUTPUT-org.apache.solr.cloud.BasicDistributedZk2Test.txt
Reproduce with: gradlew :solr:core:test --tests "org.apache.solr.cloud.BasicDistributedZk2Test.test" -Ptests.jvms=96 "-Ptests.jvmargs=-XX:TieredStopAtLevel=1 -XX:+UseParallelGC -XX:ActiveProcessorCount=1 -XX:ReservedCodeCacheSize=120m" -Ptests.seed=3865B1E45D0040C2 -Ptests.file.encoding=ISO-8859-1
- org.apache.solr.cloud.ShardRoutingCustomTest.test (:solr:core)
Test output: /tmp/src/solr/solr/core/build/test-results/test/outputs/OUTPUT-org.apache.solr.cloud.ShardRoutingCustomTest.txt
Reproduce with: gradlew :solr:core:test --tests "org.apache.solr.cloud.ShardRoutingCustomTest.test" -Ptests.jvms=96 "-Ptests.jvmargs=-XX:TieredStopAtLevel=1 -XX:+UseParallelGC -XX:ActiveProcessorCount=1 -XX:ReservedCodeCacheSize=120m" -Ptests.seed=3865B1E45D0040C2 -Ptests.file.encoding=ISO-8859-1
- org.apache.solr.cloud.SolrCloudExampleTest.testLoadDocsIntoGettingStartedCollection (:solr:core)
Test output: /tmp/src/solr/solr/core/build/test-results/test/outputs/OUTPUT-org.apache.solr.cloud.SolrCloudExampleTest.txt
Reproduce with: gradlew :solr:core:test --tests "org.apache.solr.cloud.SolrCloudExampleTest.testLoadDocsIntoGettingStartedCollection" -Ptests.jvms=96 "-Ptests.jvmargs=-XX:TieredStopAtLevel=1 -XX:+UseParallelGC -XX:ActiveProcessorCount=1 -XX:ReservedCodeCacheSize=120m" -Ptests.seed=3865B1E45D0040C2 -Ptests.file.encoding=ISO-8859-1
- org.apache.solr.cloud.BasicDistributedZkTest.test (:solr:core)
Test output: /tmp/src/solr/solr/core/build/test-results/test/outputs/OUTPUT-org.apache.solr.cloud.BasicDistributedZkTest.txt
Reproduce with: gradlew :solr:core:test --tests "org.apache.solr.cloud.BasicDistributedZkTest.test" -Ptests.jvms=96 "-Ptests.jvmargs=-XX:TieredStopAtLevel=1 -XX:+UseParallelGC -XX:ActiveProcessorCount=1 -XX:ReservedCodeCacheSize=120m" -Ptests.seed=3865B1E45D0040C2 -Ptests.file.encoding=ISO-8859-1
- org.apache.solr.cloud.api.collections.TestCollectionAPI.test (:solr:core)
Test output: /tmp/src/solr/solr/core/build/test-results/test/outputs/OUTPUT-org.apache.solr.cloud.api.collections.TestCollectionAPI.txt
Reproduce with: gradlew :solr:core:test --tests "org.apache.solr.cloud.api.collections.TestCollectionAPI.test" -Ptests.jvms=96 "-Ptests.jvmargs=-XX:TieredStopAtLevel=1 -XX:+UseParallelGC -XX:ActiveProcessorCount=1 -XX:ReservedCodeCacheSize=120m" -Ptests.seed=3865B1E45D0040C2 -Ptests.file.encoding=ISO-8859-1
- org.apache.solr.cloud.LeaderFailureAfterFreshStartTest.test (:solr:core)
Test output: /tmp/src/solr/solr/core/build/test-results/test/outputs/OUTPUT-org.apache.solr.cloud.LeaderFailureAfterFreshStartTest.txt
Reproduce with: gradlew :solr:core:test --tests "org.apache.solr.cloud.LeaderFailureAfterFreshStartTest.test" -Ptests.jvms=96 "-Ptests.jvmargs=-XX:TieredStopAtLevel=1 -XX:+UseParallelGC -XX:ActiveProcessorCount=1 -XX:ReservedCodeCacheSize=120m" -Ptests.seed=3865B1E45D0040C2 -Ptests.file.encoding=ISO-8859-1
- org.apache.solr.cloud.MultiThreadedOCPTest.testDeduplicationOfSubmittedTasks (:solr:core)
Test output: /tmp/src/solr/solr/core/build/test-results/test/outputs/OUTPUT-org.apache.solr.cloud.MultiThreadedOCPTest.txt
Reproduce with: gradlew :solr:core:test --tests "org.apache.solr.cloud.MultiThreadedOCPTest.testDeduplicationOfSubmittedTasks" -Ptests.jvms=96 "-Ptests.jvmargs=-XX:TieredStopAtLevel=1 -XX:+UseParallelGC -XX:ActiveProcessorCount=1 -XX:ReservedCodeCacheSize=120m" -Ptests.seed=3865B1E45D0040C2 -Ptests.file.encoding=ISO-8859-1
- org.apache.solr.cloud.SyncSliceTest.test (:solr:core)
Test output: /tmp/src/solr/solr/core/build/test-results/test/outputs/OUTPUT-org.apache.solr.cloud.SyncSliceTest.txt
Reproduce with: gradlew :solr:core:test --tests "org.apache.solr.cloud.SyncSliceTest.test" -Ptests.jvms=96 "-Ptests.jvmargs=-XX:TieredStopAtLevel=1 -XX:+UseParallelGC -XX:ActiveProcessorCount=1 -XX:ReservedCodeCacheSize=120m" -Ptests.seed=3865B1E45D0040C2 -Ptests.file.encoding=ISO-8859-1
- org.apache.solr.cloud.TestDynamicFieldNamesIndexCorrectly.test (:solr:core)
Test output: /tmp/src/solr/solr/core/build/test-results/test/outputs/OUTPUT-org.apache.solr.cloud.TestDynamicFieldNamesIndexCorrectly.txt
Reproduce with: gradlew :solr:core:test --tests "org.apache.solr.cloud.TestDynamicFieldNamesIndexCorrectly.test" -Ptests.jvms=96 "-Ptests.jvmargs=-XX:TieredStopAtLevel=1 -XX:+UseParallelGC -XX:ActiveProcessorCount=1 -XX:ReservedCodeCacheSize=120m" -Ptests.seed=3865B1E45D0040C2 -Ptests.file.encoding=ISO-8859-1
- org.apache.solr.cloud.api.collections.TestRequestStatusCollectionAPI.test (:solr:core)
Test output: /tmp/src/solr/solr/core/build/test-results/test/outputs/OUTPUT-org.apache.solr.cloud.api.collections.TestRequestStatusCollectionAPI.txt
Reproduce with: gradlew :solr:core:test --tests "org.apache.solr.cloud.api.collections.TestRequestStatusCollectionAPI.test" -Ptests.jvms=96 "-Ptests.jvmargs=-XX:TieredStopAtLevel=1 -XX:+UseParallelGC -XX:ActiveProcessorCount=1 -XX:ReservedCodeCacheSize=120m" -Ptests.seed=3865B1E45D0040C2 -Ptests.file.encoding=ISO-8859-1
- org.apache.solr.cloud.MultiThreadedOCPTest.testLongAndShortRunningParallelApiCalls (:solr:core)
Test output: /tmp/src/solr/solr/core/build/test-results/test/outputs/OUTPUT-org.apache.solr.cloud.MultiThreadedOCPTest.txt
Reproduce with: gradlew :solr:core:test --tests "org.apache.solr.cloud.MultiThreadedOCPTest.testLongAndShortRunningParallelApiCalls" -Ptests.jvms=96 "-Ptests.jvmargs=-XX:TieredStopAtLevel=1 -XX:+UseParallelGC -XX:ActiveProcessorCount=1 -XX:ReservedCodeCacheSize=120m" -Ptests.seed=3865B1E45D0040C2 -Ptests.file.encoding=ISO-8859-1
- org.apache.solr.cloud.HttpPartitionOnCommitTest.test (:solr:core)
Test output: /tmp/src/solr/solr/core/build/test-results/test/outputs/OUTPUT-org.apache.solr.cloud.HttpPartitionOnCommitTest.txt
Reproduce with: gradlew :solr:core:test --tests "org.apache.solr.cloud.HttpPartitionOnCommitTest.test" -Ptests.jvms=96 "-Ptests.jvmargs=-XX:TieredStopAtLevel=1 -XX:+UseParallelGC -XX:ActiveProcessorCount=1 -XX:ReservedCodeCacheSize=120m" -Ptests.seed=3865B1E45D0040C2 -Ptests.file.encoding=ISO-8859-1
- org.apache.solr.cloud.api.collections.SimpleCollectionCreateDeleteTest.testPropertiesOfReplica (:solr:core)
Test output: /tmp/src/solr/solr/core/build/test-results/test/outputs/OUTPUT-org.apache.solr.cloud.api.collections.SimpleCollectionCreateDeleteTest.txt
Reproduce with: gradlew :solr:core:test --tests "org.apache.solr.cloud.api.collections.SimpleCollectionCreateDeleteTest.testPropertiesOfReplica" -Ptests.jvms=96 "-Ptests.jvmargs=-XX:TieredStopAtLevel=1 -XX:+UseParallelGC -XX:ActiveProcessorCount=1 -XX:ReservedCodeCacheSize=120m" -Ptests.seed=3865B1E45D0040C2 -Ptests.file.encoding=ISO-8859-1
- org.apache.solr.cloud.TestShortCircuitedRequests.test (:solr:core)
Test output: /tmp/src/solr/solr/core/build/test-results/test/outputs/OUTPUT-org.apache.solr.cloud.TestShortCircuitedRequests.txt
Reproduce with: gradlew :solr:core:test --tests "org.apache.solr.cloud.TestShortCircuitedRequests.test" -Ptests.jvms=96 "-Ptests.jvmargs=-XX:TieredStopAtLevel=1 -XX:+UseParallelGC -XX:ActiveProcessorCount=1 -XX:ReservedCodeCacheSize=120m" -Ptests.seed=3865B1E45D0040C2 -Ptests.file.encoding=ISO-8859-1
- org.apache.solr.cloud.RecoveryAfterSoftCommitTest.test (:solr:core)
Test output: /tmp/src/solr/solr/core/build/test-results/test/outputs/OUTPUT-org.apache.solr.cloud.RecoveryAfterSoftCommitTest.txt
Reproduce with: gradlew :solr:core:test --tests "org.apache.solr.cloud.RecoveryAfterSoftCommitTest.test" -Ptests.jvms=96 "-Ptests.jvmargs=-XX:TieredStopAtLevel=1 -XX:+UseParallelGC -XX:ActiveProcessorCount=1 -XX:ReservedCodeCacheSize=120m" -Ptests.seed=3865B1E45D0040C2 -Ptests.file.encoding=ISO-8859-1
- org.apache.solr.cloud.api.collections.TestCollectionAPI.testCreateCollectionBooleanValues (:solr:core)
Test output: /tmp/src/solr/solr/core/build/test-results/test/outputs/OUTPUT-org.apache.solr.cloud.api.collections.TestCollectionAPI.txt
Reproduce with: gradlew :solr:core:test --tests "org.apache.solr.cloud.api.collections.TestCollectionAPI.testCreateCollectionBooleanValues" -Ptests.jvms=96 "-Ptests.jvmargs=-XX:TieredStopAtLevel=1 -XX:+UseParallelGC -XX:ActiveProcessorCount=1 -XX:ReservedCodeCacheSize=120m" -Ptests.seed=3865B1E45D0040C2 -Ptests.file.encoding=ISO-8859-1
- org.apache.solr.cloud.api.collections.TestReplicaProperties.test (:solr:core)
Test output: /tmp/src/solr/solr/core/build/test-results/test/outputs/OUTPUT-org.apache.solr.cloud.api.collections.TestReplicaProperties.txt
Reproduce with: gradlew :solr:core:test --tests "org.apache.solr.cloud.api.collections.TestReplicaProperties.test" -Ptests.jvms=96 "-Ptests.jvmargs=-XX:TieredStopAtLevel=1 -XX:+UseParallelGC -XX:ActiveProcessorCount=1 -XX:ReservedCodeCacheSize=120m" -Ptests.seed=3865B1E45D0040C2 -Ptests.file.encoding=ISO-8859-1
- org.apache.solr.cloud.ReplicationFactorTest.test (:solr:core)
Test output: /tmp/src/solr/solr/core/build/test-results/test/outputs/OUTPUT-org.apache.solr.cloud.ReplicationFactorTest.txt
Reproduce with: gradlew :solr:core:test --tests "org.apache.solr.cloud.ReplicationFactorTest.test" -Ptests.jvms=96 "-Ptests.jvmargs=-XX:TieredStopAtLevel=1 -XX:+UseParallelGC -XX:ActiveProcessorCount=1 -XX:ReservedCodeCacheSize=120m" -Ptests.seed=3865B1E45D0040C2 -Ptests.file.encoding=ISO-8859-1
- org.apache.solr.cloud.PeerSyncReplicationTest.test (:solr:core)
Test output: /tmp/src/solr/solr/core/build/test-results/test/outputs/OUTPUT-org.apache.solr.cloud.PeerSyncReplicationTest.txt
Reproduce with: gradlew :solr:core:test --tests "org.apache.solr.cloud.PeerSyncReplicationTest.test" -Ptests.jvms=96 "-Ptests.jvmargs=-XX:TieredStopAtLevel=1 -XX:+UseParallelGC -XX:ActiveProcessorCount=1 -XX:ReservedCodeCacheSize=120m" -Ptests.seed=3865B1E45D0040C2 -Ptests.file.encoding=ISO-8859-1
- org.apache.solr.cloud.TestOnReconnectListenerSupport.test (:solr:core)
Test output: /tmp/src/solr/solr/core/build/test-results/test/outputs/OUTPUT-org.apache.solr.cloud.TestOnReconnectListenerSupport.txt
Reproduce with: gradlew :solr:core:test --tests "org.apache.solr.cloud.TestOnReconnectListenerSupport.test" -Ptests.jvms=96 "-Ptests.jvmargs=-XX:TieredStopAtLevel=1 -XX:+UseParallelGC -XX:ActiveProcessorCount=1 -XX:ReservedCodeCacheSize=120m" -Ptests.seed=3865B1E45D0040C2 -Ptests.file.encoding=ISO-8859-1
- org.apache.solr.cloud.UnloadDistributedZkTest.test (:solr:core)
Test output: /tmp/src/solr/solr/core/build/test-results/test/outputs/OUTPUT-org.apache.solr.cloud.UnloadDistributedZkTest.txt
Reproduce with: gradlew :solr:core:test --tests "org.apache.solr.cloud.UnloadDistributedZkTest.test" -Ptests.jvms=96 "-Ptests.jvmargs=-XX:TieredStopAtLevel=1 -XX:+UseParallelGC -XX:ActiveProcessorCount=1 -XX:ReservedCodeCacheSize=120m" -Ptests.seed=3865B1E45D0040C2 -Ptests.file.encoding=ISO-8859-1
- org.apache.solr.core.TestCustomStream.testDynamicLoadingCustomStream (:solr:core)
Test output: /tmp/src/solr/solr/core/build/test-results/test/outputs/OUTPUT-org.apache.solr.core.TestCustomStream.txt
Reproduce with: gradlew :solr:core:test --tests "org.apache.solr.core.TestCustomStream.testDynamicLoadingCustomStream" -Ptests.jvms=96 "-Ptests.jvmargs=-XX:TieredStopAtLevel=1 -XX:+UseParallelGC -XX:ActiveProcessorCount=1 -XX:ReservedCodeCacheSize=120m" -Ptests.seed=3865B1E45D0040C2 -Ptests.file.encoding=ISO-8859-1
- org.apache.solr.cloud.ShardRoutingTest.test (:solr:core)
Test output: /tmp/src/solr/solr/core/build/test-results/test/outputs/OUTPUT-org.apache.solr.cloud.ShardRoutingTest.txt
Reproduce with: gradlew :solr:core:test --tests "org.apache.solr.cloud.ShardRoutingTest.test" -Ptests.jvms=96 "-Ptests.jvmargs=-XX:TieredStopAtLevel=1 -XX:+UseParallelGC -XX:ActiveProcessorCount=1 -XX:ReservedCodeCacheSize=120m" -Ptests.seed=3865B1E45D0040C2 -Ptests.file.encoding=ISO-8859-1
- org.apache.solr.cloud.MultiThreadedOCPTest.testParallelCollectionAPICalls (:solr:core)
Test output: /tmp/src/solr/solr/core/build/test-results/test/outputs/OUTPUT-org.apache.solr.cloud.MultiThreadedOCPTest.txt
Reproduce with: gradlew :solr:core:test --tests "org.apache.solr.cloud.MultiThreadedOCPTest.testParallelCollectionAPICalls" -Ptests.jvms=96 "-Ptests.jvmargs=-XX:TieredStopAtLevel=1 -XX:+UseParallelGC -XX:ActiveProcessorCount=1 -XX:ReservedCodeCacheSize=120m" -Ptests.seed=3865B1E45D0040C2 -Ptests.file.encoding=ISO-8859-1
- org.apache.solr.cloud.TestRandomRequestDistribution.test (:solr:core)
Test output: /tmp/src/solr/solr/core/build/test-results/test/outputs/OUTPUT-org.apache.solr.cloud.TestRandomRequestDistribution.txt
Reproduce with: gradlew :solr:core:test --tests "org.apache.solr.cloud.TestRandomRequestDistribution.test" -Ptests.jvms=96 "-Ptests.jvmargs=-XX:TieredStopAtLevel=1 -XX:+UseParallelGC -XX:ActiveProcessorCount=1 -XX:ReservedCodeCacheSize=120m" -Ptests.seed=3865B1E45D0040C2 -Ptests.file.encoding=ISO-8859-1
- org.apache.solr.cloud.api.collections.TestCollectionAPI.testConfigCaching (:solr:core)
Test output: /tmp/src/solr/solr/core/build/test-results/test/outputs/OUTPUT-org.apache.solr.cloud.api.collections.TestCollectionAPI.txt
Reproduce with: gradlew :solr:core:test --tests "org.apache.solr.cloud.api.collections.TestCollectionAPI.testConfigCaching" -Ptests.jvms=96 "-Ptests.jvmargs=-XX:TieredStopAtLevel=1 -XX:+UseParallelGC -XX:ActiveProcessorCount=1 -XX:ReservedCodeCacheSize=120m" -Ptests.seed=3865B1E45D0040C2 -Ptests.file.encoding=ISO-8859-1
- org.apache.solr.cloud.api.collections.SimpleCollectionCreateDeleteTest.testCreateAndDeleteThenCreateAgain (:solr:core)
Test output: /tmp/src/solr/solr/core/build/test-results/test/outputs/OUTPUT-org.apache.solr.cloud.api.collections.SimpleCollectionCreateDeleteTest.txt
Reproduce with: gradlew :solr:core:test --tests "org.apache.solr.cloud.api.collections.SimpleCollectionCreateDeleteTest.testCreateAndDeleteThenCreateAgain" -Ptests.jvms=96 "-Ptests.jvmargs=-XX:TieredStopAtLevel=1 -XX:+UseParallelGC -XX:ActiveProcessorCount=1 -XX:ReservedCodeCacheSize=120m" -Ptests.seed=3865B1E45D0040C2 -Ptests.file.encoding=ISO-8859-1
- org.apache.solr.cloud.MultiThreadedOCPTest.testFillWorkQueue (:solr:core)
Test output: /tmp/src/solr/solr/core/build/test-results/test/outputs/OUTPUT-org.apache.solr.cloud.MultiThreadedOCPTest.txt
Reproduce with: gradlew :solr:core:test --tests "org.apache.solr.cloud.MultiThreadedOCPTest.testFillWorkQueue" -Ptests.jvms=96 "-Ptests.jvmargs=-XX:TieredStopAtLevel=1 -XX:+UseParallelGC -XX:ActiveProcessorCount=1 -XX:ReservedCodeCacheSize=120m" -Ptests.seed=3865B1E45D0040C2 -Ptests.file.encoding=ISO-8859-1
- org.apache.solr.cloud.api.collections.SimpleCollectionCreateDeleteTest.testDeleteDoesNotDeleteSharedAutocreatedConfigSet (:solr:core)
Test output: /tmp/src/solr/solr/core/build/test-results/test/outputs/OUTPUT-org.apache.solr.cloud.api.collections.SimpleCollectionCreateDeleteTest.txt
Reproduce with: gradlew :solr:core:test --tests "org.apache.solr.cloud.api.collections.SimpleCollectionCreateDeleteTest.testDeleteDoesNotDeleteSharedAutocreatedConfigSet" -Ptests.jvms=96 "-Ptests.jvmargs=-XX:TieredStopAtLevel=1 -XX:+UseParallelGC -XX:ActiveProcessorCount=1 -XX:ReservedCodeCacheSize=120m" -Ptests.seed=3865B1E45D0040C2 -Ptests.file.encoding=ISO-8859-1
- org.apache.solr.handler.TestSystemCollAutoCreate.testAutoCreate (:solr:core)
Test output: /tmp/src/solr/solr/core/build/test-results/test/outputs/OUTPUT-org.apache.solr.handler.TestSystemCollAutoCreate.txt
Reproduce with: gradlew :solr:core:test --tests "org.apache.solr.handler.TestSystemCollAutoCreate.testAutoCreate" -Ptests.jvms=96 "-Ptests.jvmargs=-XX:TieredStopAtLevel=1 -XX:+UseParallelGC -XX:ActiveProcessorCount=1 -XX:ReservedCodeCacheSize=120m" -Ptests.seed=3865B1E45D0040C2 -Ptests.file.encoding=ISO-8859-1
- org.apache.solr.cloud.api.collections.SimpleCollectionCreateDeleteTest.testDeleteAlsoDeletesAutocreatedConfigSet (:solr:core)
Test output: /tmp/src/solr/solr/core/build/test-results/test/outputs/OUTPUT-org.apache.solr.cloud.api.collections.SimpleCollectionCreateDeleteTest.txt
Reproduce with: gradlew :solr:core:test --tests "org.apache.solr.cloud.api.collections.SimpleCollectionCreateDeleteTest.testDeleteAlsoDeletesAutocreatedConfigSet" -Ptests.jvms=96 "-Ptests.jvmargs=-XX:TieredStopAtLevel=1 -XX:+UseParallelGC -XX:ActiveProcessorCount=1 -XX:ReservedCodeCacheSize=120m" -Ptests.seed=3865B1E45D0040C2 -Ptests.file.encoding=ISO-8859-1
- org.apache.solr.cloud.MultiThreadedOCPTest.testTaskExclusivity (:solr:core)
Test output: /tmp/src/solr/solr/core/build/test-results/test/outputs/OUTPUT-org.apache.solr.cloud.MultiThreadedOCPTest.txt
Reproduce with: gradlew :solr:core:test --tests "org.apache.solr.cloud.MultiThreadedOCPTest.testTaskExclusivity" -Ptests.jvms=96 "-Ptests.jvmargs=-XX:TieredStopAtLevel=1 -XX:+UseParallelGC -XX:ActiveProcessorCount=1 -XX:ReservedCodeCacheSize=120m" -Ptests.seed=3865B1E45D0040C2 -Ptests.file.encoding=ISO-8859-1
- org.apache.solr.cloud.TestCloudPivotFacet.test (:solr:core)
Test output: /tmp/src/solr/solr/core/build/test-results/test/outputs/OUTPUT-org.apache.solr.cloud.TestCloudPivotFacet.txt
Reproduce with: gradlew :solr:core:test --tests "org.apache.solr.cloud.TestCloudPivotFacet.test" -Ptests.jvms=96 "-Ptests.jvmargs=-XX:TieredStopAtLevel=1 -XX:+UseParallelGC -XX:ActiveProcessorCount=1 -XX:ReservedCodeCacheSize=120m" -Ptests.seed=3865B1E45D0040C2 -Ptests.file.encoding=ISO-8859-1
- org.apache.solr.schema.TestCloudManagedSchema.test (:solr:core)
Test output: /tmp/src/solr/solr/core/build/test-results/test/outputs/OUTPUT-org.apache.solr.schema.TestCloudManagedSchema.txt
Reproduce with: gradlew :solr:core:test --tests "org.apache.solr.schema.TestCloudManagedSchema.test" -Ptests.jvms=96 "-Ptests.jvmargs=-XX:TieredStopAtLevel=1 -XX:+UseParallelGC -XX:ActiveProcessorCount=1 -XX:ReservedCodeCacheSize=120m" -Ptests.seed=3865B1E45D0040C2 -Ptests.file.encoding=ISO-8859-1
- org.apache.solr.handler.TestSolrConfigHandlerConcurrent.test (:solr:core)
Test output: /tmp/src/solr/solr/core/build/test-results/test/outputs/OUTPUT-org.apache.solr.handler.TestSolrConfigHandlerConcurrent.txt
Reproduce with: gradlew :solr:core:test --tests "org.apache.solr.handler.TestSolrConfigHandlerConcurrent.test" -Ptests.jvms=96 "-Ptests.jvmargs=-XX:TieredStopAtLevel=1 -XX:+UseParallelGC -XX:ActiveProcessorCount=1 -XX:ReservedCodeCacheSize=120m" -Ptests.seed=3865B1E45D0040C2 -Ptests.file.encoding=ISO-8859-1
- org.apache.solr.update.TestInPlaceUpdatesDistrib.test (:solr:core)
Test output: /tmp/src/solr/solr/core/build/test-results/test/outputs/OUTPUT-org.apache.solr.update.TestInPlaceUpdatesDistrib.txt
Reproduce with: gradlew :solr:core:test --tests "org.apache.solr.update.TestInPlaceUpdatesDistrib.test" -Ptests.jvms=96 "-Ptests.jvmargs=-XX:TieredStopAtLevel=1 -XX:+UseParallelGC -XX:ActiveProcessorCount=1 -XX:ReservedCodeCacheSize=120m" -Ptests.seed=3865B1E45D0040C2 -Ptests.file.encoding=ISO-8859-1
- org.apache.solr.handler.TestSolrConfigHandlerCloud.test (:solr:core)
Test output: /tmp/src/solr/solr/core/build/test-results/test/outputs/OUTPUT-org.apache.solr.handler.TestSolrConfigHandlerCloud.txt
Reproduce with: gradlew :solr:core:test --tests "org.apache.solr.handler.TestSolrConfigHandlerCloud.test" -Ptests.jvms=96 "-Ptests.jvmargs=-XX:TieredStopAtLevel=1 -XX:+UseParallelGC -XX:ActiveProcessorCount=1 -XX:ReservedCodeCacheSize=120m" -Ptests.seed=3865B1E45D0040C2 -Ptests.file.encoding=ISO-8859-1
- org.apache.solr.cloud.TestStressInPlaceUpdates.stressTest (:solr:core)
Test output: /tmp/src/solr/solr/core/build/test-results/test/outputs/OUTPUT-org.apache.solr.cloud.TestStressInPlaceUpdates.txt
Reproduce with: gradlew :solr:core:test --tests "org.apache.solr.cloud.TestStressInPlaceUpdates.stressTest" -Ptests.jvms=96 "-Ptests.jvmargs=-XX:TieredStopAtLevel=1 -XX:+UseParallelGC -XX:ActiveProcessorCount=1 -XX:ReservedCodeCacheSize=120m" -Ptests.seed=3865B1E45D0040C2 -Ptests.file.encoding=ISO-8859-1
- org.apache.solr.handler.TestConfigReload.test (:solr:core)
Test output: /tmp/src/solr/solr/core/build/test-results/test/outputs/OUTPUT-org.apache.solr.handler.TestConfigReload.txt
Reproduce with: gradlew :solr:core:test --tests "org.apache.solr.handler.TestConfigReload.test" -Ptests.jvms=96 "-Ptests.jvmargs=-XX:TieredStopAtLevel=1 -XX:+UseParallelGC -XX:ActiveProcessorCount=1 -XX:ReservedCodeCacheSize=120m" -Ptests.seed=3865B1E45D0040C2 -Ptests.file.encoding=ISO-8859-1
- org.apache.solr.handler.component.TestTrackingShardHandlerFactory.testRequestTracking (:solr:core)
Test output: /tmp/src/solr/solr/core/build/test-results/test/outputs/OUTPUT-org.apache.solr.handler.component.TestTrackingShardHandlerFactory.txt
Reproduce with: gradlew :solr:core:test --tests "org.apache.solr.handler.component.TestTrackingShardHandlerFactory.testRequestTracking" -Ptests.jvms=96 "-Ptests.jvmargs=-XX:TieredStopAtLevel=1 -XX:+UseParallelGC -XX:ActiveProcessorCount=1 -XX:ReservedCodeCacheSize=120m" -Ptests.seed=3865B1E45D0040C2 -Ptests.file.encoding=ISO-8859-1
- org.apache.solr.security.TestAuthorizationFramework.authorizationFrameworkTest (:solr:core)
Test output: /tmp/src/solr/solr/core/build/test-results/test/outputs/OUTPUT-org.apache.solr.security.TestAuthorizationFramework.txt
Reproduce with: gradlew :solr:core:test --tests "org.apache.solr.security.TestAuthorizationFramework.authorizationFrameworkTest" -Ptests.jvms=96 "-Ptests.jvmargs=-XX:TieredStopAtLevel=1 -XX:+UseParallelGC -XX:ActiveProcessorCount=1 -XX:ReservedCodeCacheSize=120m" -Ptests.seed=3865B1E45D0040C2 -Ptests.file.encoding=ISO-8859-1
- org.apache.solr.schema.TestCloudSchemaless.test (:solr:core)
Test output: /tmp/src/solr/solr/core/build/test-results/test/outputs/OUTPUT-org.apache.solr.schema.TestCloudSchemaless.txt
Reproduce with: gradlew :solr:core:test --tests "org.apache.solr.schema.TestCloudSchemaless.test" -Ptests.jvms=96 "-Ptests.jvmargs=-XX:TieredStopAtLevel=1 -XX:+UseParallelGC -XX:ActiveProcessorCount=1 -XX:ReservedCodeCacheSize=120m" -Ptests.seed=3865B1E45D0040C2 -Ptests.file.encoding=ISO-8859-1
- org.apache.solr.handler.TestBlobHandler.doBlobHandlerTest (:solr:core)
Test output: /tmp/src/solr/solr/core/build/test-results/test/outputs/OUTPUT-org.apache.solr.handler.TestBlobHandler.txt
Reproduce with: gradlew :solr:core:test --tests "org.apache.solr.handler.TestBlobHandler.doBlobHandlerTest" -Ptests.jvms=96 "-Ptests.jvmargs=-XX:TieredStopAtLevel=1 -XX:+UseParallelGC -XX:ActiveProcessorCount=1 -XX:ReservedCodeCacheSize=120m" -Ptests.seed=3865B1E45D0040C2 -Ptests.file.encoding=ISO-8859-1
- org.apache.solr.schema.TestBulkSchemaConcurrent.test (:solr:core)
Test output: /tmp/src/solr/solr/core/build/test-results/test/outputs/OUTPUT-org.apache.solr.schema.TestBulkSchemaConcurrent.txt
Reproduce with: gradlew :solr:core:test --tests "org.apache.solr.schema.TestBulkSchemaConcurrent.test" -Ptests.jvms=96 "-Ptests.jvmargs=-XX:TieredStopAtLevel=1 -XX:+UseParallelGC -XX:ActiveProcessorCount=1 -XX:ReservedCodeCacheSize=120m" -Ptests.seed=3865B1E45D0040C2 -Ptests.file.encoding=ISO-8859-1
WARNING: there were unreferenced files under license folder:
- /tmp/src/solr/solr/licenses/jakarta.inject-2.6.1.jar.sha1
FAILURE: Build completed with 2 failures.
1: Task failed with an exception.
-----------
* What went wrong:
Execution failed for task ':solr:core:test'.
> There were failing tests. See the results at: file:///tmp/src/solr/solr/core/build/test-results/test/
* Try:
> Run with --scan to get full insights.
==============================================================================
2: Task failed with an exception.
-----------
* Where:
Build file '/tmp/src/solr/solr/packaging/build.gradle' line: 301
* What went wrong:
Execution failed for task ':solr:packaging:integrationTests'.
> Process 'command '/tmp/src/solr/.gradle/node/packaging/node_modules/bats/bin/bats'' finished with non-zero exit value 1
* Try:
> Run with --stacktrace option to get the stack trace.
> Run with --info or --debug option to get more log output.
> Run with --scan to get full insights.
> Get more help at https://help.gradle.org.
==============================================================================
BUILD FAILED in 24m 5s
673 actionable tasks: 671 executed, 2 up-to-date
[0m[?12l[?25h
------------------------------------------------------------------------
Build Failed: returned 1
Total time: 24m26s
------------------------------------------------------------------------
+ status=1
+ ./crave pull '**/build/**/test/TEST-*.xml'
+ ./crave pull '**/*.events'
+ ./crave pull 'heapdumps/**'
Error: rsync: [sender] change_dir "/tmp/src/solr/heapdumps" failed: No such file or directory (2)
rsync error: some files/attrs were not transferred (see previous errors) (code 23) at main.c(1682) [Receiver=3.1.3]
rsync: [Receiver] write error: Broken pipe (32)
+ ./crave pull '**/hs_err_pid*'
+ exit 1
Build step 'Execute shell' marked build as failure
Archiving artifacts
Recording test results
ERROR: Step ‘Publish JUnit test result report’ failed: No test report files were found. Configuration error?
Email was triggered for: Failure - Any
Sending email for trigger: Failure - Any
[JENKINS] Solr » Solr-Check-9.x (Crave) - Build # 6256 - Still Failing!
Posted by Apache Jenkins Server <je...@builds.apache.org>.
Build: https://ci-builds.apache.org/job/Solr/job/Solr-Check-9.x%20(Crave)/6256/
No tests ran.
Build Log:
[...truncated 1216 lines...]
ERROR: Step ‘Publish JUnit test result report’ failed: No test report files were found. Configuration error?
Email was triggered for: Failure - Any
Sending email for trigger: Failure - Any
[JENKINS] Solr » Solr-Check-9.x (Crave) - Build # 6255 - Still Failing!
Posted by Apache Jenkins Server <je...@builds.apache.org>.
Build: https://ci-builds.apache.org/job/Solr/job/Solr-Check-9.x%20(Crave)/6255/
No tests ran.
Build Log:
[...truncated 1441 lines...]
2> SimplePostTool: FATAL: Connection error (is Solr running at https://127.0.0.1:46663/solr/testBasicRun/update ?): javax.net.ssl.SSLHandshakeException: PKIX path building failed: sun.security.provider.certpath.SunCertPathBuilderException: unable to find valid certification path to requested target
2>
2> ERROR: System/Runtime.exit(2) or halt(2) calls are not allowed because they terminate the test runner's JVM.
2>
> java.lang.AssertionError: expected:<0> but was:<1>
> at __randomizedtesting.SeedInfo.seed([5ABE15268B743599:98C8E222802F9DDA]:0)
> at org.junit.Assert.fail(Assert.java:89)
> at org.junit.Assert.failNotEquals(Assert.java:835)
> at org.junit.Assert.assertEquals(Assert.java:647)
> at org.junit.Assert.assertEquals(Assert.java:633)
> at org.apache.solr.cli.PostToolTest.testBasicRun(PostToolTest.java:63)
> at java.base/jdk.internal.reflect.NativeMethodAccessorImpl.invoke0(Native Method)
> at java.base/jdk.internal.reflect.NativeMethodAccessorImpl.invoke(NativeMethodAccessorImpl.java:62)
> at java.base/jdk.internal.reflect.DelegatingMethodAccessorImpl.invoke(DelegatingMethodAccessorImpl.java:43)
> at java.base/java.lang.reflect.Method.invoke(Method.java:566)
> at com.carrotsearch.randomizedtesting.RandomizedRunner.invoke(RandomizedRunner.java:1758)
> at com.carrotsearch.randomizedtesting.RandomizedRunner$8.evaluate(RandomizedRunner.java:946)
> at com.carrotsearch.randomizedtesting.RandomizedRunner$9.evaluate(RandomizedRunner.java:982)
> at com.carrotsearch.randomizedtesting.RandomizedRunner$10.evaluate(RandomizedRunner.java:996)
> at com.carrotsearch.randomizedtesting.rules.SystemPropertiesRestoreRule$1.evaluate(SystemPropertiesRestoreRule.java:80)
> at org.junit.rules.RunRules.evaluate(RunRules.java:20)
> at org.apache.lucene.tests.util.TestRuleSetupTeardownChained$1.evaluate(TestRuleSetupTeardownChained.java:48)
> at org.apache.lucene.tests.util.AbstractBeforeAfterRule$1.evaluate(AbstractBeforeAfterRule.java:43)
> at org.apache.lucene.tests.util.TestRuleThreadAndTestName$1.evaluate(TestRuleThreadAndTestName.java:45)
> at org.apache.lucene.tests.util.TestRuleIgnoreAfterMaxFailures$1.evaluate(TestRuleIgnoreAfterMaxFailures.java:60)
> at org.apache.lucene.tests.util.TestRuleMarkFailure$1.evaluate(TestRuleMarkFailure.java:44)
> at org.junit.rules.RunRules.evaluate(RunRules.java:20)
> at com.carrotsearch.randomizedtesting.rules.StatementAdapter.evaluate(StatementAdapter.java:36)
> at com.carrotsearch.randomizedtesting.ThreadLeakControl$StatementRunner.run(ThreadLeakControl.java:390)
> at com.carrotsearch.randomizedtesting.ThreadLeakControl.forkTimeoutingTask(ThreadLeakControl.java:843)
> at com.carrotsearch.randomizedtesting.ThreadLeakControl$3.evaluate(ThreadLeakControl.java:490)
> at com.carrotsearch.randomizedtesting.RandomizedRunner.runSingleTest(RandomizedRunner.java:955)
> at com.carrotsearch.randomizedtesting.RandomizedRunner$5.evaluate(RandomizedRunner.java:840)
> at com.carrotsearch.randomizedtesting.RandomizedRunner$6.evaluate(RandomizedRunner.java:891)
> at com.carrotsearch.randomizedtesting.RandomizedRunner$7.evaluate(RandomizedRunner.java:902)
> at com.carrotsearch.randomizedtesting.rules.StatementAdapter.evaluate(StatementAdapter.java:36)
> at com.carrotsearch.randomizedtesting.rules.StatementAdapter.evaluate(StatementAdapter.java:36)
> at org.apache.lucene.tests.util.AbstractBeforeAfterRule$1.evaluate(AbstractBeforeAfterRule.java:43)
> at org.apache.lucene.tests.util.AbstractBeforeAfterRule$1.evaluate(AbstractBeforeAfterRule.java:43)
> at com.carrotsearch.randomizedtesting.rules.SystemPropertiesRestoreRule$1.evaluate(SystemPropertiesRestoreRule.java:80)
> at org.junit.rules.RunRules.evaluate(RunRules.java:20)
> at org.apache.lucene.tests.util.AbstractBeforeAfterRule$1.evaluate(AbstractBeforeAfterRule.java:43)
> at com.carrotsearch.randomizedtesting.rules.StatementAdapter.evaluate(StatementAdapter.java:36)
> at org.apache.lucene.tests.util.TestRuleStoreClassName$1.evaluate(TestRuleStoreClassName.java:38)
> at com.carrotsearch.randomizedtesting.rules.NoShadowingOrOverridesOnMethodsRule$1.evaluate(NoShadowingOrOverridesOnMethodsRule.java:40)
> at com.carrotsearch.randomizedtesting.rules.NoShadowingOrOverridesOnMethodsRule$1.evaluate(NoShadowingOrOverridesOnMethodsRule.java:40)
> at com.carrotsearch.randomizedtesting.rules.StatementAdapter.evaluate(StatementAdapter.java:36)
> at com.carrotsearch.randomizedtesting.rules.StatementAdapter.evaluate(StatementAdapter.java:36)
> at org.apache.lucene.tests.util.TestRuleAssertionsRequired$1.evaluate(TestRuleAssertionsRequired.java:53)
> at org.apache.lucene.tests.util.AbstractBeforeAfterRule$1.evaluate(AbstractBeforeAfterRule.java:43)
> at org.apache.lucene.tests.util.TestRuleMarkFailure$1.evaluate(TestRuleMarkFailure.java:44)
> at org.apache.lucene.tests.util.TestRuleIgnoreAfterMaxFailures$1.evaluate(TestRuleIgnoreAfterMaxFailures.java:60)
> at org.apache.lucene.tests.util.TestRuleIgnoreTestSuites$1.evaluate(TestRuleIgnoreTestSuites.java:47)
> at org.junit.rules.RunRules.evaluate(RunRules.java:20)
> at com.carrotsearch.randomizedtesting.rules.StatementAdapter.evaluate(StatementAdapter.java:36)
> at com.carrotsearch.randomizedtesting.ThreadLeakControl$StatementRunner.run(ThreadLeakControl.java:390)
> at com.carrotsearch.randomizedtesting.ThreadLeakControl.lambda$forkTimeoutingTask$0(ThreadLeakControl.java:850)
> at java.base/java.lang.Thread.run(Thread.java:829)
2> NOTE: reproduce with: gradlew test --tests PostToolTest.testBasicRun -Dtests.seed=5ABE15268B743599 -Dtests.locale=mfe -Dtests.timezone=Indian/Mauritius -Dtests.asserts=true -Dtests.file.encoding=UTF-8
2> 17147 INFO (jetty-closer-36-thread-1) [n: c: s: r: x: t:] o.e.j.s.Server Stopped Server@2b5db962{STOPPING}[10.0.19,sto=0]
2> 17155 INFO (jetty-closer-36-thread-1) [n: c: s: r: x: t:] o.e.j.s.AbstractConnector Stopped ServerConnector@65ea30cc{ssl, (ssl, alpn, http/1.1, h2)}{127.0.0.1:0}
2> 17161 INFO (jetty-closer-36-thread-1) [n: c: s: r: x: t:] o.e.j.s.h.ContextHandler Stopped o.e.j.s.ServletContextHandler@2b3f03c6{/solr,file:///tmp/src/solr/solr/core/build/tmp/tests-cwd/,STOPPED}
2> 17624 WARN (ZkTestServer Run Thread) [n: c: s: r: x: t:] o.a.s.c.ZkTestServer Watch limit violations:
2> Maximum concurrent create/delete watches above limit:
2>
2> 2 /solr/aliases.json
2>
2> Maximum concurrent data watches above limit:
2>
2> 2 /solr/clusterprops.json
2>
2> Maximum concurrent children watches above limit:
2>
2> 5 /solr/overseer/collection-queue-work
2> 4 /solr/live_nodes
2> 2 /solr/collections
2>
2> NOTE: leaving temporary files on disk at: /tmp/src/solr/solr/core/build/tmp/tests-tmp/solr.cli.PostToolTest_5ABE15268B743599-001
2> NOTE: test params are: codec=Asserting(Lucene99): {}, docValues:{}, maxPointsInLeafNode=652, maxMBSortInHeap=5.342148917803719, sim=Asserting(RandomSimilarity(queryNorm=true): {}), locale=mfe, timezone=Indian/Mauritius
2> NOTE: Linux 5.4.0-100-generic amd64/Eclipse Adoptium 11.0.22 (64-bit)/cpus=1,threads=2,free=260340136,total=324534272
2> NOTE: All tests run in this JVM: [PostToolTest]
WARNING: Test org.apache.solr.TestRandomFaceting wrote 11,331,648 bytes of output.
WARNING: Test org.apache.solr.schema.DocValuesTest wrote 11,196,654 bytes of output.
WARNING: Test org.apache.solr.schema.TestCloudSchemaless wrote 15,313,245 bytes of output.
:solr:core:test (FAILURE): 4965 test(s), 1 failure(s), 210 skipped
4965 tests completed, 1 failed, 210 skipped
> Task :solr:core:test FAILED
> Task :solr:core:wipeTaskTemp
> Task :solr:modules:hdfs:test
WARNING: Test org.apache.solr.hdfs.index.CheckHdfsIndexTest wrote 43,444,432 bytes of output.
:solr:modules:hdfs:test (SUCCESS): 104 test(s), 41 skipped
> Task :solr:modules:hdfs:wipeTaskTemp
ERROR: The following test(s) have failed:
- org.apache.solr.cli.PostToolTest.testBasicRun (:solr:core)
Test output: /tmp/src/solr/solr/core/build/test-results/test/outputs/OUTPUT-org.apache.solr.cli.PostToolTest.txt
Reproduce with: gradlew :solr:core:test --tests "org.apache.solr.cli.PostToolTest.testBasicRun" -Ptests.jvms=96 "-Ptests.jvmargs=-XX:TieredStopAtLevel=1 -XX:+UseParallelGC -XX:ActiveProcessorCount=1 -XX:ReservedCodeCacheSize=120m" -Ptests.seed=5ABE15268B743599 -Ptests.file.encoding=ISO-8859-1
WARNING: there were unreferenced files under license folder:
- /tmp/src/solr/solr/licenses/jakarta.inject-2.6.1.jar.sha1
FAILURE: Build failed with an exception.
* What went wrong:
Execution failed for task ':solr:core:test'.
> There were failing tests. See the results at: file:///tmp/src/solr/solr/core/build/test-results/test/
* Try:
> Run with --scan to get full insights.
BUILD FAILED in 9m 27s
670 actionable tasks: 668 executed, 2 up-to-date
[0m[?12l[?25h
------------------------------------------------------------------------
Build Failed: returned 1
Total time: 9m48.5s
------------------------------------------------------------------------
+ status=1
+ ./crave pull '**/build/**/test/TEST-*.xml'
+ ./crave pull '**/*.events'
+ ./crave pull 'heapdumps/**'
Error: rsync: [sender] change_dir "/tmp/src/solr/heapdumps" failed: No such file or directory (2)
rsync error: some files/attrs were not transferred (see previous errors) (code 23) at main.c(1675) [Receiver=3.1.2]
rsync: [Receiver] write error: Broken pipe (32)
+ ./crave pull '**/hs_err_pid*'
+ exit 1
Build step 'Execute shell' marked build as failure
Archiving artifacts
Recording test results
ERROR: Step ‘Publish JUnit test result report’ failed: No test report files were found. Configuration error?
Email was triggered for: Failure - Any
Sending email for trigger: Failure - Any
[JENKINS] Solr » Solr-Check-9.x (Crave) - Build # 6254 - Still Failing!
Posted by Apache Jenkins Server <je...@builds.apache.org>.
Build: https://ci-builds.apache.org/job/Solr/job/Solr-Check-9.x%20(Crave)/6254/
No tests ran.
Build Log:
[...truncated 1434 lines...]
ERROR: Step ‘Publish JUnit test result report’ failed: No test report files were found. Configuration error?
Email was triggered for: Failure - Any
Sending email for trigger: Failure - Any
[JENKINS] Solr » Solr-Check-9.x (Crave) - Build # 6253 - Still Failing!
Posted by Apache Jenkins Server <je...@builds.apache.org>.
Build: https://ci-builds.apache.org/job/Solr/job/Solr-Check-9.x%20(Crave)/6253/
No tests ran.
Build Log:
[...truncated 331 lines...]
BUILD FAILED in 1m 22s
177 actionable tasks: 175 executed, 2 up-to-date
[0m[?12l[?25h
------------------------------------------------------------------------
Build Failed: returned 1
Total time: 1m47.5s
------------------------------------------------------------------------
+ status=1
+ ./crave pull '**/build/**/test/TEST-*.xml'
+ ./crave pull '**/*.events'
+ ./crave pull 'heapdumps/**'
Error: rsync: [sender] change_dir "/tmp/src/solr/heapdumps" failed: No such file or directory (2)
rsync error: some files/attrs were not transferred (see previous errors) (code 23) at main.c(1675) [Receiver=3.1.2]
rsync: [Receiver] write error: Broken pipe (32)
+ ./crave pull '**/hs_err_pid*'
+ exit 1
Build step 'Execute shell' marked build as failure
Archiving artifacts
Recording test results
ERROR: Step ‘Publish JUnit test result report’ failed: No test report files were found. Configuration error?
Email was triggered for: Failure - Any
Sending email for trigger: Failure - Any
[JENKINS] Solr » Solr-Check-9.x (Crave) - Build # 6252 - Still Failing!
Posted by Apache Jenkins Server <je...@builds.apache.org>.
Build: https://ci-builds.apache.org/job/Solr/job/Solr-Check-9.x%20(Crave)/6252/
No tests ran.
Build Log:
[...truncated 1432 lines...]
ERROR: Step ‘Publish JUnit test result report’ failed: No test report files were found. Configuration error?
Email was triggered for: Failure - Any
Sending email for trigger: Failure - Any
[JENKINS] Solr » Solr-Check-9.x (Crave) - Build # 6251 - Still Failing!
Posted by Apache Jenkins Server <je...@builds.apache.org>.
Build: https://ci-builds.apache.org/job/Solr/job/Solr-Check-9.x%20(Crave)/6251/
No tests ran.
Build Log:
[...truncated 1431 lines...]
ERROR: Step ‘Publish JUnit test result report’ failed: No test report files were found. Configuration error?
Email was triggered for: Failure - Any
Sending email for trigger: Failure - Any
[JENKINS] Solr » Solr-Check-9.x (Crave) - Build # 6250 - Still Failing!
Posted by Apache Jenkins Server <je...@builds.apache.org>.
Build: https://ci-builds.apache.org/job/Solr/job/Solr-Check-9.x%20(Crave)/6250/
No tests ran.
Build Log:
[...truncated 1431 lines...]
ERROR: Step ‘Publish JUnit test result report’ failed: No test report files were found. Configuration error?
Email was triggered for: Failure - Any
Sending email for trigger: Failure - Any
[JENKINS] Solr » Solr-Check-9.x (Crave) - Build # 6249 - Still Failing!
Posted by Apache Jenkins Server <je...@builds.apache.org>.
Build: https://ci-builds.apache.org/job/Solr/job/Solr-Check-9.x%20(Crave)/6249/
No tests ran.
Build Log:
[...truncated 1456 lines...]
ERROR: The following test(s) have failed:
- org.apache.solr.uninverting.TestUninvertingReader.testSortedSetFloat (:solr:core)
Test output: /tmp/src/solr/solr/core/build/test-results/test/outputs/OUTPUT-org.apache.solr.uninverting.TestUninvertingReader.txt
Reproduce with: gradlew :solr:core:test --tests "org.apache.solr.uninverting.TestUninvertingReader.testSortedSetFloat" -Ptests.jvms=96 "-Ptests.jvmargs=-XX:TieredStopAtLevel=1 -XX:+UseParallelGC -XX:ActiveProcessorCount=1 -XX:ReservedCodeCacheSize=120m" -Ptests.seed=9EF92DA360491BBF -Ptests.file.encoding=ISO-8859-1
WARNING: there were unreferenced files under license folder:
- /tmp/src/solr/solr/licenses/jakarta.inject-2.6.1.jar.sha1
FAILURE: Build failed with an exception.
* What went wrong:
Execution failed for task ':solr:core:test'.
> There were failing tests. See the results at: file:///tmp/src/solr/solr/core/build/test-results/test/
* Try:
> Run with --scan to get full insights.
BUILD FAILED in 24m 45s
673 actionable tasks: 671 executed, 2 up-to-date
[0m[?12l[?25h
------------------------------------------------------------------------
Build Failed: returned 1
Total time: 25m9s
------------------------------------------------------------------------
+ status=1
+ ./crave pull '**/build/**/test/TEST-*.xml'
+ ./crave pull '**/*.events'
+ ./crave pull 'heapdumps/**'
Error: rsync: [sender] change_dir "/tmp/src/solr/heapdumps" failed: No such file or directory (2)
rsync error: some files/attrs were not transferred (see previous errors) (code 23) at main.c(1682) [Receiver=3.1.3]
rsync: [Receiver] write error: Broken pipe (32)
+ ./crave pull '**/hs_err_pid*'
+ exit 1
Build step 'Execute shell' marked build as failure
Archiving artifacts
Recording test results
ERROR: Step ‘Publish JUnit test result report’ failed: No test report files were found. Configuration error?
Email was triggered for: Failure - Any
Sending email for trigger: Failure - Any
[JENKINS] Solr » Solr-Check-9.x (Crave) - Build # 6248 - Still Failing!
Posted by Apache Jenkins Server <je...@builds.apache.org>.
Build: https://ci-builds.apache.org/job/Solr/job/Solr-Check-9.x%20(Crave)/6248/
No tests ran.
Build Log:
[...truncated 11429 lines...]
ERROR: The following test(s) have failed:
- org.apache.solr.security.jwt.JWTAuthPluginIntegrationTest.mockOAuth2Server (:solr:modules:jwt-auth)
Test output: /tmp/src/solr/solr/modules/jwt-auth/build/test-results/test/outputs/OUTPUT-org.apache.solr.security.jwt.JWTAuthPluginIntegrationTest.txt
Reproduce with: gradlew :solr:modules:jwt-auth:test --tests "org.apache.solr.security.jwt.JWTAuthPluginIntegrationTest.mockOAuth2Server" -Ptests.jvms=96 "-Ptests.jvmargs=-XX:TieredStopAtLevel=1 -XX:+UseParallelGC -XX:ActiveProcessorCount=1 -XX:ReservedCodeCacheSize=120m" -Ptests.seed=62C066A1F8005EEE -Ptests.file.encoding=ISO-8859-1
- org.apache.solr.security.jwt.JWTAuthPluginIntegrationTest.classMethod (:solr:modules:jwt-auth)
Test output: /tmp/src/solr/solr/modules/jwt-auth/build/test-results/test/outputs/OUTPUT-org.apache.solr.security.jwt.JWTAuthPluginIntegrationTest.txt
Reproduce with: gradlew :solr:modules:jwt-auth:test --tests "org.apache.solr.security.jwt.JWTAuthPluginIntegrationTest.classMethod" -Ptests.jvms=96 "-Ptests.jvmargs=-XX:TieredStopAtLevel=1 -XX:+UseParallelGC -XX:ActiveProcessorCount=1 -XX:ReservedCodeCacheSize=120m" -Ptests.seed=62C066A1F8005EEE -Ptests.file.encoding=ISO-8859-1
- org.apache.solr.security.jwt.JWTAuthPluginIntegrationTest.classMethod (:solr:modules:jwt-auth)
Test output: /tmp/src/solr/solr/modules/jwt-auth/build/test-results/test/outputs/OUTPUT-org.apache.solr.security.jwt.JWTAuthPluginIntegrationTest.txt
Reproduce with: gradlew :solr:modules:jwt-auth:test --tests "org.apache.solr.security.jwt.JWTAuthPluginIntegrationTest.classMethod" -Ptests.jvms=96 "-Ptests.jvmargs=-XX:TieredStopAtLevel=1 -XX:+UseParallelGC -XX:ActiveProcessorCount=1 -XX:ReservedCodeCacheSize=120m" -Ptests.seed=62C066A1F8005EEE -Ptests.file.encoding=ISO-8859-1
- org.apache.solr.security.jwt.JWTAuthPluginIntegrationTest.classMethod (:solr:modules:jwt-auth)
Test output: /tmp/src/solr/solr/modules/jwt-auth/build/test-results/test/outputs/OUTPUT-org.apache.solr.security.jwt.JWTAuthPluginIntegrationTest.txt
Reproduce with: gradlew :solr:modules:jwt-auth:test --tests "org.apache.solr.security.jwt.JWTAuthPluginIntegrationTest.classMethod" -Ptests.jvms=96 "-Ptests.jvmargs=-XX:TieredStopAtLevel=1 -XX:+UseParallelGC -XX:ActiveProcessorCount=1 -XX:ReservedCodeCacheSize=120m" -Ptests.seed=62C066A1F8005EEE -Ptests.file.encoding=ISO-8859-1
WARNING: there were unreferenced files under license folder:
- /tmp/src/solr/solr/licenses/jakarta.inject-2.6.1.jar.sha1
FAILURE: Build failed with an exception.
* What went wrong:
Execution failed for task ':solr:modules:jwt-auth:test'.
> There were failing tests. See the results at: file:///tmp/src/solr/solr/modules/jwt-auth/build/test-results/test/
* Try:
> Run with --scan to get full insights.
BUILD FAILED in 6m 48s
661 actionable tasks: 659 executed, 2 up-to-date
[0m[?12l[?25h
------------------------------------------------------------------------
Build Failed: returned 1
Total time: 7m14.5s
------------------------------------------------------------------------
+ status=1
+ ./crave pull '**/build/**/test/TEST-*.xml'
+ ./crave pull '**/*.events'
+ ./crave pull 'heapdumps/**'
Error: rsync: [sender] change_dir "/tmp/src/solr/heapdumps" failed: No such file or directory (2)
rsync error: some files/attrs were not transferred (see previous errors) (code 23) at main.c(1675) [Receiver=3.1.2]
rsync: [Receiver] write error: Broken pipe (32)
+ ./crave pull '**/hs_err_pid*'
+ exit 1
Build step 'Execute shell' marked build as failure
Archiving artifacts
Recording test results
ERROR: Step ‘Publish JUnit test result report’ failed: No test report files were found. Configuration error?
Email was triggered for: Failure - Any
Sending email for trigger: Failure - Any
[JENKINS] Solr » Solr-Check-9.x (Crave) - Build # 6247 - Still Failing!
Posted by Apache Jenkins Server <je...@builds.apache.org>.
Build: https://ci-builds.apache.org/job/Solr/job/Solr-Check-9.x%20(Crave)/6247/
No tests ran.
Build Log:
[...truncated 1433 lines...]
ERROR: Step ‘Publish JUnit test result report’ failed: No test report files were found. Configuration error?
Email was triggered for: Failure - Any
Sending email for trigger: Failure - Any
[JENKINS] Solr » Solr-Check-9.x (Crave) - Build # 6246 - Still Failing!
Posted by Apache Jenkins Server <je...@builds.apache.org>.
Build: https://ci-builds.apache.org/job/Solr/job/Solr-Check-9.x%20(Crave)/6246/
No tests ran.
Build Log:
[...truncated 1432 lines...]
ERROR: Step ‘Publish JUnit test result report’ failed: No test report files were found. Configuration error?
Email was triggered for: Failure - Any
Sending email for trigger: Failure - Any
[JENKINS] Solr » Solr-Check-9.x (Crave) - Build # 6245 - Still Failing!
Posted by Apache Jenkins Server <je...@builds.apache.org>.
Build: https://ci-builds.apache.org/job/Solr/job/Solr-Check-9.x%20(Crave)/6245/
No tests ran.
Build Log:
[...truncated 1428 lines...]
ERROR: Step ‘Publish JUnit test result report’ failed: No test report files were found. Configuration error?
Email was triggered for: Failure - Any
Sending email for trigger: Failure - Any
[JENKINS] Solr » Solr-Check-9.x (Crave) - Build # 6244 - Still Failing!
Posted by Apache Jenkins Server <je...@builds.apache.org>.
Build: https://ci-builds.apache.org/job/Solr/job/Solr-Check-9.x%20(Crave)/6244/
No tests ran.
Build Log:
[...truncated 4189 lines...]
2> SimplePostTool: FATAL: Connection error (is Solr running at https://127.0.0.1:35251/solr/testBasicRun/update ?): javax.net.ssl.SSLHandshakeException: PKIX path building failed: sun.security.provider.certpath.SunCertPathBuilderException: unable to find valid certification path to requested target
2>
2> ERROR: System/Runtime.exit(2) or halt(2) calls are not allowed because they terminate the test runner's JVM.
2>
> java.lang.AssertionError: expected:<0> but was:<1>
> at __randomizedtesting.SeedInfo.seed([30BD3DD1974EB3A7:F2CBCAD59C151BE4]:0)
> at org.junit.Assert.fail(Assert.java:89)
> at org.junit.Assert.failNotEquals(Assert.java:835)
> at org.junit.Assert.assertEquals(Assert.java:647)
> at org.junit.Assert.assertEquals(Assert.java:633)
> at org.apache.solr.cli.PostToolTest.testBasicRun(PostToolTest.java:63)
> at java.base/jdk.internal.reflect.NativeMethodAccessorImpl.invoke0(Native Method)
> at java.base/jdk.internal.reflect.NativeMethodAccessorImpl.invoke(NativeMethodAccessorImpl.java:62)
> at java.base/jdk.internal.reflect.DelegatingMethodAccessorImpl.invoke(DelegatingMethodAccessorImpl.java:43)
> at java.base/java.lang.reflect.Method.invoke(Method.java:566)
> at com.carrotsearch.randomizedtesting.RandomizedRunner.invoke(RandomizedRunner.java:1758)
> at com.carrotsearch.randomizedtesting.RandomizedRunner$8.evaluate(RandomizedRunner.java:946)
> at com.carrotsearch.randomizedtesting.RandomizedRunner$9.evaluate(RandomizedRunner.java:982)
> at com.carrotsearch.randomizedtesting.RandomizedRunner$10.evaluate(RandomizedRunner.java:996)
> at com.carrotsearch.randomizedtesting.rules.SystemPropertiesRestoreRule$1.evaluate(SystemPropertiesRestoreRule.java:80)
> at org.junit.rules.RunRules.evaluate(RunRules.java:20)
> at org.apache.lucene.tests.util.TestRuleSetupTeardownChained$1.evaluate(TestRuleSetupTeardownChained.java:48)
> at org.apache.lucene.tests.util.AbstractBeforeAfterRule$1.evaluate(AbstractBeforeAfterRule.java:43)
> at org.apache.lucene.tests.util.TestRuleThreadAndTestName$1.evaluate(TestRuleThreadAndTestName.java:45)
> at org.apache.lucene.tests.util.TestRuleIgnoreAfterMaxFailures$1.evaluate(TestRuleIgnoreAfterMaxFailures.java:60)
> at org.apache.lucene.tests.util.TestRuleMarkFailure$1.evaluate(TestRuleMarkFailure.java:44)
> at org.junit.rules.RunRules.evaluate(RunRules.java:20)
> at com.carrotsearch.randomizedtesting.rules.StatementAdapter.evaluate(StatementAdapter.java:36)
> at com.carrotsearch.randomizedtesting.ThreadLeakControl$StatementRunner.run(ThreadLeakControl.java:390)
> at com.carrotsearch.randomizedtesting.ThreadLeakControl.forkTimeoutingTask(ThreadLeakControl.java:843)
> at com.carrotsearch.randomizedtesting.ThreadLeakControl$3.evaluate(ThreadLeakControl.java:490)
> at com.carrotsearch.randomizedtesting.RandomizedRunner.runSingleTest(RandomizedRunner.java:955)
> at com.carrotsearch.randomizedtesting.RandomizedRunner$5.evaluate(RandomizedRunner.java:840)
> at com.carrotsearch.randomizedtesting.RandomizedRunner$6.evaluate(RandomizedRunner.java:891)
> at com.carrotsearch.randomizedtesting.RandomizedRunner$7.evaluate(RandomizedRunner.java:902)
> at com.carrotsearch.randomizedtesting.rules.StatementAdapter.evaluate(StatementAdapter.java:36)
> at com.carrotsearch.randomizedtesting.rules.StatementAdapter.evaluate(StatementAdapter.java:36)
> at org.apache.lucene.tests.util.AbstractBeforeAfterRule$1.evaluate(AbstractBeforeAfterRule.java:43)
> at org.apache.lucene.tests.util.AbstractBeforeAfterRule$1.evaluate(AbstractBeforeAfterRule.java:43)
> at com.carrotsearch.randomizedtesting.rules.SystemPropertiesRestoreRule$1.evaluate(SystemPropertiesRestoreRule.java:80)
> at org.junit.rules.RunRules.evaluate(RunRules.java:20)
> at org.apache.lucene.tests.util.AbstractBeforeAfterRule$1.evaluate(AbstractBeforeAfterRule.java:43)
> at com.carrotsearch.randomizedtesting.rules.StatementAdapter.evaluate(StatementAdapter.java:36)
> at org.apache.lucene.tests.util.TestRuleStoreClassName$1.evaluate(TestRuleStoreClassName.java:38)
> at com.carrotsearch.randomizedtesting.rules.NoShadowingOrOverridesOnMethodsRule$1.evaluate(NoShadowingOrOverridesOnMethodsRule.java:40)
> at com.carrotsearch.randomizedtesting.rules.NoShadowingOrOverridesOnMethodsRule$1.evaluate(NoShadowingOrOverridesOnMethodsRule.java:40)
> at com.carrotsearch.randomizedtesting.rules.StatementAdapter.evaluate(StatementAdapter.java:36)
> at com.carrotsearch.randomizedtesting.rules.StatementAdapter.evaluate(StatementAdapter.java:36)
> at org.apache.lucene.tests.util.TestRuleAssertionsRequired$1.evaluate(TestRuleAssertionsRequired.java:53)
> at org.apache.lucene.tests.util.AbstractBeforeAfterRule$1.evaluate(AbstractBeforeAfterRule.java:43)
> at org.apache.lucene.tests.util.TestRuleMarkFailure$1.evaluate(TestRuleMarkFailure.java:44)
> at org.apache.lucene.tests.util.TestRuleIgnoreAfterMaxFailures$1.evaluate(TestRuleIgnoreAfterMaxFailures.java:60)
> at org.apache.lucene.tests.util.TestRuleIgnoreTestSuites$1.evaluate(TestRuleIgnoreTestSuites.java:47)
> at org.junit.rules.RunRules.evaluate(RunRules.java:20)
> at com.carrotsearch.randomizedtesting.rules.StatementAdapter.evaluate(StatementAdapter.java:36)
> at com.carrotsearch.randomizedtesting.ThreadLeakControl$StatementRunner.run(ThreadLeakControl.java:390)
> at com.carrotsearch.randomizedtesting.ThreadLeakControl.lambda$forkTimeoutingTask$0(ThreadLeakControl.java:850)
> at java.base/java.lang.Thread.run(Thread.java:829)
2> NOTE: reproduce with: gradlew test --tests PostToolTest.testBasicRun -Dtests.seed=30BD3DD1974EB3A7 -Dtests.locale=pt-GQ -Dtests.timezone=Africa/Timbuktu -Dtests.asserts=true -Dtests.file.encoding=UTF-8
2> 15562 INFO (jetty-closer-38-thread-1) [n: c: s: r: x: t:] o.e.j.s.Server Stopped Server@5330f09c{STOPPING}[10.0.19,sto=0]
2> 15575 INFO (jetty-closer-38-thread-1) [n: c: s: r: x: t:] o.e.j.s.AbstractConnector Stopped ServerConnector@7c2da7f6{ssl, (ssl, alpn, http/1.1, h2)}{127.0.0.1:0}
2> 15582 INFO (jetty-closer-38-thread-1) [n: c: s: r: x: t:] o.e.j.s.h.ContextHandler Stopped o.e.j.s.ServletContextHandler@54d51c5b{/solr,file:///tmp/src/solr/solr/core/build/tmp/tests-cwd/,STOPPED}
2> 16070 WARN (ZkTestServer Run Thread) [n: c: s: r: x: t:] o.a.s.c.ZkTestServer Watch limit violations:
2> Maximum concurrent create/delete watches above limit:
2>
2> 2 /solr/aliases.json
2>
2> Maximum concurrent data watches above limit:
2>
2> 2 /solr/clusterprops.json
2>
2> Maximum concurrent children watches above limit:
2>
2> 4 /solr/live_nodes
2> 2 /solr/collections
2>
2> NOTE: leaving temporary files on disk at: /tmp/src/solr/solr/core/build/tmp/tests-tmp/solr.cli.PostToolTest_30BD3DD1974EB3A7-001
2> NOTE: test params are: codec=Asserting(Lucene99): {}, docValues:{}, maxPointsInLeafNode=1660, maxMBSortInHeap=7.3164265832366295, sim=Asserting(RandomSimilarity(queryNorm=true): {}), locale=pt-GQ, timezone=Africa/Timbuktu
2> NOTE: Linux 5.4.0-100-generic amd64/Eclipse Adoptium 11.0.21 (64-bit)/cpus=1,threads=2,free=255363168,total=324534272
2> NOTE: All tests run in this JVM: [PostToolTest]
org.apache.solr.cloud.BasicDistributedZkTest > test FAILED
org.apache.solr.client.solrj.impl.BaseHttpSolrClient$RemoteSolrException: Error from server at http://127.0.0.1:42901/k_xy: Expected mime type in [application/octet-stream, application/vnd.apache.solr.javabin] but got text/html. <html>
<head>
<meta http-equiv="Content-Type" content="text/html;charset=ISO-8859-1"/>
<title>Error 404 Not Found</title>
</head>
<body><h2>HTTP ERROR 404 Not Found</h2>
<table>
<tr><th>URI:</th><td>/k_xy/admin/collections</td></tr>
<tr><th>STATUS:</th><td>404</td></tr>
<tr><th>MESSAGE:</th><td>Not Found</td></tr>
<tr><th>SERVLET:</th><td>-</td></tr>
</table>
<hr/><a href="https://eclipse.org/jetty">Powered by Jetty:// 10.0.19</a><hr/>
</body>
</html>
at __randomizedtesting.SeedInfo.seed([30BD3DD1974EB3A7:B8E9020B39B2DE5F]:0)
at app//org.apache.solr.client.solrj.impl.HttpSolrClient.executeMethod(HttpSolrClient.java:692)
at app//org.apache.solr.client.solrj.impl.HttpSolrClient.request(HttpSolrClient.java:267)
at app//org.apache.solr.client.solrj.impl.HttpSolrClient.request(HttpSolrClient.java:246)
at app//org.apache.solr.client.solrj.impl.LBSolrClient.doRequest(LBSolrClient.java:390)
at app//org.apache.solr.client.solrj.impl.LBSolrClient.request(LBSolrClient.java:353)
at app//org.apache.solr.client.solrj.impl.CloudSolrClient.sendRequest(CloudSolrClient.java:1193)
at app//org.apache.solr.client.solrj.impl.CloudSolrClient.requestWithRetryOnStaleState(CloudSolrClient.java:892)
at app//org.apache.solr.client.solrj.impl.CloudSolrClient.request(CloudSolrClient.java:820)
at app//org.apache.solr.client.solrj.SolrRequest.process(SolrRequest.java:255)
at app//org.apache.solr.client.solrj.SolrRequest.process(SolrRequest.java:270)
at app//org.apache.solr.cloud.AbstractFullDistribZkTestBase.createServers(AbstractFullDistribZkTestBase.java:353)
at app//org.apache.solr.BaseDistributedSearchTestCase$ShardsRepeatRule$ShardsFixedStatement.callStatement(BaseDistributedSearchTestCase.java:1152)
at app//org.apache.solr.BaseDistributedSearchTestCase$ShardsRepeatRule$ShardsStatement.evaluate(BaseDistributedSearchTestCase.java:1125)
at app//com.carrotsearch.randomizedtesting.rules.SystemPropertiesRestoreRule$1.evaluate(SystemPropertiesRestoreRule.java:80)
at app//org.junit.rules.RunRules.evaluate(RunRules.java:20)
at app//org.apache.lucene.tests.util.TestRuleSetupTeardownChained$1.evaluate(TestRuleSetupTeardownChained.java:48)
at app//org.apache.lucene.tests.util.AbstractBeforeAfterRule$1.evaluate(AbstractBeforeAfterRule.java:43)
at app//org.apache.lucene.tests.util.TestRuleThreadAndTestName$1.evaluate(TestRuleThreadAndTestName.java:45)
at app//org.apache.lucene.tests.util.TestRuleIgnoreAfterMaxFailures$1.evaluate(TestRuleIgnoreAfterMaxFailures.java:60)
at app//org.apache.lucene.tests.util.TestRuleMarkFailure$1.evaluate(TestRuleMarkFailure.java:44)
at app//org.junit.rules.RunRules.evaluate(RunRules.java:20)
at app//com.carrotsearch.randomizedtesting.rules.StatementAdapter.evaluate(StatementAdapter.java:36)
at app//com.carrotsearch.randomizedtesting.ThreadLeakControl$StatementRunner.run(ThreadLeakControl.java:390)
at app//com.carrotsearch.randomizedtesting.ThreadLeakControl.forkTimeoutingTask(ThreadLeakControl.java:843)
at app//com.carrotsearch.randomizedtesting.ThreadLeakControl$3.evaluate(ThreadLeakControl.java:490)
at app//com.carrotsearch.randomizedtesting.RandomizedRunner.runSingleTest(RandomizedRunner.java:955)
at app//com.carrotsearch.randomizedtesting.RandomizedRunner$5.evaluate(RandomizedRunner.java:840)
at app//com.carrotsearch.randomizedtesting.RandomizedRunner$6.evaluate(RandomizedRunner.java:891)
at app//com.carrotsearch.randomizedtesting.RandomizedRunner$7.evaluate(RandomizedRunner.java:902)
at app//com.carrotsearch.randomizedtesting.rules.StatementAdapter.evaluate(StatementAdapter.java:36)
at app//com.carrotsearch.randomizedtesting.rules.StatementAdapter.evaluate(StatementAdapter.java:36)
at app//org.apache.lucene.tests.util.AbstractBeforeAfterRule$1.evaluate(AbstractBeforeAfterRule.java:43)
at app//org.apache.lucene.tests.util.AbstractBeforeAfterRule$1.evaluate(AbstractBeforeAfterRule.java:43)
at app//com.carrotsearch.randomizedtesting.rules.SystemPropertiesRestoreRule$1.evaluate(SystemPropertiesRestoreRule.java:80)
at app//org.junit.rules.RunRules.evaluate(RunRules.java:20)
at app//org.apache.lucene.tests.util.AbstractBeforeAfterRule$1.evaluate(AbstractBeforeAfterRule.java:43)
at app//com.carrotsearch.randomizedtesting.rules.StatementAdapter.evaluate(StatementAdapter.java:36)
at app//org.apache.lucene.tests.util.TestRuleStoreClassName$1.evaluate(TestRuleStoreClassName.java:38)
at app//com.carrotsearch.randomizedtesting.rules.NoShadowingOrOverridesOnMethodsRule$1.evaluate(NoShadowingOrOverridesOnMethodsRule.java:40)
at app//com.carrotsearch.randomizedtesting.rules.NoShadowingOrOverridesOnMethodsRule$1.evaluate(NoShadowingOrOverridesOnMethodsRule.java:40)
at app//com.carrotsearch.randomizedtesting.rules.StatementAdapter.evaluate(StatementAdapter.java:36)
at app//com.carrotsearch.randomizedtesting.rules.StatementAdapter.evaluate(StatementAdapter.java:36)
at app//org.apache.lucene.tests.util.TestRuleAssertionsRequired$1.evaluate(TestRuleAssertionsRequired.java:53)
at app//org.apache.lucene.tests.util.AbstractBeforeAfterRule$1.evaluate(AbstractBeforeAfterRule.java:43)
at app//org.apache.lucene.tests.util.TestRuleMarkFailure$1.evaluate(TestRuleMarkFailure.java:44)
at app//org.apache.lucene.tests.util.TestRuleIgnoreAfterMaxFailures$1.evaluate(TestRuleIgnoreAfterMaxFailures.java:60)
at app//org.apache.lucene.tests.util.TestRuleIgnoreTestSuites$1.evaluate(TestRuleIgnoreTestSuites.java:47)
at app//org.junit.rules.RunRules.evaluate(RunRules.java:20)
at app//com.carrotsearch.randomizedtesting.rules.StatementAdapter.evaluate(StatementAdapter.java:36)
at app//com.carrotsearch.randomizedtesting.ThreadLeakControl$StatementRunner.run(ThreadLeakControl.java:390)
at app//com.carrotsearch.randomizedtesting.ThreadLeakControl.lambda$forkTimeoutingTask$0(ThreadLeakControl.java:850)
at java.base@11.0.21/java.lang.Thread.run(Thread.java:829)
org.apache.solr.cloud.BasicDistributedZkTest > test suite's output saved to /tmp/src/solr/solr/core/build/test-results/test/outputs/OUTPUT-org.apache.solr.cloud.BasicDistributedZkTest.txt, copied below:
2> 4646 INFO (SUITE-BasicDistributedZkTest-seed#[30BD3DD1974EB3A7]-worker) [n: c: s: r: x: t:] o.a.s.SolrTestCase Setting 'solr.default.confdir' system property to test-framework derived value of '/tmp/src/solr/solr/server/solr/configsets/_default/conf'
2> 4661 INFO (SUITE-BasicDistributedZkTest-seed#[30BD3DD1974EB3A7]-worker) [n: c: s: r: x: t:] o.a.s.SolrTestCaseJ4 SecureRandom sanity checks: test.solr.allowed.securerandom=null & java.security.egd=file:/dev/./urandom
2> 4716 INFO (SUITE-BasicDistributedZkTest-seed#[30BD3DD1974EB3A7]-worker) [n: c: s: r: x: t:] o.a.s.u.ErrorLogMuter Creating ErrorLogMuter-regex-1 for ERROR logs matching regex: ignore_exception
2> 4745 INFO (SUITE-BasicDistributedZkTest-seed#[30BD3DD1974EB3A7]-worker) [n: c: s: r: x: t:] o.a.s.SolrTestCaseJ4 Created dataDir: /tmp/src/solr/solr/core/build/tmp/tests-tmp/solr.cloud.BasicDistributedZkTest_30BD3DD1974EB3A7-001/data-dir-1-001
2> 4863 INFO (SUITE-BasicDistributedZkTest-seed#[30BD3DD1974EB3A7]-worker) [n: c: s: r: x: t:] o.a.s.SolrTestCaseJ4 Using PointFields (NUMERIC_POINTS_SYSPROP=true) w/NUMERIC_DOCVALUES_SYSPROP=true
2> 4908 INFO (SUITE-BasicDistributedZkTest-seed#[30BD3DD1974EB3A7]-worker) [n: c: s: r: x: t:] o.a.s.SolrTestCaseJ4 Randomized ssl (false) and clientAuth (false) via: @org.apache.solr.SolrTestCaseJ4$SuppressSSL(bugUrl="https://issues.apache.org/jira/browse/SOLR-5776")
2> 4960 INFO (SUITE-BasicDistributedZkTest-seed#[30BD3DD1974EB3A7]-worker) [n: c: s: r: x: t:] o.a.s.BaseDistributedSearchTestCase Setting hostContext system property: /k_xy/a
2> 4997 INFO (TEST-BasicDistributedZkTest.test-seed#[30BD3DD1974EB3A7]) [n: c: s: r: x: t:] o.a.s.u.ErrorLogMuter Closing ErrorLogMuter-regex-1 after mutting 0 log messages
2> 4998 INFO (TEST-BasicDistributedZkTest.test-seed#[30BD3DD1974EB3A7]) [n: c: s: r: x: t:] o.a.s.u.ErrorLogMuter Creating ErrorLogMuter-regex-2 for ERROR logs matching regex: ignore_exception
2> 5011 INFO (TEST-BasicDistributedZkTest.test-seed#[30BD3DD1974EB3A7]) [n: c: s: r: x: t:] o.a.s.c.ZkTestServer STARTING ZK TEST SERVER
2> 5028 INFO (ZkTestServer Run Thread) [n: c: s: r: x: t:] o.a.s.c.ZkTestServer client port: /127.0.0.1:0
2> 5030 INFO (ZkTestServer Run Thread) [n: c: s: r: x: t:] o.a.s.c.ZkTestServer Starting server
2> 5104 WARN (ZkTestServer Run Thread) [n: c: s: r: x: t:] o.a.z.s.ServerCnxnFactory maxCnxns is not configured, using default value 0.
2> 5158 INFO (TEST-BasicDistributedZkTest.test-seed#[30BD3DD1974EB3A7]) [n: c: s: r: x: t:] o.a.s.c.ZkTestServer start zk server on port: 41907
2> 5525 WARN (TEST-BasicDistributedZkTest.test-seed#[30BD3DD1974EB3A7]) [n: c: s: r: x: t:] o.a.s.c.c.SolrZkClient Using default ZkCredentialsInjector. ZkCredentialsInjector is not secure, it creates an empty list of credentials which leads to 'OPEN_ACL_UNSAFE' ACLs to Zookeeper nodes
2> 5586 INFO (TEST-BasicDistributedZkTest.test-seed#[30BD3DD1974EB3A7]) [n: c: s: r: x: t:] o.a.s.c.c.ConnectionManager Waiting up to 30000ms for client to connect to ZooKeeper
2> 5665 INFO (zkConnectionManagerCallback-4-thread-1) [n: c: s: r: x: t:] o.a.s.c.c.ConnectionManager zkClient has connected
2> 5666 INFO (TEST-BasicDistributedZkTest.test-seed#[30BD3DD1974EB3A7]) [n: c: s: r: x: t:] o.a.s.c.c.ConnectionManager Client is connected to ZooKeeper
2> 5666 WARN (TEST-BasicDistributedZkTest.test-seed#[30BD3DD1974EB3A7]) [n: c: s: r: x: t:] o.a.s.c.c.SolrZkClient Using default ZkACLProvider. DefaultZkACLProvider is not secure, it creates 'OPEN_ACL_UNSAFE' ACLs to Zookeeper nodes
2> 5700 WARN (TEST-BasicDistributedZkTest.test-seed#[30BD3DD1974EB3A7]) [n: c: s: r: x: t:] o.a.s.c.c.SolrZkClient Using default ZkCredentialsInjector. ZkCredentialsInjector is not secure, it creates an empty list of credentials which leads to 'OPEN_ACL_UNSAFE' ACLs to Zookeeper nodes
2> 5710 INFO (TEST-BasicDistributedZkTest.test-seed#[30BD3DD1974EB3A7]) [n: c: s: r: x: t:] o.a.s.c.c.ConnectionManager Waiting up to 30000ms for client to connect to ZooKeeper
2> 5715 INFO (zkConnectionManagerCallback-6-thread-1) [n: c: s: r: x: t:] o.a.s.c.c.ConnectionManager zkClient has connected
2> 5716 INFO (TEST-BasicDistributedZkTest.test-seed#[30BD3DD1974EB3A7]) [n: c: s: r: x: t:] o.a.s.c.c.ConnectionManager Client is connected to ZooKeeper
2> 5716 WARN (TEST-BasicDistributedZkTest.test-seed#[30BD3DD1974EB3A7]) [n: c: s: r: x: t:] o.a.s.c.c.SolrZkClient Using default ZkACLProvider. DefaultZkACLProvider is not secure, it creates 'OPEN_ACL_UNSAFE' ACLs to Zookeeper nodes
2> 5757 INFO (TEST-BasicDistributedZkTest.test-seed#[30BD3DD1974EB3A7]) [n: c: s: r: x: t:] o.a.s.c.ZkTestServer put /tmp/src/solr/solr/core/build/resources/test/solr/collection1/conf/solrconfig-tlog.xml to /configs/conf1/solrconfig.xml
2> 5768 INFO (TEST-BasicDistributedZkTest.test-seed#[30BD3DD1974EB3A7]) [n: c: s: r: x: t:] o.a.s.c.ZkTestServer put /tmp/src/solr/solr/core/build/resources/test/solr/collection1/conf/schema.xml to /configs/conf1/schema.xml
2> 5776 INFO (TEST-BasicDistributedZkTest.test-seed#[30BD3DD1974EB3A7]) [n: c: s: r: x: t:] o.a.s.c.ZkTestServer put /tmp/src/solr/solr/core/build/resources/test/solr/collection1/conf/solrconfig.snippet.randomindexconfig.xml to /configs/conf1/solrconfig.snippet.randomindexconfig.xml
2> 5783 INFO (TEST-BasicDistributedZkTest.test-seed#[30BD3DD1974EB3A7]) [n: c: s: r: x: t:] o.a.s.c.ZkTestServer put /tmp/src/solr/solr/core/build/resources/test/solr/collection1/conf/stopwords.txt to /configs/conf1/stopwords.txt
2> 5791 INFO (TEST-BasicDistributedZkTest.test-seed#[30BD3DD1974EB3A7]) [n: c: s: r: x: t:] o.a.s.c.ZkTestServer put /tmp/src/solr/solr/core/build/resources/test/solr/collection1/conf/protwords.txt to /configs/conf1/protwords.txt
2> 5798 INFO (TEST-BasicDistributedZkTest.test-seed#[30BD3DD1974EB3A7]) [n: c: s: r: x: t:] o.a.s.c.ZkTestServer put /tmp/src/solr/solr/core/build/resources/test/solr/collection1/conf/currency.xml to /configs/conf1/currency.xml
2> 5804 INFO (TEST-BasicDistributedZkTest.test-seed#[30BD3DD1974EB3A7]) [n: c: s: r: x: t:] o.a.s.c.ZkTestServer put /tmp/src/solr/solr/core/build/resources/test/solr/collection1/conf/enumsConfig.xml to /configs/conf1/enumsConfig.xml
2> 5810 INFO (TEST-BasicDistributedZkTest.test-seed#[30BD3DD1974EB3A7]) [n: c: s: r: x: t:] o.a.s.c.ZkTestServer put /tmp/src/solr/solr/core/build/resources/test/solr/collection1/conf/open-exchange-rates.json to /configs/conf1/open-exchange-rates.json
2> 5818 INFO (TEST-BasicDistributedZkTest.test-seed#[30BD3DD1974EB3A7]) [n: c: s: r: x: t:] o.a.s.c.ZkTestServer put /tmp/src/solr/solr/core/build/resources/test/solr/collection1/conf/mapping-ISOLatin1Accent.txt to /configs/conf1/mapping-ISOLatin1Accent.txt
2> 5825 INFO (TEST-BasicDistributedZkTest.test-seed#[30BD3DD1974EB3A7]) [n: c: s: r: x: t:] o.a.s.c.ZkTestServer put /tmp/src/solr/solr/core/build/resources/test/solr/collection1/conf/old_synonyms.txt to /configs/conf1/old_synonyms.txt
2> 5835 INFO (TEST-BasicDistributedZkTest.test-seed#[30BD3DD1974EB3A7]) [n: c: s: r: x: t:] o.a.s.c.ZkTestServer put /tmp/src/solr/solr/core/build/resources/test/solr/collection1/conf/synonyms.txt to /configs/conf1/synonyms.txt
2> 5842 INFO (TEST-BasicDistributedZkTest.test-seed#[30BD3DD1974EB3A7]) [n: c: s: r: x: t:] o.a.s.c.AbstractFullDistribZkTestBase Will use NRT replicas unless explicitly asked otherwise
2> 6552 INFO (TEST-BasicDistributedZkTest.test-seed#[30BD3DD1974EB3A7]) [n: c: s: r: x: t:] o.a.s.e.JettySolrRunner Start Jetty (configured port=0, binding port=0)
2> 6555 INFO (TEST-BasicDistributedZkTest.test-seed#[30BD3DD1974EB3A7]) [n: c: s: r: x: t:] o.a.s.e.JettySolrRunner Trying to start Jetty on port 0 try number 2 ...
2> 6560 INFO (TEST-BasicDistributedZkTest.test-seed#[30BD3DD1974EB3A7]) [n: c: s: r: x: t:] o.e.j.s.Server jetty-10.0.19; built: 2023-12-15T20:38:32.477Z; git: 8492d1c78f122bb30cce20aecfa07e7283facd47; jvm 11.0.21+9
2> 6639 INFO (TEST-BasicDistributedZkTest.test-seed#[30BD3DD1974EB3A7]) [n: c: s: r: x: t:] o.e.j.s.s.DefaultSessionIdManager Session workerName=node0
2> 6866 INFO (TEST-BasicDistributedZkTest.test-seed#[30BD3DD1974EB3A7]) [n: c: s: r: x: t:] o.e.j.s.h.ContextHandler Started o.e.j.s.ServletContextHandler@1801e83f{/k_xy/a,file:///tmp/src/solr/solr/core/build/tmp/tests-cwd/,AVAILABLE}
2> 6886 INFO (TEST-BasicDistributedZkTest.test-seed#[30BD3DD1974EB3A7]) [n: c: s: r: x: t:] o.e.j.s.AbstractConnector Started ServerConnector@65840be4{HTTP/1.1, (http/1.1, h2c)}{127.0.0.1:42901}
2> 6905 INFO (TEST-BasicDistributedZkTest.test-seed#[30BD3DD1974EB3A7]) [n: c: s: r: x: t:] o.e.j.s.Server Started Server@57653ca9{STARTING}[10.0.19,sto=0] @6975ms
2> 6926 ERROR (TEST-BasicDistributedZkTest.test-seed#[30BD3DD1974EB3A7]) [n: c: s: r: x: t:] o.a.s.u.StartupLoggingUtils Missing Java Option solr.log.dir. Logging may be missing or incomplete.
2> 6927 INFO (TEST-BasicDistributedZkTest.test-seed#[30BD3DD1974EB3A7]) [n: c: s: r: x: t:] o.a.s.s.CoreContainerProvider Using logger factory org.apache.logging.slf4j.Log4jLoggerFactory
2> 6935 INFO (TEST-BasicDistributedZkTest.test-seed#[30BD3DD1974EB3A7]) [n: c: s: r: x: t:] o.a.s.s.CoreContainerProvider ___ _ Welcome to Apache Solr™ version 9.6.0
2> 6936 INFO (TEST-BasicDistributedZkTest.test-seed#[30BD3DD1974EB3A7]) [n: c: s: r: x: t:] o.a.s.s.CoreContainerProvider / __| ___| |_ _ Starting in cloud mode on port null
2> 6937 INFO (TEST-BasicDistributedZkTest.test-seed#[30BD3DD1974EB3A7]) [n: c: s: r: x: t:] o.a.s.s.CoreContainerProvider \__ \/ _ \ | '_| Install dir: /tmp/src/solr/solr
2> 6937 INFO (TEST-BasicDistributedZkTest.test-seed#[30BD3DD1974EB3A7]) [n: c: s: r: x: t:] o.a.s.s.CoreContainerProvider |___/\___/_|_| Start time: 2024-02-03T20:56:08.069909Z
2> 6960 INFO (TEST-BasicDistributedZkTest.test-seed#[30BD3DD1974EB3A7]) [n: c: s: r: x: t:] o.a.s.s.CoreContainerProvider Solr Home: /tmp/src/solr/solr/core/build/tmp/tests-tmp/solr.cloud.BasicDistributedZkTest_30BD3DD1974EB3A7-001/control-001 (source: servlet config: solr.solr.home)
2> 6983 WARN (TEST-BasicDistributedZkTest.test-seed#[30BD3DD1974EB3A7]) [n: c: s: r: x: t:] o.a.s.c.c.SolrZkClient Using default ZkCredentialsInjector. ZkCredentialsInjector is not secure, it creates an empty list of credentials which leads to 'OPEN_ACL_UNSAFE' ACLs to Zookeeper nodes
2> 6989 INFO (TEST-BasicDistributedZkTest.test-seed#[30BD3DD1974EB3A7]) [n: c: s: r: x: t:] o.a.s.c.c.ConnectionManager Waiting up to 30000ms for client to connect to ZooKeeper
2> 6995 INFO (zkConnectionManagerCallback-8-thread-1) [n: c: s: r: x: t:] o.a.s.c.c.ConnectionManager zkClient has connected
2> 6995 INFO (TEST-BasicDistributedZkTest.test-seed#[30BD3DD1974EB3A7]) [n: c: s: r: x: t:] o.a.s.c.c.ConnectionManager Client is connected to ZooKeeper
2> 6996 WARN (TEST-BasicDistributedZkTest.test-seed#[30BD3DD1974EB3A7]) [n: c: s: r: x: t:] o.a.s.c.c.SolrZkClient Using default ZkACLProvider. DefaultZkACLProvider is not secure, it creates 'OPEN_ACL_UNSAFE' ACLs to Zookeeper nodes
2> 7116 INFO (TEST-BasicDistributedZkTest.test-seed#[30BD3DD1974EB3A7]) [n: c: s: r: x: t:] o.a.s.c.NodeConfig Loading solr.xml from SolrHome (not found in ZooKeeper)
2> 7117 INFO (TEST-BasicDistributedZkTest.test-seed#[30BD3DD1974EB3A7]) [n: c: s: r: x: t:] o.a.s.c.SolrXmlConfig Loading solr.xml from /tmp/src/solr/solr/core/build/tmp/tests-tmp/solr.cloud.BasicDistributedZkTest_30BD3DD1974EB3A7-001/control-001/solr.xml
2> 11573 INFO (TEST-BasicDistributedZkTest.test-seed#[30BD3DD1974EB3A7]) [n: c: s: r: x: t:] o.a.s.u.t.SimplePropagator Always-on trace id generation enabled.
2> 12280 INFO (TEST-BasicDistributedZkTest.test-seed#[30BD3DD1974EB3A7]) [n: c: s: r: x: t:] o.a.s.c.ZkContainer Zookeeper client=127.0.0.1:41907/solr
2> 12320 WARN (TEST-BasicDistributedZkTest.test-seed#[30BD3DD1974EB3A7]) [n: c: s: r: x: t:] o.a.s.c.c.SolrZkClient Using default ZkCredentialsInjector. ZkCredentialsInjector is not secure, it creates an empty list of credentials which leads to 'OPEN_ACL_UNSAFE' ACLs to Zookeeper nodes
2> 12354 INFO (TEST-BasicDistributedZkTest.test-seed#[30BD3DD1974EB3A7]) [n: c: s: r: x: t:] o.a.s.c.c.ConnectionManager Waiting up to 15000ms for client to connect to ZooKeeper
2> 12380 INFO (zkConnectionManagerCallback-18-thread-1) [n: c: s: r: x: t:] o.a.s.c.c.ConnectionManager zkClient has connected
2> 12381 INFO (TEST-BasicDistributedZkTest.test-seed#[30BD3DD1974EB3A7]) [n: c: s: r: x: t:] o.a.s.c.c.ConnectionManager Client is connected to ZooKeeper
2> 12381 WARN (TEST-BasicDistributedZkTest.test-seed#[30BD3DD1974EB3A7]) [n: c: s: r: x: t:] o.a.s.c.c.SolrZkClient Using default ZkACLProvider. DefaultZkACLProvider is not secure, it creates 'OPEN_ACL_UNSAFE' ACLs to Zookeeper nodes
2> 12501 INFO (TEST-BasicDistributedZkTest.test-seed#[30BD3DD1974EB3A7]) [n: c: s: r: x: t:] o.a.s.c.DistributedClusterStateUpdater Creating DistributedClusterStateUpdater with useDistributedStateUpdate=false. Solr will be using Overseer based cluster state updates.
2> 12526 INFO (TEST-BasicDistributedZkTest.test-seed#[30BD3DD1974EB3A7]) [n:127.0.0.1:42901_k_xy%2Fa c: s: r: x: t:] o.a.s.c.c.ConnectionManager Waiting up to 15000ms for client to connect to ZooKeeper
2> 12534 INFO (zkConnectionManagerCallback-20-thread-1) [n: c: s: r: x: t:] o.a.s.c.c.ConnectionManager zkClient has connected
2> 12534 INFO (TEST-BasicDistributedZkTest.test-seed#[30BD3DD1974EB3A7]) [n:127.0.0.1:42901_k_xy%2Fa c: s: r: x: t:] o.a.s.c.c.ConnectionManager Client is connected to ZooKeeper
2> 12738 WARN (TEST-BasicDistributedZkTest.test-seed#[30BD3DD1974EB3A7]) [n:127.0.0.1:42901_k_xy%2Fa c: s: r: x: t:] o.a.s.c.ZkController Contents of zookeeper /security.json are world-readable; consider setting up ACLs as described in https://solr.apache.org/guide/solr/latest/deployment-guide/zookeeper-access-control.html
2> 12832 INFO (TEST-BasicDistributedZkTest.test-seed#[30BD3DD1974EB3A7]) [n:127.0.0.1:42901_k_xy%2Fa c: s: r: x: t:] o.a.s.c.DistributedClusterStateUpdater Creating DistributedClusterStateUpdater with useDistributedStateUpdate=false. Solr will be using Overseer based cluster state updates.
2> 12887 INFO (TEST-BasicDistributedZkTest.test-seed#[30BD3DD1974EB3A7]) [n:127.0.0.1:42901_k_xy%2Fa c: s: r: x: t:] o.a.s.c.OverseerElectionContext I am going to be the leader 127.0.0.1:42901_k_xy%2Fa
2> 12896 INFO (TEST-BasicDistributedZkTest.test-seed#[30BD3DD1974EB3A7]) [n:127.0.0.1:42901_k_xy%2Fa c: s: r: x: t:] o.a.s.c.Overseer Overseer (id=72057618042126340-127.0.0.1:42901_k_xy%2Fa-n_0000000000) starting
2> 13120 INFO (TEST-BasicDistributedZkTest.test-seed#[30BD3DD1974EB3A7]) [n:127.0.0.1:42901_k_xy%2Fa c: s: r: x: t:] o.a.s.c.ZkController Register node as live in ZooKeeper:/live_nodes/127.0.0.1:42901_k_xy%2Fa
2> 13132 INFO (zkCallback-19-thread-1) [n: c: s: r: x: t:] o.a.s.c.c.ZkStateReader Updated live nodes from ZooKeeper... (0) -> (1)
2> 13135 INFO (OverseerStateUpdate-72057618042126340-127.0.0.1:42901_k_xy%2Fa-n_0000000000) [n:127.0.0.1:42901_k_xy%2Fa c: s: r: x: t:] o.a.s.c.Overseer Starting to work on the main queue : 127.0.0.1:42901_k_xy%2Fa
2> 13241 WARN (TEST-BasicDistributedZkTest.test-seed#[30BD3DD1974EB3A7]) [n:127.0.0.1:42901_k_xy%2Fa c: s: r: x: t:] o.a.s.c.CoreContainer Not all security plugins configured! authentication=disabled authorization=disabled. Solr is only as secure as you make it. Consider configuring authentication/authorization before exposing Solr to users internal or external. See https://s.apache.org/solrsecurity for more info
2> 14185 INFO (TEST-BasicDistributedZkTest.test-seed#[30BD3DD1974EB3A7]) [n:127.0.0.1:42901_k_xy%2Fa c: s: r: x: t:] o.a.s.c.CorePropertiesLocator Found 0 core definitions underneath /tmp/src/solr/solr/core/build/tmp/tests-tmp/solr.cloud.BasicDistributedZkTest_30BD3DD1974EB3A7-001/control-001/cores
2> feb. 03, 2024 1:56:15 PM org.glassfish.jersey.message.internal.MessagingBinders$EnabledProvidersBinder bindToBinder
2> WARNING: A class jakarta.activation.DataSource for a default provider MessageBodyWriter<jakarta.activation.DataSource> was not found. The provider is not available.
2> 15451 INFO (TEST-BasicDistributedZkTest.test-seed#[30BD3DD1974EB3A7]) [n:127.0.0.1:42901_k_xy%2Fa c: s: r: x: t:] o.a.s.j.SolrRequestAuthorizer Creating a new SolrRequestAuthorizer
2> 15748 INFO (TEST-BasicDistributedZkTest.test-seed#[30BD3DD1974EB3A7]) [n:127.0.0.1:42901_k_xy%2Fa c: s: r: x: t:] o.a.s.e.JettySolrRunner Jetty properties: {hostContext=/k_xy/a, solr.data.dir=/tmp/src/solr/solr/core/build/tmp/tests-tmp/solr.cloud.BasicDistributedZkTest_30BD3DD1974EB3A7-001/tempDir-001/control/data, hostPort=42901, coreRootDirectory=/tmp/src/solr/solr/core/build/tmp/tests-cwd/../../../../../../../../tmp/src/solr/solr/core/build/tmp/tests-tmp/solr.cloud.BasicDistributedZkTest_30BD3DD1974EB3A7-001/control-001/cores, replicaType=NRT}
2> 15797 WARN (TEST-BasicDistributedZkTest.test-seed#[30BD3DD1974EB3A7]) [n: c: s: r: x: t:] o.a.s.c.c.SolrZkClient Using default ZkCredentialsInjector. ZkCredentialsInjector is not secure, it creates an empty list of credentials which leads to 'OPEN_ACL_UNSAFE' ACLs to Zookeeper nodes
2> 15811 INFO (TEST-BasicDistributedZkTest.test-seed#[30BD3DD1974EB3A7]) [n: c: s: r: x: t:] o.a.s.c.c.ConnectionManager Waiting up to 15000ms for client to connect to ZooKeeper
2> 15829 INFO (zkConnectionManagerCallback-33-thread-1) [n: c: s: r: x: t:] o.a.s.c.c.ConnectionManager zkClient has connected
2> 15832 INFO (TEST-BasicDistributedZkTest.test-seed#[30BD3DD1974EB3A7]) [n: c: s: r: x: t:] o.a.s.c.c.ConnectionManager Client is connected to ZooKeeper
2> 15833 WARN (TEST-BasicDistributedZkTest.test-seed#[30BD3DD1974EB3A7]) [n: c: s: r: x: t:] o.a.s.c.c.SolrZkClient Using default ZkACLProvider. DefaultZkACLProvider is not secure, it creates 'OPEN_ACL_UNSAFE' ACLs to Zookeeper nodes
2> 15838 INFO (TEST-BasicDistributedZkTest.test-seed#[30BD3DD1974EB3A7]) [n: c: s: r: x: t:] o.a.s.c.c.ZkStateReader Updated live nodes from ZooKeeper... (0) -> (1)
2> 15845 INFO (TEST-BasicDistributedZkTest.test-seed#[30BD3DD1974EB3A7]) [n: c: s: r: x: t:] o.a.s.c.s.i.ZkClientClusterStateProvider Cluster at 127.0.0.1:41907/solr ready
2> 16269 INFO (closeThreadPool-35-thread-1) [n: c: s: r: x: t:] o.e.j.s.Server Stopped Server@57653ca9{STOPPING}[10.0.19,sto=0]
2> 16272 INFO (closeThreadPool-35-thread-1) [n: c: s: r: x: t:] o.e.j.s.AbstractConnector Stopped ServerConnector@65840be4{HTTP/1.1, (http/1.1, h2c)}{127.0.0.1:0}
2> 16277 INFO (closeThreadPool-35-thread-1) [n: c: s: r: x: t:] o.e.j.s.h.ContextHandler Stopped o.e.j.s.ServletContextHandler@1801e83f{/k_xy/a,file:///tmp/src/solr/solr/core/build/tmp/tests-cwd/,STOPPED}
2> 16294 INFO (closeThreadPool-35-thread-1) [n: c: s: r: x: t:] o.a.s.c.CoreContainer Shutting down CoreContainer instance=485546963
2> 16295 INFO (closeThreadPool-35-thread-1) [n: c: s: r: x: t:] o.a.s.c.ZkController Remove node as live in ZooKeeper:/live_nodes/127.0.0.1:42901_k_xy%2Fa
2> 16303 INFO (closeThreadPool-35-thread-1) [n: c: s: r: x: t:] o.a.s.c.ZkController Publish this node as DOWN...
2> 16303 INFO (closeThreadPool-35-thread-1) [n: c: s: r: x: t:] o.a.s.c.ZkController Publish node=127.0.0.1:42901_k_xy%2Fa as DOWN
2> 16303 INFO (zkCallback-19-thread-1) [n: c: s: r: x: t:] o.a.s.c.c.ZkStateReader Updated live nodes from ZooKeeper... (1) -> (0)
2> 16329 INFO (closeThreadPool-35-thread-1) [n: c: s: r: x: t:] o.a.s.m.SolrMetricManager Closing metric reporters for registry=solr.node tag=null
2> 16372 INFO (closeThreadPool-35-thread-1) [n: c: s: r: x: t:] o.a.s.m.SolrMetricManager Closing metric reporters for registry=solr.jvm tag=null
2> 16385 INFO (closeThreadPool-35-thread-1) [n: c: s: r: x: t:] o.a.s.m.SolrMetricManager Closing metric reporters for registry=solr.jetty tag=null
2> 16386 INFO (closeThreadPool-35-thread-1) [n: c: s: r: x: t:] o.a.s.m.SolrMetricManager Closing metric reporters for registry=solr.cluster tag=null
2> 16398 INFO (closeThreadPool-38-thread-1) [n: c: s: r: x: t:] o.a.s.c.Overseer Overseer (id=72057618042126340-127.0.0.1:42901_k_xy%2Fa-n_0000000000) closing
2> 16399 INFO (OverseerStateUpdate-72057618042126340-127.0.0.1:42901_k_xy%2Fa-n_0000000000) [n:127.0.0.1:42901_k_xy%2Fa c: s: r: x: t:] o.a.s.c.Overseer Overseer Loop exiting : 127.0.0.1:42901_k_xy%2Fa
2> 16421 INFO (closeThreadPool-38-thread-2) [n: c: s: r: x: t:] o.a.s.c.Overseer Overseer (id=72057618042126340-127.0.0.1:42901_k_xy%2Fa-n_0000000000) closing
2> 16533 INFO (closeThreadPool-35-thread-1) [n: c: s: r: x: t:] o.a.s.c.Overseer Overseer (id=72057618042126340-127.0.0.1:42901_k_xy%2Fa-n_0000000000) closing
2> 16539 INFO (TEST-BasicDistributedZkTest.test-seed#[30BD3DD1974EB3A7]) [n: c: s: r: x: t:] o.a.s.u.ErrorLogMuter Closing ErrorLogMuter-regex-2 after mutting 0 log messages
2> 16539 INFO (TEST-BasicDistributedZkTest.test-seed#[30BD3DD1974EB3A7]) [n: c: s: r: x: t:] o.a.s.u.ErrorLogMuter Creating ErrorLogMuter-regex-3 for ERROR logs matching regex: ignore_exception
2> 16540 INFO (TEST-BasicDistributedZkTest.test-seed#[30BD3DD1974EB3A7]) [n: c: s: r: x: t:] o.a.s.c.ZkTestServer Shutting down ZkTestServer.
2> 16753 WARN (ZkTestServer Run Thread) [n: c: s: r: x: t:] o.a.s.c.ZkTestServer Watch limit violations:
2> Maximum concurrent create/delete watches above limit:
2>
2> 2 /solr/aliases.json
2> 2 /solr/clusterprops.json
2>
2> Maximum concurrent children watches above limit:
2>
2> 4 /solr/live_nodes
2> 2 /solr/overseer/queue
2> 2 /solr/collections
2>
> org.apache.solr.client.solrj.impl.BaseHttpSolrClient$RemoteSolrException: Error from server at http://127.0.0.1:42901/k_xy: Expected mime type in [application/octet-stream, application/vnd.apache.solr.javabin] but got text/html. <html>
> <head>
> <meta http-equiv="Content-Type" content="text/html;charset=ISO-8859-1"/>
> <title>Error 404 Not Found</title>
> </head>
> <body><h2>HTTP ERROR 404 Not Found</h2>
> <table>
> <tr><th>URI:</th><td>/k_xy/admin/collections</td></tr>
> <tr><th>STATUS:</th><td>404</td></tr>
> <tr><th>MESSAGE:</th><td>Not Found</td></tr>
> <tr><th>SERVLET:</th><td>-</td></tr>
> </table>
> <hr/><a href="https://eclipse.org/jetty">Powered by Jetty:// 10.0.19</a><hr/>
>
> </body>
> </html>
> at __randomizedtesting.SeedInfo.seed([30BD3DD1974EB3A7:B8E9020B39B2DE5F]:0)
> at app//org.apache.solr.client.solrj.impl.HttpSolrClient.executeMethod(HttpSolrClient.java:692)
> at app//org.apache.solr.client.solrj.impl.HttpSolrClient.request(HttpSolrClient.java:267)
> at app//org.apache.solr.client.solrj.impl.HttpSolrClient.request(HttpSolrClient.java:246)
> at app//org.apache.solr.client.solrj.impl.LBSolrClient.doRequest(LBSolrClient.java:390)
> at app//org.apache.solr.client.solrj.impl.LBSolrClient.request(LBSolrClient.java:353)
> at app//org.apache.solr.client.solrj.impl.CloudSolrClient.sendRequest(CloudSolrClient.java:1193)
> at app//org.apache.solr.client.solrj.impl.CloudSolrClient.requestWithRetryOnStaleState(CloudSolrClient.java:892)
> at app//org.apache.solr.client.solrj.impl.CloudSolrClient.request(CloudSolrClient.java:820)
> at app//org.apache.solr.client.solrj.SolrRequest.process(SolrRequest.java:255)
> at app//org.apache.solr.client.solrj.SolrRequest.process(SolrRequest.java:270)
> at app//org.apache.solr.cloud.AbstractFullDistribZkTestBase.createServers(AbstractFullDistribZkTestBase.java:353)
> at app//org.apache.solr.BaseDistributedSearchTestCase$ShardsRepeatRule$ShardsFixedStatement.callStatement(BaseDistributedSearchTestCase.java:1152)
> at app//org.apache.solr.BaseDistributedSearchTestCase$ShardsRepeatRule$ShardsStatement.evaluate(BaseDistributedSearchTestCase.java:1125)
> at app//com.carrotsearch.randomizedtesting.rules.SystemPropertiesRestoreRule$1.evaluate(SystemPropertiesRestoreRule.java:80)
> at app//org.junit.rules.RunRules.evaluate(RunRules.java:20)
> at app//org.apache.lucene.tests.util.TestRuleSetupTeardownChained$1.evaluate(TestRuleSetupTeardownChained.java:48)
> at app//org.apache.lucene.tests.util.AbstractBeforeAfterRule$1.evaluate(AbstractBeforeAfterRule.java:43)
> at app//org.apache.lucene.tests.util.TestRuleThreadAndTestName$1.evaluate(TestRuleThreadAndTestName.java:45)
> at app//org.apache.lucene.tests.util.TestRuleIgnoreAfterMaxFailures$1.evaluate(TestRuleIgnoreAfterMaxFailures.java:60)
> at app//org.apache.lucene.tests.util.TestRuleMarkFailure$1.evaluate(TestRuleMarkFailure.java:44)
> at app//org.junit.rules.RunRules.evaluate(RunRules.java:20)
> at app//com.carrotsearch.randomizedtesting.rules.StatementAdapter.evaluate(StatementAdapter.java:36)
> at app//com.carrotsearch.randomizedtesting.ThreadLeakControl$StatementRunner.run(ThreadLeakControl.java:390)
> at app//com.carrotsearch.randomizedtesting.ThreadLeakControl.forkTimeoutingTask(ThreadLeakControl.java:843)
> at app//com.carrotsearch.randomizedtesting.ThreadLeakControl$3.evaluate(ThreadLeakControl.java:490)
> at app//com.carrotsearch.randomizedtesting.RandomizedRunner.runSingleTest(RandomizedRunner.java:955)
> at app//com.carrotsearch.randomizedtesting.RandomizedRunner$5.evaluate(RandomizedRunner.java:840)
> at app//com.carrotsearch.randomizedtesting.RandomizedRunner$6.evaluate(RandomizedRunner.java:891)
> at app//com.carrotsearch.randomizedtesting.RandomizedRunner$7.evaluate(RandomizedRunner.java:902)
> at app//com.carrotsearch.randomizedtesting.rules.StatementAdapter.evaluate(StatementAdapter.java:36)
> at app//com.carrotsearch.randomizedtesting.rules.StatementAdapter.evaluate(StatementAdapter.java:36)
> at app//org.apache.lucene.tests.util.AbstractBeforeAfterRule$1.evaluate(AbstractBeforeAfterRule.java:43)
> at app//org.apache.lucene.tests.util.AbstractBeforeAfterRule$1.evaluate(AbstractBeforeAfterRule.java:43)
> at app//com.carrotsearch.randomizedtesting.rules.SystemPropertiesRestoreRule$1.evaluate(SystemPropertiesRestoreRule.java:80)
> at app//org.junit.rules.RunRules.evaluate(RunRules.java:20)
> at app//org.apache.lucene.tests.util.AbstractBeforeAfterRule$1.evaluate(AbstractBeforeAfterRule.java:43)
> at app//com.carrotsearch.randomizedtesting.rules.StatementAdapter.evaluate(StatementAdapter.java:36)
> at app//org.apache.lucene.tests.util.TestRuleStoreClassName$1.evaluate(TestRuleStoreClassName.java:38)
> at app//com.carrotsearch.randomizedtesting.rules.NoShadowingOrOverridesOnMethodsRule$1.evaluate(NoShadowingOrOverridesOnMethodsRule.java:40)
> at app//com.carrotsearch.randomizedtesting.rules.NoShadowingOrOverridesOnMethodsRule$1.evaluate(NoShadowingOrOverridesOnMethodsRule.java:40)
> at app//com.carrotsearch.randomizedtesting.rules.StatementAdapter.evaluate(StatementAdapter.java:36)
> at app//com.carrotsearch.randomizedtesting.rules.StatementAdapter.evaluate(StatementAdapter.java:36)
> at app//org.apache.lucene.tests.util.TestRuleAssertionsRequired$1.evaluate(TestRuleAssertionsRequired.java:53)
> at app//org.apache.lucene.tests.util.AbstractBeforeAfterRule$1.evaluate(AbstractBeforeAfterRule.java:43)
> at app//org.apache.lucene.tests.util.TestRuleMarkFailure$1.evaluate(TestRuleMarkFailure.java:44)
> at app//org.apache.lucene.tests.util.TestRuleIgnoreAfterMaxFailures$1.evaluate(TestRuleIgnoreAfterMaxFailures.java:60)
> at app//org.apache.lucene.tests.util.TestRuleIgnoreTestSuites$1.evaluate(TestRuleIgnoreTestSuites.java:47)
> at app//org.junit.rules.RunRules.evaluate(RunRules.java:20)
> at app//com.carrotsearch.randomizedtesting.rules.StatementAdapter.evaluate(StatementAdapter.java:36)
> at app//com.carrotsearch.randomizedtesting.ThreadLeakControl$StatementRunner.run(ThreadLeakControl.java:390)
> at app//com.carrotsearch.randomizedtesting.ThreadLeakControl.lambda$forkTimeoutingTask$0(ThreadLeakControl.java:850)
> at java.base@11.0.21/java.lang.Thread.run(Thread.java:829)
2> NOTE: reproduce with: gradlew test --tests BasicDistributedZkTest.test -Dtests.seed=30BD3DD1974EB3A7 -Dtests.locale=fo-FO -Dtests.timezone=Mexico/BajaSur -Dtests.asserts=true -Dtests.file.encoding=UTF-8
2> 16779 INFO (SUITE-BasicDistributedZkTest-seed#[30BD3DD1974EB3A7]-worker) [n: c: s: r: x: t:] o.a.s.u.ErrorLogMuter Closing ErrorLogMuter-regex-3 after mutting 0 log messages
2> 16779 INFO (SUITE-BasicDistributedZkTest-seed#[30BD3DD1974EB3A7]-worker) [n: c: s: r: x: t:] o.a.s.u.ErrorLogMuter Creating ErrorLogMuter-regex-4 for ERROR logs matching regex: ignore_exception
2> NOTE: leaving temporary files on disk at: /tmp/src/solr/solr/core/build/tmp/tests-tmp/solr.cloud.BasicDistributedZkTest_30BD3DD1974EB3A7-001
2> NOTE: test params are: codec=Lucene99, sim=Asserting(RandomSimilarity(queryNorm=true): {}), locale=fo-FO, timezone=Mexico/BajaSur
2> NOTE: Linux 5.4.0-100-generic amd64/Eclipse Adoptium 11.0.21 (64-bit)/cpus=1,threads=2,free=207153864,total=347078656
2> NOTE: All tests run in this JVM: [BasicDistributedZkTest]
org.apache.solr.cloud.api.collections.TestCollectionAPI > testCreateCollectionBooleanValues FAILED
org.apache.solr.client.solrj.impl.BaseHttpSolrClient$RemoteSolrException: Error from server at http://127.0.0.1:38329: Expected mime type in [application/octet-stream, application/vnd.apache.solr.javabin] but got text/html. <html>
<head>
<meta http-equiv="Content-Type" content="text/html;charset=ISO-8859-1"/>
<title>Error 404 Not Found</title>
</head>
<body><h2>HTTP ERROR 404 Not Found</h2>
<table>
<tr><th>URI:</th><td>/admin/collections</td></tr>
<tr><th>STATUS:</th><td>404</td></tr>
<tr><th>MESSAGE:</th><td>Not Found</td></tr>
<tr><th>SERVLET:</th><td>-</td></tr>
</table>
<hr/><a href="https://eclipse.org/jetty">Powered by Jetty:// 10.0.19</a><hr/>
</body>
</html>
at __randomizedtesting.SeedInfo.seed([30BD3DD1974EB3A7:12419403C52BF8E]:0)
at app//org.apache.solr.client.solrj.impl.HttpSolrClient.executeMethod(HttpSolrClient.java:692)
at app//org.apache.solr.client.solrj.impl.HttpSolrClient.request(HttpSolrClient.java:267)
at app//org.apache.solr.client.solrj.impl.HttpSolrClient.request(HttpSolrClient.java:246)
at app//org.apache.solr.client.solrj.impl.LBSolrClient.doRequest(LBSolrClient.java:390)
at app//org.apache.solr.client.solrj.impl.LBSolrClient.request(LBSolrClient.java:353)
at app//org.apache.solr.client.solrj.impl.CloudSolrClient.sendRequest(CloudSolrClient.java:1193)
at app//org.apache.solr.client.solrj.impl.CloudSolrClient.requestWithRetryOnStaleState(CloudSolrClient.java:892)
at app//org.apache.solr.client.solrj.impl.CloudSolrClient.request(CloudSolrClient.java:820)
at app//org.apache.solr.client.solrj.SolrRequest.process(SolrRequest.java:255)
at app//org.apache.solr.client.solrj.SolrRequest.process(SolrRequest.java:270)
at app//org.apache.solr.cloud.AbstractFullDistribZkTestBase.createServers(AbstractFullDistribZkTestBase.java:353)
at app//org.apache.solr.BaseDistributedSearchTestCase$ShardsRepeatRule$ShardsFixedStatement.callStatement(BaseDistributedSearchTestCase.java:1152)
at app//org.apache.solr.BaseDistributedSearchTestCase$ShardsRepeatRule$ShardsStatement.evaluate(BaseDistributedSearchTestCase.java:1125)
at app//com.carrotsearch.randomizedtesting.rules.SystemPropertiesRestoreRule$1.evaluate(SystemPropertiesRestoreRule.java:80)
at app//org.junit.rules.RunRules.evaluate(RunRules.java:20)
at app//org.apache.lucene.tests.util.TestRuleSetupTeardownChained$1.evaluate(TestRuleSetupTeardownChained.java:48)
at app//org.apache.lucene.tests.util.AbstractBeforeAfterRule$1.evaluate(AbstractBeforeAfterRule.java:43)
at app//org.apache.lucene.tests.util.TestRuleThreadAndTestName$1.evaluate(TestRuleThreadAndTestName.java:45)
at app//org.apache.lucene.tests.util.TestRuleIgnoreAfterMaxFailures$1.evaluate(TestRuleIgnoreAfterMaxFailures.java:60)
at app//org.apache.lucene.tests.util.TestRuleMarkFailure$1.evaluate(TestRuleMarkFailure.java:44)
at app//org.junit.rules.RunRules.evaluate(RunRules.java:20)
at app//com.carrotsearch.randomizedtesting.rules.StatementAdapter.evaluate(StatementAdapter.java:36)
at app//com.carrotsearch.randomizedtesting.ThreadLeakControl$StatementRunner.run(ThreadLeakControl.java:390)
at app//com.carrotsearch.randomizedtesting.ThreadLeakControl.forkTimeoutingTask(ThreadLeakControl.java:843)
at app//com.carrotsearch.randomizedtesting.ThreadLeakControl$3.evaluate(ThreadLeakControl.java:490)
at app//com.carrotsearch.randomizedtesting.RandomizedRunner.runSingleTest(RandomizedRunner.java:955)
at app//com.carrotsearch.randomizedtesting.RandomizedRunner$5.evaluate(RandomizedRunner.java:840)
at app//com.carrotsearch.randomizedtesting.RandomizedRunner$6.evaluate(RandomizedRunner.java:891)
at app//com.carrotsearch.randomizedtesting.RandomizedRunner$7.evaluate(RandomizedRunner.java:902)
at app//com.carrotsearch.randomizedtesting.rules.StatementAdapter.evaluate(StatementAdapter.java:36)
at app//com.carrotsearch.randomizedtesting.rules.StatementAdapter.evaluate(StatementAdapter.java:36)
at app//org.apache.lucene.tests.util.AbstractBeforeAfterRule$1.evaluate(AbstractBeforeAfterRule.java:43)
at app//org.apache.lucene.tests.util.AbstractBeforeAfterRule$1.evaluate(AbstractBeforeAfterRule.java:43)
at app//com.carrotsearch.randomizedtesting.rules.SystemPropertiesRestoreRule$1.evaluate(SystemPropertiesRestoreRule.java:80)
at app//org.junit.rules.RunRules.evaluate(RunRules.java:20)
at app//org.apache.lucene.tests.util.AbstractBeforeAfterRule$1.evaluate(AbstractBeforeAfterRule.java:43)
at app//com.carrotsearch.randomizedtesting.rules.StatementAdapter.evaluate(StatementAdapter.java:36)
at app//org.apache.lucene.tests.util.TestRuleStoreClassName$1.evaluate(TestRuleStoreClassName.java:38)
at app//com.carrotsearch.randomizedtesting.rules.NoShadowingOrOverridesOnMethodsRule$1.evaluate(NoShadowingOrOverridesOnMethodsRule.java:40)
at app//com.carrotsearch.randomizedtesting.rules.NoShadowingOrOverridesOnMethodsRule$1.evaluate(NoShadowingOrOverridesOnMethodsRule.java:40)
at app//com.carrotsearch.randomizedtesting.rules.StatementAdapter.evaluate(StatementAdapter.java:36)
at app//com.carrotsearch.randomizedtesting.rules.StatementAdapter.evaluate(StatementAdapter.java:36)
at app//org.apache.lucene.tests.util.TestRuleAssertionsRequired$1.evaluate(TestRuleAssertionsRequired.java:53)
at app//org.apache.lucene.tests.util.AbstractBeforeAfterRule$1.evaluate(AbstractBeforeAfterRule.java:43)
at app//org.apache.lucene.tests.util.TestRuleMarkFailure$1.evaluate(TestRuleMarkFailure.java:44)
at app//org.apache.lucene.tests.util.TestRuleIgnoreAfterMaxFailures$1.evaluate(TestRuleIgnoreAfterMaxFailures.java:60)
at app//org.apache.lucene.tests.util.TestRuleIgnoreTestSuites$1.evaluate(TestRuleIgnoreTestSuites.java:47)
at app//org.junit.rules.RunRules.evaluate(RunRules.java:20)
at app//com.carrotsearch.randomizedtesting.rules.StatementAdapter.evaluate(StatementAdapter.java:36)
at app//com.carrotsearch.randomizedtesting.ThreadLeakControl$StatementRunner.run(ThreadLeakControl.java:390)
at app//com.carrotsearch.randomizedtesting.ThreadLeakControl.lambda$forkTimeoutingTask$0(ThreadLeakControl.java:850)
at java.base@11.0.21/java.lang.Thread.run(Thread.java:829)
org.apache.solr.cloud.ShardRoutingCustomTest > test FAILED
org.apache.solr.client.solrj.impl.BaseHttpSolrClient$RemoteSolrException: Error from server at http://127.0.0.1:40305/huqw: Expected mime type in [application/octet-stream, application/vnd.apache.solr.javabin] but got text/html. <html>
<head>
<meta http-equiv="Content-Type" content="text/html;charset=ISO-8859-1"/>
<title>Error 404 Not Found</title>
</head>
<body><h2>HTTP ERROR 404 Not Found</h2>
<table>
<tr><th>URI:</th><td>/huqw/admin/collections</td></tr>
<tr><th>STATUS:</th><td>404</td></tr>
<tr><th>MESSAGE:</th><td>Not Found</td></tr>
<tr><th>SERVLET:</th><td>-</td></tr>
</table>
<hr/><a href="https://eclipse.org/jetty">Powered by Jetty:// 10.0.19</a><hr/>
</body>
</html>
at __randomizedtesting.SeedInfo.seed([30BD3DD1974EB3A7:B8E9020B39B2DE5F]:0)
at app//org.apache.solr.client.solrj.impl.HttpSolrClient.executeMethod(HttpSolrClient.java:692)
at app//org.apache.solr.client.solrj.impl.HttpSolrClient.request(HttpSolrClient.java:267)
at app//org.apache.solr.client.solrj.impl.HttpSolrClient.request(HttpSolrClient.java:246)
at app//org.apache.solr.client.solrj.impl.LBSolrClient.doRequest(LBSolrClient.java:390)
at app//org.apache.solr.client.solrj.impl.LBSolrClient.request(LBSolrClient.java:353)
at app//org.apache.solr.client.solrj.impl.CloudSolrClient.sendRequest(CloudSolrClient.java:1193)
at app//org.apache.solr.client.solrj.impl.CloudSolrClient.requestWithRetryOnStaleState(CloudSolrClient.java:892)
at app//org.apache.solr.client.solrj.impl.CloudSolrClient.request(CloudSolrClient.java:820)
at app//org.apache.solr.client.solrj.SolrRequest.process(SolrRequest.java:255)
at app//org.apache.solr.client.solrj.SolrRequest.process(SolrRequest.java:270)
at app//org.apache.solr.cloud.AbstractFullDistribZkTestBase.createServers(AbstractFullDistribZkTestBase.java:353)
at app//org.apache.solr.BaseDistributedSearchTestCase$ShardsRepeatRule$ShardsFixedStatement.callStatement(BaseDistributedSearchTestCase.java:1152)
at app//org.apache.solr.BaseDistributedSearchTestCase$ShardsRepeatRule$ShardsStatement.evaluate(BaseDistributedSearchTestCase.java:1125)
at app//com.carrotsearch.randomizedtesting.rules.SystemPropertiesRestoreRule$1.evaluate(SystemPropertiesRestoreRule.java:80)
at app//org.junit.rules.RunRules.evaluate(RunRules.java:20)
at app//org.apache.lucene.tests.util.TestRuleSetupTeardownChained$1.evaluate(TestRuleSetupTeardownChained.java:48)
at app//org.apache.lucene.tests.util.AbstractBeforeAfterRule$1.evaluate(AbstractBeforeAfterRule.java:43)
at app//org.apache.lucene.tests.util.TestRuleThreadAndTestName$1.evaluate(TestRuleThreadAndTestName.java:45)
at app//org.apache.lucene.tests.util.TestRuleIgnoreAfterMaxFailures$1.evaluate(TestRuleIgnoreAfterMaxFailures.java:60)
at app//org.apache.lucene.tests.util.TestRuleMarkFailure$1.evaluate(TestRuleMarkFailure.java:44)
at app//org.junit.rules.RunRules.evaluate(RunRules.java:20)
at app//com.carrotsearch.randomizedtesting.rules.StatementAdapter.evaluate(StatementAdapter.java:36)
at app//com.carrotsearch.randomizedtesting.ThreadLeakControl$StatementRunner.run(ThreadLeakControl.java:390)
at app//com.carrotsearch.randomizedtesting.ThreadLeakControl.forkTimeoutingTask(ThreadLeakControl.java:843)
at app//com.carrotsearch.randomizedtesting.ThreadLeakControl$3.evaluate(ThreadLeakControl.java:490)
at app//com.carrotsearch.randomizedtesting.RandomizedRunner.runSingleTest(RandomizedRunner.java:955)
at app//com.carrotsearch.randomizedtesting.RandomizedRunner$5.evaluate(RandomizedRunner.java:840)
at app//com.carrotsearch.randomizedtesting.RandomizedRunner$6.evaluate(RandomizedRunner.java:891)
at app//com.carrotsearch.randomizedtesting.RandomizedRunner$7.evaluate(RandomizedRunner.java:902)
at app//com.carrotsearch.randomizedtesting.rules.StatementAdapter.evaluate(StatementAdapter.java:36)
at app//com.carrotsearch.randomizedtesting.rules.StatementAdapter.evaluate(StatementAdapter.java:36)
at app//org.apache.lucene.tests.util.AbstractBeforeAfterRule$1.evaluate(AbstractBeforeAfterRule.java:43)
at app//org.apache.lucene.tests.util.AbstractBeforeAfterRule$1.evaluate(AbstractBeforeAfterRule.java:43)
at app//com.carrotsearch.randomizedtesting.rules.SystemPropertiesRestoreRule$1.evaluate(SystemPropertiesRestoreRule.java:80)
at app//org.junit.rules.RunRules.evaluate(RunRules.java:20)
at app//org.apache.lucene.tests.util.AbstractBeforeAfterRule$1.evaluate(AbstractBeforeAfterRule.java:43)
at app//com.carrotsearch.randomizedtesting.rules.StatementAdapter.evaluate(StatementAdapter.java:36)
at app//org.apache.lucene.tests.util.TestRuleStoreClassName$1.evaluate(TestRuleStoreClassName.java:38)
at app//com.carrotsearch.randomizedtesting.rules.NoShadowingOrOverridesOnMethodsRule$1.evaluate(NoShadowingOrOverridesOnMethodsRule.java:40)
at app//com.carrotsearch.randomizedtesting.rules.NoShadowingOrOverridesOnMethodsRule$1.evaluate(NoShadowingOrOverridesOnMethodsRule.java:40)
at app//com.carrotsearch.randomizedtesting.rules.StatementAdapter.evaluate(StatementAdapter.java:36)
at app//com.carrotsearch.randomizedtesting.rules.StatementAdapter.evaluate(StatementAdapter.java:36)
at app//org.apache.lucene.tests.util.TestRuleAssertionsRequired$1.evaluate(TestRuleAssertionsRequired.java:53)
at app//org.apache.lucene.tests.util.AbstractBeforeAfterRule$1.evaluate(AbstractBeforeAfterRule.java:43)
at app//org.apache.lucene.tests.util.TestRuleMarkFailure$1.evaluate(TestRuleMarkFailure.java:44)
at app//org.apache.lucene.tests.util.TestRuleIgnoreAfterMaxFailures$1.evaluate(TestRuleIgnoreAfterMaxFailures.java:60)
at app//org.apache.lucene.tests.util.TestRuleIgnoreTestSuites$1.evaluate(TestRuleIgnoreTestSuites.java:47)
at app//org.junit.rules.RunRules.evaluate(RunRules.java:20)
at app//com.carrotsearch.randomizedtesting.rules.StatementAdapter.evaluate(StatementAdapter.java:36)
at app//com.carrotsearch.randomizedtesting.ThreadLeakControl$StatementRunner.run(ThreadLeakControl.java:390)
at app//com.carrotsearch.randomizedtesting.ThreadLeakControl.lambda$forkTimeoutingTask$0(ThreadLeakControl.java:850)
at java.base@11.0.21/java.lang.Thread.run(Thread.java:829)
org.apache.solr.cloud.ShardRoutingCustomTest > test suite's output saved to /tmp/src/solr/solr/core/build/test-results/test/outputs/OUTPUT-org.apache.solr.cloud.ShardRoutingCustomTest.txt, copied below:
2> 13686 INFO (SUITE-ShardRoutingCustomTest-seed#[30BD3DD1974EB3A7]-worker) [n: c: s: r: x: t:] o.a.s.SolrTestCase Setting 'solr.default.confdir' system property to test-framework derived value of '/tmp/src/solr/solr/server/solr/configsets/_default/conf'
2> 13686 INFO (SUITE-ShardRoutingCustomTest-seed#[30BD3DD1974EB3A7]-worker) [n: c: s: r: x: t:] o.a.s.SolrTestCaseJ4 SecureRandom sanity checks: test.solr.allowed.securerandom=null & java.security.egd=file:/dev/./urandom
2> 13687 INFO (SUITE-ShardRoutingCustomTest-seed#[30BD3DD1974EB3A7]-worker) [n: c: s: r: x: t:] o.a.s.u.ErrorLogMuter Closing ErrorLogMuter-regex-2 after mutting 0 log messages
2> 13688 INFO (SUITE-ShardRoutingCustomTest-seed#[30BD3DD1974EB3A7]-worker) [n: c: s: r: x: t:] o.a.s.u.ErrorLogMuter Creating ErrorLogMuter-regex-3 for ERROR logs matching regex: ignore_exception
2> 13689 INFO (SUITE-ShardRoutingCustomTest-seed#[30BD3DD1974EB3A7]-worker) [n: c: s: r: x: t:] o.a.s.SolrTestCaseJ4 Created dataDir: /tmp/src/solr/solr/core/build/tmp/tests-tmp/solr.cloud.ShardRoutingCustomTest_30BD3DD1974EB3A7-001/data-dir-2-001
2> 13690 INFO (SUITE-ShardRoutingCustomTest-seed#[30BD3DD1974EB3A7]-worker) [n: c: s: r: x: t:] o.a.s.SolrTestCaseJ4 Using PointFields (NUMERIC_POINTS_SYSPROP=true) w/NUMERIC_DOCVALUES_SYSPROP=false
2> 13692 INFO (SUITE-ShardRoutingCustomTest-seed#[30BD3DD1974EB3A7]-worker) [n: c: s: r: x: t:] o.a.s.SolrTestCaseJ4 Randomized ssl (false) and clientAuth (true) via: @org.apache.solr.util.RandomizeSSL(reason="", value=0.0/0.0, ssl=0.0/0.0, clientAuth=0.0/0.0)
2> 13693 INFO (SUITE-ShardRoutingCustomTest-seed#[30BD3DD1974EB3A7]-worker) [n: c: s: r: x: t:] o.a.s.BaseDistributedSearchTestCase Setting hostContext system property: /huqw/fr
2> 13714 INFO (TEST-ShardRoutingCustomTest.test-seed#[30BD3DD1974EB3A7]) [n: c: s: r: x: t:] o.a.s.u.ErrorLogMuter Closing ErrorLogMuter-regex-3 after mutting 0 log messages
2> 13715 INFO (TEST-ShardRoutingCustomTest.test-seed#[30BD3DD1974EB3A7]) [n: c: s: r: x: t:] o.a.s.u.ErrorLogMuter Creating ErrorLogMuter-regex-4 for ERROR logs matching regex: ignore_exception
2> 13716 INFO (TEST-ShardRoutingCustomTest.test-seed#[30BD3DD1974EB3A7]) [n: c: s: r: x: t:] o.a.s.c.ZkTestServer STARTING ZK TEST SERVER
2> 13726 INFO (ZkTestServer Run Thread) [n: c: s: r: x: t:] o.a.s.c.ZkTestServer client port: /127.0.0.1:0
2> 13726 INFO (ZkTestServer Run Thread) [n: c: s: r: x: t:] o.a.s.c.ZkTestServer Starting server
2> 13728 WARN (ZkTestServer Run Thread) [n: c: s: r: x: t:] o.a.z.s.ServerCnxnFactory maxCnxns is not configured, using default value 0.
2> 13823 INFO (TEST-ShardRoutingCustomTest.test-seed#[30BD3DD1974EB3A7]) [n: c: s: r: x: t:] o.a.s.c.ZkTestServer start zk server on port: 39569
2> 13876 WARN (TEST-ShardRoutingCustomTest.test-seed#[30BD3DD1974EB3A7]) [n: c: s: r: x: t:] o.a.s.c.c.SolrZkClient Using default ZkCredentialsInjector. ZkCredentialsInjector is not secure, it creates an empty list of credentials which leads to 'OPEN_ACL_UNSAFE' ACLs to Zookeeper nodes
2> 13898 INFO (TEST-ShardRoutingCustomTest.test-seed#[30BD3DD1974EB3A7]) [n: c: s: r: x: t:] o.a.s.c.c.ConnectionManager Waiting up to 30000ms for client to connect to ZooKeeper
2> 13962 INFO (zkConnectionManagerCallback-49-thread-1) [n: c: s: r: x: t:] o.a.s.c.c.ConnectionManager zkClient has connected
2> 13962 INFO (TEST-ShardRoutingCustomTest.test-seed#[30BD3DD1974EB3A7]) [n: c: s: r: x: t:] o.a.s.c.c.ConnectionManager Client is connected to ZooKeeper
2> 13963 WARN (TEST-ShardRoutingCustomTest.test-seed#[30BD3DD1974EB3A7]) [n: c: s: r: x: t:] o.a.s.c.c.SolrZkClient Using default ZkACLProvider. DefaultZkACLProvider is not secure, it creates 'OPEN_ACL_UNSAFE' ACLs to Zookeeper nodes
2> 13967 WARN (TEST-ShardRoutingCustomTest.test-seed#[30BD3DD1974EB3A7]) [n: c: s: r: x: t:] o.a.s.c.c.SolrZkClient Using default ZkCredentialsInjector. ZkCredentialsInjector is not secure, it creates an empty list of credentials which leads to 'OPEN_ACL_UNSAFE' ACLs to Zookeeper nodes
2> 13981 INFO (TEST-ShardRoutingCustomTest.test-seed#[30BD3DD1974EB3A7]) [n: c: s: r: x: t:] o.a.s.c.c.ConnectionManager Waiting up to 30000ms for client to connect to ZooKeeper
2> 13997 INFO (zkConnectionManagerCallback-51-thread-1) [n: c: s: r: x: t:] o.a.s.c.c.ConnectionManager zkClient has connected
2> 13998 INFO (TEST-ShardRoutingCustomTest.test-seed#[30BD3DD1974EB3A7]) [n: c: s: r: x: t:] o.a.s.c.c.ConnectionManager Client is connected to ZooKeeper
2> 13999 WARN (TEST-ShardRoutingCustomTest.test-seed#[30BD3DD1974EB3A7]) [n: c: s: r: x: t:] o.a.s.c.c.SolrZkClient Using default ZkACLProvider. DefaultZkACLProvider is not secure, it creates 'OPEN_ACL_UNSAFE' ACLs to Zookeeper nodes
2> 14013 INFO (TEST-ShardRoutingCustomTest.test-seed#[30BD3DD1974EB3A7]) [n: c: s: r: x: t:] o.a.s.c.ZkTestServer put /tmp/src/solr/solr/core/build/resources/test/solr/collection1/conf/solrconfig-tlog.xml to /configs/conf1/solrconfig.xml
2> 14022 INFO (TEST-ShardRoutingCustomTest.test-seed#[30BD3DD1974EB3A7]) [n: c: s: r: x: t:] o.a.s.c.ZkTestServer put /tmp/src/solr/solr/core/build/resources/test/solr/collection1/conf/schema15.xml to /configs/conf1/schema.xml
2> 14026 INFO (TEST-ShardRoutingCustomTest.test-seed#[30BD3DD1974EB3A7]) [n: c: s: r: x: t:] o.a.s.c.ZkTestServer put /tmp/src/solr/solr/core/build/resources/test/solr/collection1/conf/solrconfig.snippet.randomindexconfig.xml to /configs/conf1/solrconfig.snippet.randomindexconfig.xml
2> 14032 INFO (TEST-ShardRoutingCustomTest.test-seed#[30BD3DD1974EB3A7]) [n: c: s: r: x: t:] o.a.s.c.ZkTestServer put /tmp/src/solr/solr/core/build/resources/test/solr/collection1/conf/stopwords.txt to /configs/conf1/stopwords.txt
2> 14037 INFO (TEST-ShardRoutingCustomTest.test-seed#[30BD3DD1974EB3A7]) [n: c: s: r: x: t:] o.a.s.c.ZkTestServer put /tmp/src/solr/solr/core/build/resources/test/solr/collection1/conf/protwords.txt to /configs/conf1/protwords.txt
2> 14045 INFO (TEST-ShardRoutingCustomTest.test-seed#[30BD3DD1974EB3A7]) [n: c: s: r: x: t:] o.a.s.c.ZkTestServer put /tmp/src/solr/solr/core/build/resources/test/solr/collection1/conf/currency.xml to /configs/conf1/currency.xml
2> 14050 INFO (TEST-ShardRoutingCustomTest.test-seed#[30BD3DD1974EB3A7]) [n: c: s: r: x: t:] o.a.s.c.ZkTestServer put /tmp/src/solr/solr/core/build/resources/test/solr/collection1/conf/enumsConfig.xml to /configs/conf1/enumsConfig.xml
2> 14056 INFO (TEST-ShardRoutingCustomTest.test-seed#[30BD3DD1974EB3A7]) [n: c: s: r: x: t:] o.a.s.c.ZkTestServer put /tmp/src/solr/solr/core/build/resources/test/solr/collection1/conf/open-exchange-rates.json to /configs/conf1/open-exchange-rates.json
2> 14074 INFO (TEST-ShardRoutingCustomTest.test-seed#[30BD3DD1974EB3A7]) [n: c: s: r: x: t:] o.a.s.c.ZkTestServer put /tmp/src/solr/solr/core/build/resources/test/solr/collection1/conf/mapping-ISOLatin1Accent.txt to /configs/conf1/mapping-ISOLatin1Accent.txt
2> 14080 INFO (TEST-ShardRoutingCustomTest.test-seed#[30BD3DD1974EB3A7]) [n: c: s: r: x: t:] o.a.s.c.ZkTestServer put /tmp/src/solr/solr/core/build/resources/test/solr/collection1/conf/old_synonyms.txt to /configs/conf1/old_synonyms.txt
2> 14085 INFO (TEST-ShardRoutingCustomTest.test-seed#[30BD3DD1974EB3A7]) [n: c: s: r: x: t:] o.a.s.c.ZkTestServer put /tmp/src/solr/solr/core/build/resources/test/solr/collection1/conf/synonyms.txt to /configs/conf1/synonyms.txt
2> 14091 INFO (TEST-ShardRoutingCustomTest.test-seed#[30BD3DD1974EB3A7]) [n: c: s: r: x: t:] o.a.s.c.AbstractFullDistribZkTestBase Will use NRT replicas unless explicitly asked otherwise
2> 14815 INFO (TEST-ShardRoutingCustomTest.test-seed#[30BD3DD1974EB3A7]) [n: c: s: r: x: t:] o.a.s.e.JettySolrRunner Start Jetty (configured port=0, binding port=0)
2> 14815 INFO (TEST-ShardRoutingCustomTest.test-seed#[30BD3DD1974EB3A7]) [n: c: s: r: x: t:] o.a.s.e.JettySolrRunner Trying to start Jetty on port 0 try number 2 ...
2> 14816 INFO (TEST-ShardRoutingCustomTest.test-seed#[30BD3DD1974EB3A7]) [n: c: s: r: x: t:] o.e.j.s.Server jetty-10.0.19; built: 2023-12-15T20:38:32.477Z; git: 8492d1c78f122bb30cce20aecfa07e7283facd47; jvm 11.0.21+9
2> 14887 INFO (TEST-ShardRoutingCustomTest.test-seed#[30BD3DD1974EB3A7]) [n: c: s: r: x: t:] o.e.j.s.s.DefaultSessionIdManager Session workerName=node0
2> 14896 INFO (TEST-ShardRoutingCustomTest.test-seed#[30BD3DD1974EB3A7]) [n: c: s: r: x: t:] o.e.j.s.h.ContextHandler Started o.e.j.s.ServletContextHandler@28251bdc{/huqw/fr,file:///tmp/src/solr/solr/core/build/tmp/tests-cwd/,AVAILABLE}
2> 14897 INFO (TEST-ShardRoutingCustomTest.test-seed#[30BD3DD1974EB3A7]) [n: c: s: r: x: t:] o.e.j.s.AbstractConnector Started ServerConnector@134c6605{HTTP/1.1, (http/1.1, h2c)}{127.0.0.1:40305}
2> 14898 INFO (TEST-ShardRoutingCustomTest.test-seed#[30BD3DD1974EB3A7]) [n: c: s: r: x: t:] o.e.j.s.Server Started Server@5658d4ed{STARTING}[10.0.19,sto=0] @14985ms
2> 14899 ERROR (TEST-ShardRoutingCustomTest.test-seed#[30BD3DD1974EB3A7]) [n: c: s: r: x: t:] o.a.s.u.StartupLoggingUtils Missing Java Option solr.log.dir. Logging may be missing or incomplete.
2> 14899 INFO (TEST-ShardRoutingCustomTest.test-seed#[30BD3DD1974EB3A7]) [n: c: s: r: x: t:] o.a.s.s.CoreContainerProvider Using logger factory org.apache.logging.slf4j.Log4jLoggerFactory
2> 14899 INFO (TEST-ShardRoutingCustomTest.test-seed#[30BD3DD1974EB3A7]) [n: c: s: r: x: t:] o.a.s.s.CoreContainerProvider ___ _ Welcome to Apache Solr™ version 9.6.0
2> 14900 INFO (TEST-ShardRoutingCustomTest.test-seed#[30BD3DD1974EB3A7]) [n: c: s: r: x: t:] o.a.s.s.CoreContainerProvider / __| ___| |_ _ Starting in cloud mode on port null
2> 14900 INFO (TEST-ShardRoutingCustomTest.test-seed#[30BD3DD1974EB3A7]) [n: c: s: r: x: t:] o.a.s.s.CoreContainerProvider \__ \/ _ \ | '_| Install dir: /tmp/src/solr/solr
2> 14900 INFO (TEST-ShardRoutingCustomTest.test-seed#[30BD3DD1974EB3A7]) [n: c: s: r: x: t:] o.a.s.s.CoreContainerProvider |___/\___/_|_| Start time: 2024-02-03T20:56:16.130617Z
2> 14902 INFO (TEST-ShardRoutingCustomTest.test-seed#[30BD3DD1974EB3A7]) [n: c: s: r: x: t:] o.a.s.s.CoreContainerProvider Solr Home: /tmp/src/solr/solr/core/build/tmp/tests-tmp/solr.cloud.ShardRoutingCustomTest_30BD3DD1974EB3A7-001/control-001 (source: servlet config: solr.solr.home)
2> 14903 WARN (TEST-ShardRoutingCustomTest.test-seed#[30BD3DD1974EB3A7]) [n: c: s: r: x: t:] o.a.s.c.c.SolrZkClient Using default ZkCredentialsInjector. ZkCredentialsInjector is not secure, it creates an empty list of credentials which leads to 'OPEN_ACL_UNSAFE' ACLs to Zookeeper nodes
2> 14908 INFO (TEST-ShardRoutingCustomTest.test-seed#[30BD3DD1974EB3A7]) [n: c: s: r: x: t:] o.a.s.c.c.ConnectionManager Waiting up to 30000ms for client to connect to ZooKeeper
2> 14942 INFO (zkConnectionManagerCallback-53-thread-1) [n: c: s: r: x: t:] o.a.s.c.c.ConnectionManager zkClient has connected
2> 14943 INFO (TEST-ShardRoutingCustomTest.test-seed#[30BD3DD1974EB3A7]) [n: c: s: r: x: t:] o.a.s.c.c.ConnectionManager Client is connected to ZooKeeper
2> 14943 WARN (TEST-ShardRoutingCustomTest.test-seed#[30BD3DD1974EB3A7]) [n: c: s: r: x: t:] o.a.s.c.c.SolrZkClient Using default ZkACLProvider. DefaultZkACLProvider is not secure, it creates 'OPEN_ACL_UNSAFE' ACLs to Zookeeper nodes
2> 15058 INFO (TEST-ShardRoutingCustomTest.test-seed#[30BD3DD1974EB3A7]) [n: c: s: r: x: t:] o.a.s.c.NodeConfig Loading solr.xml from SolrHome (not found in ZooKeeper)
2> 15059 INFO (TEST-ShardRoutingCustomTest.test-seed#[30BD3DD1974EB3A7]) [n: c: s: r: x: t:] o.a.s.c.SolrXmlConfig Loading solr.xml from /tmp/src/solr/solr/core/build/tmp/tests-tmp/solr.cloud.ShardRoutingCustomTest_30BD3DD1974EB3A7-001/control-001/solr.xml
2> 16293 INFO (TEST-ShardRoutingCustomTest.test-seed#[30BD3DD1974EB3A7]) [n: c: s: r: x: t:] o.a.s.u.t.SimplePropagator Always-on trace id generation enabled.
2> 16342 INFO (TEST-ShardRoutingCustomTest.test-seed#[30BD3DD1974EB3A7]) [n: c: s: r: x: t:] o.a.s.c.ZkContainer Zookeeper client=127.0.0.1:39569/solr
2> 16343 WARN (TEST-ShardRoutingCustomTest.test-seed#[30BD3DD1974EB3A7]) [n: c: s: r: x: t:] o.a.s.c.c.SolrZkClient Using default ZkCredentialsInjector. ZkCredentialsInjector is not secure, it creates an empty list of credentials which leads to 'OPEN_ACL_UNSAFE' ACLs to Zookeeper nodes
2> 16358 INFO (TEST-ShardRoutingCustomTest.test-seed#[30BD3DD1974EB3A7]) [n: c: s: r: x: t:] o.a.s.c.c.ConnectionManager Waiting up to 15000ms for client to connect to ZooKeeper
2> 16368 INFO (zkConnectionManagerCallback-63-thread-1) [n: c: s: r: x: t:] o.a.s.c.c.ConnectionManager zkClient has connected
2> 16369 INFO (TEST-ShardRoutingCustomTest.test-seed#[30BD3DD1974EB3A7]) [n: c: s: r: x: t:] o.a.s.c.c.ConnectionManager Client is connected to ZooKeeper
2> 16369 WARN (TEST-ShardRoutingCustomTest.test-seed#[30BD3DD1974EB3A7]) [n: c: s: r: x: t:] o.a.s.c.c.SolrZkClient Using default ZkACLProvider. DefaultZkACLProvider is not secure, it creates 'OPEN_ACL_UNSAFE' ACLs to Zookeeper nodes
2> 16475 INFO (TEST-ShardRoutingCustomTest.test-seed#[30BD3DD1974EB3A7]) [n: c: s: r: x: t:] o.a.s.c.DistributedClusterStateUpdater Creating DistributedClusterStateUpdater with useDistributedStateUpdate=false. Solr will be using Overseer based cluster state updates.
2> 16499 INFO (TEST-ShardRoutingCustomTest.test-seed#[30BD3DD1974EB3A7]) [n:127.0.0.1:40305_huqw%2Ffr c: s: r: x: t:] o.a.s.c.c.ConnectionManager Waiting up to 15000ms for client to connect to ZooKeeper
2> 16507 INFO (zkConnectionManagerCallback-65-thread-1) [n: c: s: r: x: t:] o.a.s.c.c.ConnectionManager zkClient has connected
2> 16508 INFO (TEST-ShardRoutingCustomTest.test-seed#[30BD3DD1974EB3A7]) [n:127.0.0.1:40305_huqw%2Ffr c: s: r: x: t:] o.a.s.c.c.ConnectionManager Client is connected to ZooKeeper
2> 16631 WARN (TEST-ShardRoutingCustomTest.test-seed#[30BD3DD1974EB3A7]) [n:127.0.0.1:40305_huqw%2Ffr c: s: r: x: t:] o.a.s.c.ZkController Contents of zookeeper /security.json are world-readable; consider setting up ACLs as described in https://solr.apache.org/guide/solr/latest/deployment-guide/zookeeper-access-control.html
2> 16643 INFO (TEST-ShardRoutingCustomTest.test-seed#[30BD3DD1974EB3A7]) [n:127.0.0.1:40305_huqw%2Ffr c: s: r: x: t:] o.a.s.c.DistributedClusterStateUpdater Creating DistributedClusterStateUpdater with useDistributedStateUpdate=false. Solr will be using Overseer based cluster state updates.
2> 16672 INFO (TEST-ShardRoutingCustomTest.test-seed#[30BD3DD1974EB3A7]) [n:127.0.0.1:40305_huqw%2Ffr c: s: r: x: t:] o.a.s.c.OverseerElectionContext I am going to be the leader 127.0.0.1:40305_huqw%2Ffr
2> 16676 INFO (TEST-ShardRoutingCustomTest.test-seed#[30BD3DD1974EB3A7]) [n:127.0.0.1:40305_huqw%2Ffr c: s: r: x: t:] o.a.s.c.Overseer Overseer (id=72057618608357380-127.0.0.1:40305_huqw%2Ffr-n_0000000000) starting
2> 16711 INFO (TEST-ShardRoutingCustomTest.test-seed#[30BD3DD1974EB3A7]) [n:127.0.0.1:40305_huqw%2Ffr c: s: r: x: t:] o.a.s.c.ZkController Register node as live in ZooKeeper:/live_nodes/127.0.0.1:40305_huqw%2Ffr
2> 16711 INFO (OverseerStateUpdate-72057618608357380-127.0.0.1:40305_huqw%2Ffr-n_0000000000) [n:127.0.0.1:40305_huqw%2Ffr c: s: r: x: t:] o.a.s.c.Overseer Starting to work on the main queue : 127.0.0.1:40305_huqw%2Ffr
2> 16723 INFO (OverseerStateUpdate-72057618608357380-127.0.0.1:40305_huqw%2Ffr-n_0000000000) [n:127.0.0.1:40305_huqw%2Ffr c: s: r: x: t:] o.a.s.c.c.ZkStateReader Updated live nodes from ZooKeeper... (0) -> (1)
2> 16727 WARN (TEST-ShardRoutingCustomTest.test-seed#[30BD3DD1974EB3A7]) [n:127.0.0.1:40305_huqw%2Ffr c: s: r: x: t:] o.a.s.c.CoreContainer Not all security plugins configured! authentication=disabled authorization=disabled. Solr is only as secure as you make it. Consider configuring authentication/authorization before exposing Solr to users internal or external. See https://s.apache.org/solrsecurity for more info
2> 17096 INFO (TEST-ShardRoutingCustomTest.test-seed#[30BD3DD1974EB3A7]) [n:127.0.0.1:40305_huqw%2Ffr c: s: r: x: t:] o.a.s.c.CorePropertiesLocator Found 0 core definitions underneath /tmp/src/solr/solr/core/build/tmp/tests-tmp/solr.cloud.ShardRoutingCustomTest_30BD3DD1974EB3A7-001/control-001/cores
2> 17294 INFO (TEST-ShardRoutingCustomTest.test-seed#[30BD3DD1974EB3A7]) [n:127.0.0.1:40305_huqw%2Ffr c: s: r: x: t:] o.a.s.j.SolrRequestAuthorizer Creating a new SolrRequestAuthorizer
2> 17413 INFO (TEST-ShardRoutingCustomTest.test-seed#[30BD3DD1974EB3A7]) [n:127.0.0.1:40305_huqw%2Ffr c: s: r: x: t:] o.a.s.e.JettySolrRunner Jetty properties: {hostContext=/huqw/fr, solr.data.dir=/tmp/src/solr/solr/core/build/tmp/tests-tmp/solr.cloud.ShardRoutingCustomTest_30BD3DD1974EB3A7-001/tempDir-001/control/data, hostPort=40305, coreRootDirectory=/tmp/src/solr/solr/core/build/tmp/tests-tmp/solr.cloud.ShardRoutingCustomTest_30BD3DD1974EB3A7-001/control-001/cores, replicaType=NRT}
2> 17428 WARN (TEST-ShardRoutingCustomTest.test-seed#[30BD3DD1974EB3A7]) [n: c: s: r: x: t:] o.a.s.c.c.SolrZkClient Using default ZkCredentialsInjector. ZkCredentialsInjector is not secure, it creates an empty list of credentials which leads to 'OPEN_ACL_UNSAFE' ACLs to Zookeeper nodes
2> 17442 INFO (TEST-ShardRoutingCustomTest.test-seed#[30BD3DD1974EB3A7]) [n: c: s: r: x: t:] o.a.s.c.c.ConnectionManager Waiting up to 15000ms for client to connect to ZooKeeper
2> 17472 INFO (zkConnectionManagerCallback-78-thread-1) [n: c: s: r: x: t:] o.a.s.c.c.ConnectionManager zkClient has connected
2> 17473 INFO (TEST-ShardRoutingCustomTest.test-seed#[30BD3DD1974EB3A7]) [n: c: s: r: x: t:] o.a.s.c.c.ConnectionManager Client is connected to ZooKeeper
2> 17474 WARN (TEST-ShardRoutingCustomTest.test-seed#[30BD3DD1974EB3A7]) [n: c: s: r: x: t:] o.a.s.c.c.SolrZkClient Using default ZkACLProvider. DefaultZkACLProvider is not secure, it creates 'OPEN_ACL_UNSAFE' ACLs to Zookeeper nodes
2> 17478 INFO (TEST-ShardRoutingCustomTest.test-seed#[30BD3DD1974EB3A7]) [n: c: s: r: x: t:] o.a.s.c.c.ZkStateReader Updated live nodes from ZooKeeper... (0) -> (1)
2> 17482 INFO (TEST-ShardRoutingCustomTest.test-seed#[30BD3DD1974EB3A7]) [n: c: s: r: x: t:] o.a.s.c.s.i.ZkClientClusterStateProvider Cluster at 127.0.0.1:39569/solr ready
2> 18602 INFO (closeThreadPool-80-thread-2) [n: c: s: r: x: t:] o.e.j.s.Server Stopped Server@5658d4ed{STOPPING}[10.0.19,sto=0]
2> 18604 INFO (closeThreadPool-80-thread-2) [n: c: s: r: x: t:] o.e.j.s.AbstractConnector Stopped ServerConnector@134c6605{HTTP/1.1, (http/1.1, h2c)}{127.0.0.1:0}
2> 18605 INFO (closeThreadPool-80-thread-2) [n: c: s: r: x: t:] o.e.j.s.h.ContextHandler Stopped o.e.j.s.ServletContextHandler@28251bdc{/huqw/fr,file:///tmp/src/solr/solr/core/build/tmp/tests-cwd/,STOPPED}
2> 18624 INFO (closeThreadPool-80-thread-2) [n: c: s: r: x: t:] o.a.s.c.CoreContainer Shutting down CoreContainer instance=1796181193
2> 18624 INFO (closeThreadPool-80-thread-2) [n: c: s: r: x: t:] o.a.s.c.ZkController Remove node as live in ZooKeeper:/live_nodes/127.0.0.1:40305_huqw%2Ffr
2> 18626 INFO (closeThreadPool-80-thread-2) [n: c: s: r: x: t:] o.a.s.c.ZkController Publish this node as DOWN...
2> 18627 INFO (closeThreadPool-80-thread-2) [n: c: s: r: x: t:] o.a.s.c.ZkController Publish node=127.0.0.1:40305_huqw%2Ffr as DOWN
2> 18627 INFO (zkCallback-64-thread-1) [n: c: s: r: x: t:] o.a.s.c.c.ZkStateReader Updated live nodes from ZooKeeper... (1) -> (0)
2> 18666 INFO (closeThreadPool-80-thread-2) [n: c: s: r: x: t:] o.a.s.m.SolrMetricManager Closing metric reporters for registry=solr.node tag=null
2> 18715 INFO (closeThreadPool-80-thread-2) [n: c: s: r: x: t:] o.a.s.m.SolrMetricManager Closing metric reporters for registry=solr.jvm tag=null
2> 18728 INFO (closeThreadPool-80-thread-2) [n: c: s: r: x: t:] o.a.s.m.SolrMetricManager Closing metric reporters for registry=solr.jetty tag=null
2> 18729 INFO (closeThreadPool-80-thread-2) [n: c: s: r: x: t:] o.a.s.m.SolrMetricManager Closing metric reporters for registry=solr.cluster tag=null
2> 18742 INFO (closeThreadPool-83-thread-2) [n: c: s: r: x: t:] o.a.s.c.Overseer Overseer (id=72057618608357380-127.0.0.1:40305_huqw%2Ffr-n_0000000000) closing
2> 18742 INFO (OverseerStateUpdate-72057618608357380-127.0.0.1:40305_huqw%2Ffr-n_0000000000) [n:127.0.0.1:40305_huqw%2Ffr c: s: r: x: t:] o.a.s.c.Overseer Overseer Loop exiting : 127.0.0.1:40305_huqw%2Ffr
2> 18778 INFO (closeThreadPool-83-thread-1) [n: c: s: r: x: t:] o.a.s.c.Overseer Overseer (id=72057618608357380-127.0.0.1:40305_huqw%2Ffr-n_0000000000) closing
2> 18880 INFO (closeThreadPool-80-thread-2) [n: c: s: r: x: t:] o.a.s.c.Overseer Overseer (id=72057618608357380-127.0.0.1:40305_huqw%2Ffr-n_0000000000) closing
2> 18886 INFO (TEST-ShardRoutingCustomTest.test-seed#[30BD3DD1974EB3A7]) [n: c: s: r: x: t:] o.a.s.u.ErrorLogMuter Closing ErrorLogMuter-regex-4 after mutting 0 log messages
2> 18886 INFO (TEST-ShardRoutingCustomTest.test-seed#[30BD3DD1974EB3A7]) [n: c: s: r: x: t:] o.a.s.u.ErrorLogMuter Creating ErrorLogMuter-regex-5 for ERROR logs matching regex: ignore_exception
2> 18887 INFO (TEST-ShardRoutingCustomTest.test-seed#[30BD3DD1974EB3A7]) [n: c: s: r: x: t:] o.a.s.c.ZkTestServer Shutting down ZkTestServer.
2> 19096 WARN (ZkTestServer Run Thread) [n: c: s: r: x: t:] o.a.s.c.ZkTestServer Watch limit violations:
2> Maximum concurrent create/delete watches above limit:
2>
2> 2 /solr/aliases.json
2> 2 /solr/clusterprops.json
2>
2> Maximum concurrent children watches above limit:
2>
2> 4 /solr/live_nodes
2> 2 /solr/overseer/queue
2> 2 /solr/collections
2>
> org.apache.solr.client.solrj.impl.BaseHttpSolrClient$RemoteSolrException: Error from server at http://127.0.0.1:40305/huqw: Expected mime type in [application/octet-stream, application/vnd.apache.solr.javabin] but got text/html. <html>
> <head>
> <meta http-equiv="Content-Type" content="text/html;charset=ISO-8859-1"/>
> <title>Error 404 Not Found</title>
> </head>
> <body><h2>HTTP ERROR 404 Not Found</h2>
> <table>
> <tr><th>URI:</th><td>/huqw/admin/collections</td></tr>
> <tr><th>STATUS:</th><td>404</td></tr>
> <tr><th>MESSAGE:</th><td>Not Found</td></tr>
> <tr><th>SERVLET:</th><td>-</td></tr>
> </table>
> <hr/><a href="https://eclipse.org/jetty">Powered by Jetty:// 10.0.19</a><hr/>
>
> </body>
> </html>
> at __randomizedtesting.SeedInfo.seed([30BD3DD1974EB3A7:B8E9020B39B2DE5F]:0)
> at app//org.apache.solr.client.solrj.impl.HttpSolrClient.executeMethod(HttpSolrClient.java:692)
> at app//org.apache.solr.client.solrj.impl.HttpSolrClient.request(HttpSolrClient.java:267)
> at app//org.apache.solr.client.solrj.impl.HttpSolrClient.request(HttpSolrClient.java:246)
> at app//org.apache.solr.client.solrj.impl.LBSolrClient.doRequest(LBSolrClient.java:390)
> at app//org.apache.solr.client.solrj.impl.LBSolrClient.request(LBSolrClient.java:353)
> at app//org.apache.solr.client.solrj.impl.CloudSolrClient.sendRequest(CloudSolrClient.java:1193)
> at app//org.apache.solr.client.solrj.impl.CloudSolrClient.requestWithRetryOnStaleState(CloudSolrClient.java:892)
> at app//org.apache.solr.client.solrj.impl.CloudSolrClient.request(CloudSolrClient.java:820)
> at app//org.apache.solr.client.solrj.SolrRequest.process(SolrRequest.java:255)
> at app//org.apache.solr.client.solrj.SolrRequest.process(SolrRequest.java:270)
> at app//org.apache.solr.cloud.AbstractFullDistribZkTestBase.createServers(AbstractFullDistribZkTestBase.java:353)
> at app//org.apache.solr.BaseDistributedSearchTestCase$ShardsRepeatRule$ShardsFixedStatement.callStatement(BaseDistributedSearchTestCase.java:1152)
> at app//org.apache.solr.BaseDistributedSearchTestCase$ShardsRepeatRule$ShardsStatement.evaluate(BaseDistributedSearchTestCase.java:1125)
> at app//com.carrotsearch.randomizedtesting.rules.SystemPropertiesRestoreRule$1.evaluate(SystemPropertiesRestoreRule.java:80)
> at app//org.junit.rules.RunRules.evaluate(RunRules.java:20)
> at app//org.apache.lucene.tests.util.TestRuleSetupTeardownChained$1.evaluate(TestRuleSetupTeardownChained.java:48)
> at app//org.apache.lucene.tests.util.AbstractBeforeAfterRule$1.evaluate(AbstractBeforeAfterRule.java:43)
> at app//org.apache.lucene.tests.util.TestRuleThreadAndTestName$1.evaluate(TestRuleThreadAndTestName.java:45)
> at app//org.apache.lucene.tests.util.TestRuleIgnoreAfterMaxFailures$1.evaluate(TestRuleIgnoreAfterMaxFailures.java:60)
> at app//org.apache.lucene.tests.util.TestRuleMarkFailure$1.evaluate(TestRuleMarkFailure.java:44)
> at app//org.junit.rules.RunRules.evaluate(RunRules.java:20)
> at app//com.carrotsearch.randomizedtesting.rules.StatementAdapter.evaluate(StatementAdapter.java:36)
> at app//com.carrotsearch.randomizedtesting.ThreadLeakControl$StatementRunner.run(ThreadLeakControl.java:390)
> at app//com.carrotsearch.randomizedtesting.ThreadLeakControl.forkTimeoutingTask(ThreadLeakControl.java:843)
> at app//com.carrotsearch.randomizedtesting.ThreadLeakControl$3.evaluate(ThreadLeakControl.java:490)
> at app//com.carrotsearch.randomizedtesting.RandomizedRunner.runSingleTest(RandomizedRunner.java:955)
> at app//com.carrotsearch.randomizedtesting.RandomizedRunner$5.evaluate(RandomizedRunner.java:840)
> at app//com.carrotsearch.randomizedtesting.RandomizedRunner$6.evaluate(RandomizedRunner.java:891)
> at app//com.carrotsearch.randomizedtesting.RandomizedRunner$7.evaluate(RandomizedRunner.java:902)
> at app//com.carrotsearch.randomizedtesting.rules.StatementAdapter.evaluate(StatementAdapter.java:36)
> at app//com.carrotsearch.randomizedtesting.rules.StatementAdapter.evaluate(StatementAdapter.java:36)
> at app//org.apache.lucene.tests.util.AbstractBeforeAfterRule$1.evaluate(AbstractBeforeAfterRule.java:43)
> at app//org.apache.lucene.tests.util.AbstractBeforeAfterRule$1.evaluate(AbstractBeforeAfterRule.java:43)
> at app//com.carrotsearch.randomizedtesting.rules.SystemPropertiesRestoreRule$1.evaluate(SystemPropertiesRestoreRule.java:80)
> at app//org.junit.rules.RunRules.evaluate(RunRules.java:20)
> at app//org.apache.lucene.tests.util.AbstractBeforeAfterRule$1.evaluate(AbstractBeforeAfterRule.java:43)
> at app//com.carrotsearch.randomizedtesting.rules.StatementAdapter.evaluate(StatementAdapter.java:36)
> at app//org.apache.lucene.tests.util.TestRuleStoreClassName$1.evaluate(TestRuleStoreClassName.java:38)
> at app//com.carrotsearch.randomizedtesting.rules.NoShadowingOrOverridesOnMethodsRule$1.evaluate(NoShadowingOrOverridesOnMethodsRule.java:40)
> at app//com.carrotsearch.randomizedtesting.rules.NoShadowingOrOverridesOnMethodsRule$1.evaluate(NoShadowingOrOverridesOnMethodsRule.java:40)
> at app//com.carrotsearch.randomizedtesting.rules.StatementAdapter.evaluate(StatementAdapter.java:36)
> at app//com.carrotsearch.randomizedtesting.rules.StatementAdapter.evaluate(StatementAdapter.java:36)
> at app//org.apache.lucene.tests.util.TestRuleAssertionsRequired$1.evaluate(TestRuleAssertionsRequired.java:53)
> at app//org.apache.lucene.tests.util.AbstractBeforeAfterRule$1.evaluate(AbstractBeforeAfterRule.java:43)
> at app//org.apache.lucene.tests.util.TestRuleMarkFailure$1.evaluate(TestRuleMarkFailure.java:44)
> at app//org.apache.lucene.tests.util.TestRuleIgnoreAfterMaxFailures$1.evaluate(TestRuleIgnoreAfterMaxFailures.java:60)
> at app//org.apache.lucene.tests.util.TestRuleIgnoreTestSuites$1.evaluate(TestRuleIgnoreTestSuites.java:47)
> at app//org.junit.rules.RunRules.evaluate(RunRules.java:20)
> at app//com.carrotsearch.randomizedtesting.rules.StatementAdapter.evaluate(StatementAdapter.java:36)
> at app//com.carrotsearch.randomizedtesting.ThreadLeakControl$StatementRunner.run(ThreadLeakControl.java:390)
> at app//com.carrotsearch.randomizedtesting.ThreadLeakControl.lambda$forkTimeoutingTask$0(ThreadLeakControl.java:850)
> at java.base@11.0.21/java.lang.Thread.run(Thread.java:829)
2> NOTE: reproduce with: gradlew test --tests ShardRoutingCustomTest.test -Dtests.seed=30BD3DD1974EB3A7 -Dtests.locale=seh-MZ -Dtests.timezone=Asia/Ulaanbaatar -Dtests.asserts=true -Dtests.file.encoding=UTF-8
2> 19132 INFO (SUITE-ShardRoutingCustomTest-seed#[30BD3DD1974EB3A7]-worker) [n: c: s: r: x: t:] o.a.s.u.ErrorLogMuter Closing ErrorLogMuter-regex-5 after mutting 0 log messages
2> 19132 INFO (SUITE-ShardRoutingCustomTest-seed#[30BD3DD1974EB3A7]-worker) [n: c: s: r: x: t:] o.a.s.u.ErrorLogMuter Creating ErrorLogMuter-regex-6 for ERROR logs matching regex: ignore_exception
2> NOTE: leaving temporary files on disk at: /tmp/src/solr/solr/core/build/tmp/tests-tmp/solr.cloud.ShardRoutingCustomTest_30BD3DD1974EB3A7-001
2> NOTE: test params are: codec=Asserting(Lucene99): {}, docValues:{}, maxPointsInLeafNode=218, maxMBSortInHeap=6.514572108251129, sim=Asserting(RandomSimilarity(queryNorm=false): {}), locale=seh-MZ, timezone=Asia/Ulaanbaatar
2> NOTE: Linux 5.4.0-100-generic amd64/Eclipse Adoptium 11.0.21 (64-bit)/cpus=1,threads=2,free=285034096,total=336592896
2> NOTE: All tests run in this JVM: [AuthToolTest, ShardRoutingCustomTest]
org.apache.solr.cloud.LeaderFailureAfterFreshStartTest > test FAILED
org.apache.solr.client.solrj.impl.BaseHttpSolrClient$RemoteSolrException: Error from server at http://127.0.0.1:42665: Expected mime type in [application/octet-stream, application/vnd.apache.solr.javabin] but got text/html. <html>
<head>
<meta http-equiv="Content-Type" content="text/html;charset=ISO-8859-1"/>
<title>Error 404 Not Found</title>
</head>
<body><h2>HTTP ERROR 404 Not Found</h2>
<table>
<tr><th>URI:</th><td>/admin/collections</td></tr>
<tr><th>STATUS:</th><td>404</td></tr>
<tr><th>MESSAGE:</th><td>Not Found</td></tr>
<tr><th>SERVLET:</th><td>-</td></tr>
</table>
<hr/><a href="https://eclipse.org/jetty">Powered by Jetty:// 10.0.19</a><hr/>
</body>
</html>
at __randomizedtesting.SeedInfo.seed([30BD3DD1974EB3A7:B8E9020B39B2DE5F]:0)
at app//org.apache.solr.client.solrj.impl.HttpSolrClient.executeMethod(HttpSolrClient.java:692)
at app//org.apache.solr.client.solrj.impl.HttpSolrClient.request(HttpSolrClient.java:267)
at app//org.apache.solr.client.solrj.impl.HttpSolrClient.request(HttpSolrClient.java:246)
at app//org.apache.solr.client.solrj.impl.LBSolrClient.doRequest(LBSolrClient.java:390)
at app//org.apache.solr.client.solrj.impl.LBSolrClient.request(LBSolrClient.java:353)
at app//org.apache.solr.client.solrj.impl.CloudSolrClient.sendRequest(CloudSolrClient.java:1193)
at app//org.apache.solr.client.solrj.impl.CloudSolrClient.requestWithRetryOnStaleState(CloudSolrClient.java:892)
at app//org.apache.solr.client.solrj.impl.CloudSolrClient.request(CloudSolrClient.java:820)
at app//org.apache.solr.client.solrj.SolrRequest.process(SolrRequest.java:255)
at app//org.apache.so
[...truncated too long message...]
andler.TestSystemCollAutoCreate.testAutoCreate" -Ptests.jvms=96 "-Ptests.jvmargs=-XX:TieredStopAtLevel=1 -XX:+UseParallelGC -XX:ActiveProcessorCount=1 -XX:ReservedCodeCacheSize=120m" -Ptests.seed=30BD3DD1974EB3A7 -Ptests.file.encoding=ISO-8859-1
- org.apache.solr.cloud.MultiThreadedOCPTest.testLongAndShortRunningParallelApiCalls (:solr:core)
Test output: /tmp/src/solr/solr/core/build/test-results/test/outputs/OUTPUT-org.apache.solr.cloud.MultiThreadedOCPTest.txt
Reproduce with: gradlew :solr:core:test --tests "org.apache.solr.cloud.MultiThreadedOCPTest.testLongAndShortRunningParallelApiCalls" -Ptests.jvms=96 "-Ptests.jvmargs=-XX:TieredStopAtLevel=1 -XX:+UseParallelGC -XX:ActiveProcessorCount=1 -XX:ReservedCodeCacheSize=120m" -Ptests.seed=30BD3DD1974EB3A7 -Ptests.file.encoding=ISO-8859-1
- org.apache.solr.schema.TestCloudManagedSchema.test (:solr:core)
Test output: /tmp/src/solr/solr/core/build/test-results/test/outputs/OUTPUT-org.apache.solr.schema.TestCloudManagedSchema.txt
Reproduce with: gradlew :solr:core:test --tests "org.apache.solr.schema.TestCloudManagedSchema.test" -Ptests.jvms=96 "-Ptests.jvmargs=-XX:TieredStopAtLevel=1 -XX:+UseParallelGC -XX:ActiveProcessorCount=1 -XX:ReservedCodeCacheSize=120m" -Ptests.seed=30BD3DD1974EB3A7 -Ptests.file.encoding=ISO-8859-1
- org.apache.solr.cloud.TestCloudPivotFacet.test (:solr:core)
Test output: /tmp/src/solr/solr/core/build/test-results/test/outputs/OUTPUT-org.apache.solr.cloud.TestCloudPivotFacet.txt
Reproduce with: gradlew :solr:core:test --tests "org.apache.solr.cloud.TestCloudPivotFacet.test" -Ptests.jvms=96 "-Ptests.jvmargs=-XX:TieredStopAtLevel=1 -XX:+UseParallelGC -XX:ActiveProcessorCount=1 -XX:ReservedCodeCacheSize=120m" -Ptests.seed=30BD3DD1974EB3A7 -Ptests.file.encoding=ISO-8859-1
- org.apache.solr.cloud.MultiThreadedOCPTest.testTaskExclusivity (:solr:core)
Test output: /tmp/src/solr/solr/core/build/test-results/test/outputs/OUTPUT-org.apache.solr.cloud.MultiThreadedOCPTest.txt
Reproduce with: gradlew :solr:core:test --tests "org.apache.solr.cloud.MultiThreadedOCPTest.testTaskExclusivity" -Ptests.jvms=96 "-Ptests.jvmargs=-XX:TieredStopAtLevel=1 -XX:+UseParallelGC -XX:ActiveProcessorCount=1 -XX:ReservedCodeCacheSize=120m" -Ptests.seed=30BD3DD1974EB3A7 -Ptests.file.encoding=ISO-8859-1
- org.apache.solr.handler.TestSolrConfigHandlerConcurrent.test (:solr:core)
Test output: /tmp/src/solr/solr/core/build/test-results/test/outputs/OUTPUT-org.apache.solr.handler.TestSolrConfigHandlerConcurrent.txt
Reproduce with: gradlew :solr:core:test --tests "org.apache.solr.handler.TestSolrConfigHandlerConcurrent.test" -Ptests.jvms=96 "-Ptests.jvmargs=-XX:TieredStopAtLevel=1 -XX:+UseParallelGC -XX:ActiveProcessorCount=1 -XX:ReservedCodeCacheSize=120m" -Ptests.seed=30BD3DD1974EB3A7 -Ptests.file.encoding=ISO-8859-1
- org.apache.solr.update.TestInPlaceUpdatesDistrib.test (:solr:core)
Test output: /tmp/src/solr/solr/core/build/test-results/test/outputs/OUTPUT-org.apache.solr.update.TestInPlaceUpdatesDistrib.txt
Reproduce with: gradlew :solr:core:test --tests "org.apache.solr.update.TestInPlaceUpdatesDistrib.test" -Ptests.jvms=96 "-Ptests.jvmargs=-XX:TieredStopAtLevel=1 -XX:+UseParallelGC -XX:ActiveProcessorCount=1 -XX:ReservedCodeCacheSize=120m" -Ptests.seed=30BD3DD1974EB3A7 -Ptests.file.encoding=ISO-8859-1
- org.apache.solr.cloud.TestStressInPlaceUpdates.stressTest (:solr:core)
Test output: /tmp/src/solr/solr/core/build/test-results/test/outputs/OUTPUT-org.apache.solr.cloud.TestStressInPlaceUpdates.txt
Reproduce with: gradlew :solr:core:test --tests "org.apache.solr.cloud.TestStressInPlaceUpdates.stressTest" -Ptests.jvms=96 "-Ptests.jvmargs=-XX:TieredStopAtLevel=1 -XX:+UseParallelGC -XX:ActiveProcessorCount=1 -XX:ReservedCodeCacheSize=120m" -Ptests.seed=30BD3DD1974EB3A7 -Ptests.file.encoding=ISO-8859-1
- org.apache.solr.cloud.HttpPartitionOnCommitTest.test (:solr:core)
Test output: /tmp/src/solr/solr/core/build/test-results/test/outputs/OUTPUT-org.apache.solr.cloud.HttpPartitionOnCommitTest.txt
Reproduce with: gradlew :solr:core:test --tests "org.apache.solr.cloud.HttpPartitionOnCommitTest.test" -Ptests.jvms=96 "-Ptests.jvmargs=-XX:TieredStopAtLevel=1 -XX:+UseParallelGC -XX:ActiveProcessorCount=1 -XX:ReservedCodeCacheSize=120m" -Ptests.seed=30BD3DD1974EB3A7 -Ptests.file.encoding=ISO-8859-1
- org.apache.solr.handler.TestSolrConfigHandlerCloud.test (:solr:core)
Test output: /tmp/src/solr/solr/core/build/test-results/test/outputs/OUTPUT-org.apache.solr.handler.TestSolrConfigHandlerCloud.txt
Reproduce with: gradlew :solr:core:test --tests "org.apache.solr.handler.TestSolrConfigHandlerCloud.test" -Ptests.jvms=96 "-Ptests.jvmargs=-XX:TieredStopAtLevel=1 -XX:+UseParallelGC -XX:ActiveProcessorCount=1 -XX:ReservedCodeCacheSize=120m" -Ptests.seed=30BD3DD1974EB3A7 -Ptests.file.encoding=ISO-8859-1
- org.apache.solr.handler.TestConfigReload.test (:solr:core)
Test output: /tmp/src/solr/solr/core/build/test-results/test/outputs/OUTPUT-org.apache.solr.handler.TestConfigReload.txt
Reproduce with: gradlew :solr:core:test --tests "org.apache.solr.handler.TestConfigReload.test" -Ptests.jvms=96 "-Ptests.jvmargs=-XX:TieredStopAtLevel=1 -XX:+UseParallelGC -XX:ActiveProcessorCount=1 -XX:ReservedCodeCacheSize=120m" -Ptests.seed=30BD3DD1974EB3A7 -Ptests.file.encoding=ISO-8859-1
- org.apache.solr.security.TestAuthorizationFramework.authorizationFrameworkTest (:solr:core)
Test output: /tmp/src/solr/solr/core/build/test-results/test/outputs/OUTPUT-org.apache.solr.security.TestAuthorizationFramework.txt
Reproduce with: gradlew :solr:core:test --tests "org.apache.solr.security.TestAuthorizationFramework.authorizationFrameworkTest" -Ptests.jvms=96 "-Ptests.jvmargs=-XX:TieredStopAtLevel=1 -XX:+UseParallelGC -XX:ActiveProcessorCount=1 -XX:ReservedCodeCacheSize=120m" -Ptests.seed=30BD3DD1974EB3A7 -Ptests.file.encoding=ISO-8859-1
- org.apache.solr.handler.component.TestTrackingShardHandlerFactory.testRequestTracking (:solr:core)
Test output: /tmp/src/solr/solr/core/build/test-results/test/outputs/OUTPUT-org.apache.solr.handler.component.TestTrackingShardHandlerFactory.txt
Reproduce with: gradlew :solr:core:test --tests "org.apache.solr.handler.component.TestTrackingShardHandlerFactory.testRequestTracking" -Ptests.jvms=96 "-Ptests.jvmargs=-XX:TieredStopAtLevel=1 -XX:+UseParallelGC -XX:ActiveProcessorCount=1 -XX:ReservedCodeCacheSize=120m" -Ptests.seed=30BD3DD1974EB3A7 -Ptests.file.encoding=ISO-8859-1
- org.apache.solr.schema.TestCloudSchemaless.test (:solr:core)
Test output: /tmp/src/solr/solr/core/build/test-results/test/outputs/OUTPUT-org.apache.solr.schema.TestCloudSchemaless.txt
Reproduce with: gradlew :solr:core:test --tests "org.apache.solr.schema.TestCloudSchemaless.test" -Ptests.jvms=96 "-Ptests.jvmargs=-XX:TieredStopAtLevel=1 -XX:+UseParallelGC -XX:ActiveProcessorCount=1 -XX:ReservedCodeCacheSize=120m" -Ptests.seed=30BD3DD1974EB3A7 -Ptests.file.encoding=ISO-8859-1
- org.apache.solr.handler.TestBlobHandler.doBlobHandlerTest (:solr:core)
Test output: /tmp/src/solr/solr/core/build/test-results/test/outputs/OUTPUT-org.apache.solr.handler.TestBlobHandler.txt
Reproduce with: gradlew :solr:core:test --tests "org.apache.solr.handler.TestBlobHandler.doBlobHandlerTest" -Ptests.jvms=96 "-Ptests.jvmargs=-XX:TieredStopAtLevel=1 -XX:+UseParallelGC -XX:ActiveProcessorCount=1 -XX:ReservedCodeCacheSize=120m" -Ptests.seed=30BD3DD1974EB3A7 -Ptests.file.encoding=ISO-8859-1
- org.apache.solr.schema.TestBulkSchemaConcurrent.test (:solr:core)
Test output: /tmp/src/solr/solr/core/build/test-results/test/outputs/OUTPUT-org.apache.solr.schema.TestBulkSchemaConcurrent.txt
Reproduce with: gradlew :solr:core:test --tests "org.apache.solr.schema.TestBulkSchemaConcurrent.test" -Ptests.jvms=96 "-Ptests.jvmargs=-XX:TieredStopAtLevel=1 -XX:+UseParallelGC -XX:ActiveProcessorCount=1 -XX:ReservedCodeCacheSize=120m" -Ptests.seed=30BD3DD1974EB3A7 -Ptests.file.encoding=ISO-8859-1
WARNING: there were unreferenced files under license folder:
- /tmp/src/solr/solr/licenses/jakarta.inject-2.6.1.jar.sha1
FAILURE: Build completed with 2 failures.
1: Task failed with an exception.
-----------
* What went wrong:
Execution failed for task ':solr:modules:hdfs:test'.
> There were failing tests. See the results at: file:///tmp/src/solr/solr/modules/hdfs/build/test-results/test/
* Try:
> Run with --scan to get full insights.
==============================================================================
2: Task failed with an exception.
-----------
* What went wrong:
Execution failed for task ':solr:core:test'.
> There were failing tests. See the results at: file:///tmp/src/solr/solr/core/build/test-results/test/
* Try:
> Run with --scan to get full insights.
==============================================================================
BUILD FAILED in 7m 58s
670 actionable tasks: 668 executed, 2 up-to-date
[0m[?12l[?25h
------------------------------------------------------------------------
Build Failed: returned 1
Total time: 8m21s
------------------------------------------------------------------------
+ status=1
+ ./crave pull '**/build/**/test/TEST-*.xml'
+ ./crave pull '**/*.events'
+ ./crave pull 'heapdumps/**'
Error: rsync: [sender] change_dir "/tmp/src/solr/heapdumps" failed: No such file or directory (2)
rsync error: some files/attrs were not transferred (see previous errors) (code 23) at main.c(1675) [Receiver=3.1.2]
rsync: [Receiver] write error: Broken pipe (32)
+ ./crave pull '**/hs_err_pid*'
+ exit 1
Build step 'Execute shell' marked build as failure
Archiving artifacts
Recording test results
ERROR: Step ‘Publish JUnit test result report’ failed: No test report files were found. Configuration error?
Email was triggered for: Failure - Any
Sending email for trigger: Failure - Any
[JENKINS] Solr » Solr-Check-9.x (Crave) - Build # 6243 - Still Failing!
Posted by Apache Jenkins Server <je...@builds.apache.org>.
Build: https://ci-builds.apache.org/job/Solr/job/Solr-Check-9.x%20(Crave)/6243/
No tests ran.
Build Log:
[...truncated 15524 lines...]
ERROR: The following test(s) have failed:
- org.apache.solr.hdfs.index.CheckHdfsIndexTest.doTest (:solr:modules:hdfs)
Test output: /tmp/src/solr/solr/modules/hdfs/build/test-results/test/outputs/OUTPUT-org.apache.solr.hdfs.index.CheckHdfsIndexTest.txt
Reproduce with: gradlew :solr:modules:hdfs:test --tests "org.apache.solr.hdfs.index.CheckHdfsIndexTest.doTest" -Ptests.jvms=96 "-Ptests.jvmargs=-XX:TieredStopAtLevel=1 -XX:+UseParallelGC -XX:ActiveProcessorCount=1 -XX:ReservedCodeCacheSize=120m" -Ptests.seed=9D5810039CB9F83E -Ptests.file.encoding=UTF-8
- org.apache.solr.hdfs.index.CheckHdfsIndexTest.testChecksumsOnly (:solr:modules:hdfs)
Test output: /tmp/src/solr/solr/modules/hdfs/build/test-results/test/outputs/OUTPUT-org.apache.solr.hdfs.index.CheckHdfsIndexTest.txt
Reproduce with: gradlew :solr:modules:hdfs:test --tests "org.apache.solr.hdfs.index.CheckHdfsIndexTest.testChecksumsOnly" -Ptests.jvms=96 "-Ptests.jvmargs=-XX:TieredStopAtLevel=1 -XX:+UseParallelGC -XX:ActiveProcessorCount=1 -XX:ReservedCodeCacheSize=120m" -Ptests.seed=9D5810039CB9F83E -Ptests.file.encoding=UTF-8
- org.apache.solr.hdfs.index.CheckHdfsIndexTest.testChecksumsOnlyVerbose (:solr:modules:hdfs)
Test output: /tmp/src/solr/solr/modules/hdfs/build/test-results/test/outputs/OUTPUT-org.apache.solr.hdfs.index.CheckHdfsIndexTest.txt
Reproduce with: gradlew :solr:modules:hdfs:test --tests "org.apache.solr.hdfs.index.CheckHdfsIndexTest.testChecksumsOnlyVerbose" -Ptests.jvms=96 "-Ptests.jvmargs=-XX:TieredStopAtLevel=1 -XX:+UseParallelGC -XX:ActiveProcessorCount=1 -XX:ReservedCodeCacheSize=120m" -Ptests.seed=9D5810039CB9F83E -Ptests.file.encoding=UTF-8
- org.apache.solr.hdfs.index.CheckHdfsIndexTest.testDeletedDocs (:solr:modules:hdfs)
Test output: /tmp/src/solr/solr/modules/hdfs/build/test-results/test/outputs/OUTPUT-org.apache.solr.hdfs.index.CheckHdfsIndexTest.txt
Reproduce with: gradlew :solr:modules:hdfs:test --tests "org.apache.solr.hdfs.index.CheckHdfsIndexTest.testDeletedDocs" -Ptests.jvms=96 "-Ptests.jvmargs=-XX:TieredStopAtLevel=1 -XX:+UseParallelGC -XX:ActiveProcessorCount=1 -XX:ReservedCodeCacheSize=120m" -Ptests.seed=9D5810039CB9F83E -Ptests.file.encoding=UTF-8
- org.apache.solr.cloud.SolrCloudExampleTest.testLoadDocsIntoGettingStartedCollection (:solr:core)
Test output: /tmp/src/solr/solr/core/build/test-results/test/outputs/OUTPUT-org.apache.solr.cloud.SolrCloudExampleTest.txt
Reproduce with: gradlew :solr:core:test --tests "org.apache.solr.cloud.SolrCloudExampleTest.testLoadDocsIntoGettingStartedCollection" -Ptests.jvms=96 "-Ptests.jvmargs=-XX:TieredStopAtLevel=1 -XX:+UseParallelGC -XX:ActiveProcessorCount=1 -XX:ReservedCodeCacheSize=120m" -Ptests.seed=9D5810039CB9F83E -Ptests.file.encoding=UTF-8
- org.apache.solr.cloud.api.collections.TestCollectionAPI.testCreateCollectionBooleanValues (:solr:core)
Test output: /tmp/src/solr/solr/core/build/test-results/test/outputs/OUTPUT-org.apache.solr.cloud.api.collections.TestCollectionAPI.txt
Reproduce with: gradlew :solr:core:test --tests "org.apache.solr.cloud.api.collections.TestCollectionAPI.testCreateCollectionBooleanValues" -Ptests.jvms=96 "-Ptests.jvmargs=-XX:TieredStopAtLevel=1 -XX:+UseParallelGC -XX:ActiveProcessorCount=1 -XX:ReservedCodeCacheSize=120m" -Ptests.seed=9D5810039CB9F83E -Ptests.file.encoding=UTF-8
- org.apache.solr.cloud.RollingRestartTest.test (:solr:core)
Test output: /tmp/src/solr/solr/core/build/test-results/test/outputs/OUTPUT-org.apache.solr.cloud.RollingRestartTest.txt
Reproduce with: gradlew :solr:core:test --tests "org.apache.solr.cloud.RollingRestartTest.test" -Ptests.jvms=96 "-Ptests.jvmargs=-XX:TieredStopAtLevel=1 -XX:+UseParallelGC -XX:ActiveProcessorCount=1 -XX:ReservedCodeCacheSize=120m" -Ptests.seed=9D5810039CB9F83E -Ptests.file.encoding=UTF-8
- org.apache.solr.cloud.TestDistribDocBasedVersion.test (:solr:core)
Test output: /tmp/src/solr/solr/core/build/test-results/test/outputs/OUTPUT-org.apache.solr.cloud.TestDistribDocBasedVersion.txt
Reproduce with: gradlew :solr:core:test --tests "org.apache.solr.cloud.TestDistribDocBasedVersion.test" -Ptests.jvms=96 "-Ptests.jvmargs=-XX:TieredStopAtLevel=1 -XX:+UseParallelGC -XX:ActiveProcessorCount=1 -XX:ReservedCodeCacheSize=120m" -Ptests.seed=9D5810039CB9F83E -Ptests.file.encoding=UTF-8
- org.apache.solr.cloud.DistribCursorPagingTest.test (:solr:core)
Test output: /tmp/src/solr/solr/core/build/test-results/test/outputs/OUTPUT-org.apache.solr.cloud.DistribCursorPagingTest.txt
Reproduce with: gradlew :solr:core:test --tests "org.apache.solr.cloud.DistribCursorPagingTest.test" -Ptests.jvms=96 "-Ptests.jvmargs=-XX:TieredStopAtLevel=1 -XX:+UseParallelGC -XX:ActiveProcessorCount=1 -XX:ReservedCodeCacheSize=120m" -Ptests.seed=9D5810039CB9F83E -Ptests.file.encoding=UTF-8
- org.apache.solr.cloud.BasicDistributedZkTest.test (:solr:core)
Test output: /tmp/src/solr/solr/core/build/test-results/test/outputs/OUTPUT-org.apache.solr.cloud.BasicDistributedZkTest.txt
Reproduce with: gradlew :solr:core:test --tests "org.apache.solr.cloud.BasicDistributedZkTest.test" -Ptests.jvms=96 "-Ptests.jvmargs=-XX:TieredStopAtLevel=1 -XX:+UseParallelGC -XX:ActiveProcessorCount=1 -XX:ReservedCodeCacheSize=120m" -Ptests.seed=9D5810039CB9F83E -Ptests.file.encoding=UTF-8
- org.apache.solr.cloud.ShardRoutingCustomTest.test (:solr:core)
Test output: /tmp/src/solr/solr/core/build/test-results/test/outputs/OUTPUT-org.apache.solr.cloud.ShardRoutingCustomTest.txt
Reproduce with: gradlew :solr:core:test --tests "org.apache.solr.cloud.ShardRoutingCustomTest.test" -Ptests.jvms=96 "-Ptests.jvmargs=-XX:TieredStopAtLevel=1 -XX:+UseParallelGC -XX:ActiveProcessorCount=1 -XX:ReservedCodeCacheSize=120m" -Ptests.seed=9D5810039CB9F83E -Ptests.file.encoding=UTF-8
- org.apache.solr.cloud.BasicDistributedZk2Test.test (:solr:core)
Test output: /tmp/src/solr/solr/core/build/test-results/test/outputs/OUTPUT-org.apache.solr.cloud.BasicDistributedZk2Test.txt
Reproduce with: gradlew :solr:core:test --tests "org.apache.solr.cloud.BasicDistributedZk2Test.test" -Ptests.jvms=96 "-Ptests.jvmargs=-XX:TieredStopAtLevel=1 -XX:+UseParallelGC -XX:ActiveProcessorCount=1 -XX:ReservedCodeCacheSize=120m" -Ptests.seed=9D5810039CB9F83E -Ptests.file.encoding=UTF-8
- org.apache.solr.cloud.api.collections.TestCollectionAPI.testRecreateCollectionAfterFailure (:solr:core)
Test output: /tmp/src/solr/solr/core/build/test-results/test/outputs/OUTPUT-org.apache.solr.cloud.api.collections.TestCollectionAPI.txt
Reproduce with: gradlew :solr:core:test --tests "org.apache.solr.cloud.api.collections.TestCollectionAPI.testRecreateCollectionAfterFailure" -Ptests.jvms=96 "-Ptests.jvmargs=-XX:TieredStopAtLevel=1 -XX:+UseParallelGC -XX:ActiveProcessorCount=1 -XX:ReservedCodeCacheSize=120m" -Ptests.seed=9D5810039CB9F83E -Ptests.file.encoding=UTF-8
- org.apache.solr.cloud.LeaderFailureAfterFreshStartTest.test (:solr:core)
Test output: /tmp/src/solr/solr/core/build/test-results/test/outputs/OUTPUT-org.apache.solr.cloud.LeaderFailureAfterFreshStartTest.txt
Reproduce with: gradlew :solr:core:test --tests "org.apache.solr.cloud.LeaderFailureAfterFreshStartTest.test" -Ptests.jvms=96 "-Ptests.jvmargs=-XX:TieredStopAtLevel=1 -XX:+UseParallelGC -XX:ActiveProcessorCount=1 -XX:ReservedCodeCacheSize=120m" -Ptests.seed=9D5810039CB9F83E -Ptests.file.encoding=UTF-8
- org.apache.solr.cloud.api.collections.TestRequestStatusCollectionAPI.test (:solr:core)
Test output: /tmp/src/solr/solr/core/build/test-results/test/outputs/OUTPUT-org.apache.solr.cloud.api.collections.TestRequestStatusCollectionAPI.txt
Reproduce with: gradlew :solr:core:test --tests "org.apache.solr.cloud.api.collections.TestRequestStatusCollectionAPI.test" -Ptests.jvms=96 "-Ptests.jvmargs=-XX:TieredStopAtLevel=1 -XX:+UseParallelGC -XX:ActiveProcessorCount=1 -XX:ReservedCodeCacheSize=120m" -Ptests.seed=9D5810039CB9F83E -Ptests.file.encoding=UTF-8
- org.apache.solr.cloud.PeerSyncReplicationTest.test (:solr:core)
Test output: /tmp/src/solr/solr/core/build/test-results/test/outputs/OUTPUT-org.apache.solr.cloud.PeerSyncReplicationTest.txt
Reproduce with: gradlew :solr:core:test --tests "org.apache.solr.cloud.PeerSyncReplicationTest.test" -Ptests.jvms=96 "-Ptests.jvmargs=-XX:TieredStopAtLevel=1 -XX:+UseParallelGC -XX:ActiveProcessorCount=1 -XX:ReservedCodeCacheSize=120m" -Ptests.seed=9D5810039CB9F83E -Ptests.file.encoding=UTF-8
- org.apache.solr.cloud.ReplicationFactorTest.test (:solr:core)
Test output: /tmp/src/solr/solr/core/build/test-results/test/outputs/OUTPUT-org.apache.solr.cloud.ReplicationFactorTest.txt
Reproduce with: gradlew :solr:core:test --tests "org.apache.solr.cloud.ReplicationFactorTest.test" -Ptests.jvms=96 "-Ptests.jvmargs=-XX:TieredStopAtLevel=1 -XX:+UseParallelGC -XX:ActiveProcessorCount=1 -XX:ReservedCodeCacheSize=120m" -Ptests.seed=9D5810039CB9F83E -Ptests.file.encoding=UTF-8
- org.apache.solr.cloud.api.collections.TestCollectionAPI.testConfigCaching (:solr:core)
Test output: /tmp/src/solr/solr/core/build/test-results/test/outputs/OUTPUT-org.apache.solr.cloud.api.collections.TestCollectionAPI.txt
Reproduce with: gradlew :solr:core:test --tests "org.apache.solr.cloud.api.collections.TestCollectionAPI.testConfigCaching" -Ptests.jvms=96 "-Ptests.jvmargs=-XX:TieredStopAtLevel=1 -XX:+UseParallelGC -XX:ActiveProcessorCount=1 -XX:ReservedCodeCacheSize=120m" -Ptests.seed=9D5810039CB9F83E -Ptests.file.encoding=UTF-8
- org.apache.solr.cloud.api.collections.TestReplicaProperties.test (:solr:core)
Test output: /tmp/src/solr/solr/core/build/test-results/test/outputs/OUTPUT-org.apache.solr.cloud.api.collections.TestReplicaProperties.txt
Reproduce with: gradlew :solr:core:test --tests "org.apache.solr.cloud.api.collections.TestReplicaProperties.test" -Ptests.jvms=96 "-Ptests.jvmargs=-XX:TieredStopAtLevel=1 -XX:+UseParallelGC -XX:ActiveProcessorCount=1 -XX:ReservedCodeCacheSize=120m" -Ptests.seed=9D5810039CB9F83E -Ptests.file.encoding=UTF-8
- org.apache.solr.cloud.MultiThreadedOCPTest.testDeduplicationOfSubmittedTasks (:solr:core)
Test output: /tmp/src/solr/solr/core/build/test-results/test/outputs/OUTPUT-org.apache.solr.cloud.MultiThreadedOCPTest.txt
Reproduce with: gradlew :solr:core:test --tests "org.apache.solr.cloud.MultiThreadedOCPTest.testDeduplicationOfSubmittedTasks" -Ptests.jvms=96 "-Ptests.jvmargs=-XX:TieredStopAtLevel=1 -XX:+UseParallelGC -XX:ActiveProcessorCount=1 -XX:ReservedCodeCacheSize=120m" -Ptests.seed=9D5810039CB9F83E -Ptests.file.encoding=UTF-8
- org.apache.solr.cloud.SyncSliceTest.test (:solr:core)
Test output: /tmp/src/solr/solr/core/build/test-results/test/outputs/OUTPUT-org.apache.solr.cloud.SyncSliceTest.txt
Reproduce with: gradlew :solr:core:test --tests "org.apache.solr.cloud.SyncSliceTest.test" -Ptests.jvms=96 "-Ptests.jvmargs=-XX:TieredStopAtLevel=1 -XX:+UseParallelGC -XX:ActiveProcessorCount=1 -XX:ReservedCodeCacheSize=120m" -Ptests.seed=9D5810039CB9F83E -Ptests.file.encoding=UTF-8
- org.apache.solr.cloud.ShardRoutingTest.test (:solr:core)
Test output: /tmp/src/solr/solr/core/build/test-results/test/outputs/OUTPUT-org.apache.solr.cloud.ShardRoutingTest.txt
Reproduce with: gradlew :solr:core:test --tests "org.apache.solr.cloud.ShardRoutingTest.test" -Ptests.jvms=96 "-Ptests.jvmargs=-XX:TieredStopAtLevel=1 -XX:+UseParallelGC -XX:ActiveProcessorCount=1 -XX:ReservedCodeCacheSize=120m" -Ptests.seed=9D5810039CB9F83E -Ptests.file.encoding=UTF-8
- org.apache.solr.cloud.RecoveryAfterSoftCommitTest.test (:solr:core)
Test output: /tmp/src/solr/solr/core/build/test-results/test/outputs/OUTPUT-org.apache.solr.cloud.RecoveryAfterSoftCommitTest.txt
Reproduce with: gradlew :solr:core:test --tests "org.apache.solr.cloud.RecoveryAfterSoftCommitTest.test" -Ptests.jvms=96 "-Ptests.jvmargs=-XX:TieredStopAtLevel=1 -XX:+UseParallelGC -XX:ActiveProcessorCount=1 -XX:ReservedCodeCacheSize=120m" -Ptests.seed=9D5810039CB9F83E -Ptests.file.encoding=UTF-8
- org.apache.solr.cloud.TestShortCircuitedRequests.test (:solr:core)
Test output: /tmp/src/solr/solr/core/build/test-results/test/outputs/OUTPUT-org.apache.solr.cloud.TestShortCircuitedRequests.txt
Reproduce with: gradlew :solr:core:test --tests "org.apache.solr.cloud.TestShortCircuitedRequests.test" -Ptests.jvms=96 "-Ptests.jvmargs=-XX:TieredStopAtLevel=1 -XX:+UseParallelGC -XX:ActiveProcessorCount=1 -XX:ReservedCodeCacheSize=120m" -Ptests.seed=9D5810039CB9F83E -Ptests.file.encoding=UTF-8
- org.apache.solr.cloud.TestDynamicFieldNamesIndexCorrectly.test (:solr:core)
Test output: /tmp/src/solr/solr/core/build/test-results/test/outputs/OUTPUT-org.apache.solr.cloud.TestDynamicFieldNamesIndexCorrectly.txt
Reproduce with: gradlew :solr:core:test --tests "org.apache.solr.cloud.TestDynamicFieldNamesIndexCorrectly.test" -Ptests.jvms=96 "-Ptests.jvmargs=-XX:TieredStopAtLevel=1 -XX:+UseParallelGC -XX:ActiveProcessorCount=1 -XX:ReservedCodeCacheSize=120m" -Ptests.seed=9D5810039CB9F83E -Ptests.file.encoding=UTF-8
- org.apache.solr.cloud.HttpPartitionOnCommitTest.test (:solr:core)
Test output: /tmp/src/solr/solr/core/build/test-results/test/outputs/OUTPUT-org.apache.solr.cloud.HttpPartitionOnCommitTest.txt
Reproduce with: gradlew :solr:core:test --tests "org.apache.solr.cloud.HttpPartitionOnCommitTest.test" -Ptests.jvms=96 "-Ptests.jvmargs=-XX:TieredStopAtLevel=1 -XX:+UseParallelGC -XX:ActiveProcessorCount=1 -XX:ReservedCodeCacheSize=120m" -Ptests.seed=9D5810039CB9F83E -Ptests.file.encoding=UTF-8
- org.apache.solr.cloud.api.collections.SimpleCollectionCreateDeleteTest.testDeleteDoesNotDeleteSharedAutocreatedConfigSet (:solr:core)
Test output: /tmp/src/solr/solr/core/build/test-results/test/outputs/OUTPUT-org.apache.solr.cloud.api.collections.SimpleCollectionCreateDeleteTest.txt
Reproduce with: gradlew :solr:core:test --tests "org.apache.solr.cloud.api.collections.SimpleCollectionCreateDeleteTest.testDeleteDoesNotDeleteSharedAutocreatedConfigSet" -Ptests.jvms=96 "-Ptests.jvmargs=-XX:TieredStopAtLevel=1 -XX:+UseParallelGC -XX:ActiveProcessorCount=1 -XX:ReservedCodeCacheSize=120m" -Ptests.seed=9D5810039CB9F83E -Ptests.file.encoding=UTF-8
- org.apache.solr.cloud.TestOnReconnectListenerSupport.test (:solr:core)
Test output: /tmp/src/solr/solr/core/build/test-results/test/outputs/OUTPUT-org.apache.solr.cloud.TestOnReconnectListenerSupport.txt
Reproduce with: gradlew :solr:core:test --tests "org.apache.solr.cloud.TestOnReconnectListenerSupport.test" -Ptests.jvms=96 "-Ptests.jvmargs=-XX:TieredStopAtLevel=1 -XX:+UseParallelGC -XX:ActiveProcessorCount=1 -XX:ReservedCodeCacheSize=120m" -Ptests.seed=9D5810039CB9F83E -Ptests.file.encoding=UTF-8
- org.apache.solr.cloud.api.collections.TestCollectionAPI.test (:solr:core)
Test output: /tmp/src/solr/solr/core/build/test-results/test/outputs/OUTPUT-org.apache.solr.cloud.api.collections.TestCollectionAPI.txt
Reproduce with: gradlew :solr:core:test --tests "org.apache.solr.cloud.api.collections.TestCollectionAPI.test" -Ptests.jvms=96 "-Ptests.jvmargs=-XX:TieredStopAtLevel=1 -XX:+UseParallelGC -XX:ActiveProcessorCount=1 -XX:ReservedCodeCacheSize=120m" -Ptests.seed=9D5810039CB9F83E -Ptests.file.encoding=UTF-8
- org.apache.solr.cloud.UnloadDistributedZkTest.test (:solr:core)
Test output: /tmp/src/solr/solr/core/build/test-results/test/outputs/OUTPUT-org.apache.solr.cloud.UnloadDistributedZkTest.txt
Reproduce with: gradlew :solr:core:test --tests "org.apache.solr.cloud.UnloadDistributedZkTest.test" -Ptests.jvms=96 "-Ptests.jvmargs=-XX:TieredStopAtLevel=1 -XX:+UseParallelGC -XX:ActiveProcessorCount=1 -XX:ReservedCodeCacheSize=120m" -Ptests.seed=9D5810039CB9F83E -Ptests.file.encoding=UTF-8
- org.apache.solr.cloud.TestRandomRequestDistribution.test (:solr:core)
Test output: /tmp/src/solr/solr/core/build/test-results/test/outputs/OUTPUT-org.apache.solr.cloud.TestRandomRequestDistribution.txt
Reproduce with: gradlew :solr:core:test --tests "org.apache.solr.cloud.TestRandomRequestDistribution.test" -Ptests.jvms=96 "-Ptests.jvmargs=-XX:TieredStopAtLevel=1 -XX:+UseParallelGC -XX:ActiveProcessorCount=1 -XX:ReservedCodeCacheSize=120m" -Ptests.seed=9D5810039CB9F83E -Ptests.file.encoding=UTF-8
- org.apache.solr.core.TestCustomStream.testDynamicLoadingCustomStream (:solr:core)
Test output: /tmp/src/solr/solr/core/build/test-results/test/outputs/OUTPUT-org.apache.solr.core.TestCustomStream.txt
Reproduce with: gradlew :solr:core:test --tests "org.apache.solr.core.TestCustomStream.testDynamicLoadingCustomStream" -Ptests.jvms=96 "-Ptests.jvmargs=-XX:TieredStopAtLevel=1 -XX:+UseParallelGC -XX:ActiveProcessorCount=1 -XX:ReservedCodeCacheSize=120m" -Ptests.seed=9D5810039CB9F83E -Ptests.file.encoding=UTF-8
- org.apache.solr.cloud.MultiThreadedOCPTest.testFillWorkQueue (:solr:core)
Test output: /tmp/src/solr/solr/core/build/test-results/test/outputs/OUTPUT-org.apache.solr.cloud.MultiThreadedOCPTest.txt
Reproduce with: gradlew :solr:core:test --tests "org.apache.solr.cloud.MultiThreadedOCPTest.testFillWorkQueue" -Ptests.jvms=96 "-Ptests.jvmargs=-XX:TieredStopAtLevel=1 -XX:+UseParallelGC -XX:ActiveProcessorCount=1 -XX:ReservedCodeCacheSize=120m" -Ptests.seed=9D5810039CB9F83E -Ptests.file.encoding=UTF-8
- org.apache.solr.handler.TestSystemCollAutoCreate.testAutoCreate (:solr:core)
Test output: /tmp/src/solr/solr/core/build/test-results/test/outputs/OUTPUT-org.apache.solr.handler.TestSystemCollAutoCreate.txt
Reproduce with: gradlew :solr:core:test --tests "org.apache.solr.handler.TestSystemCollAutoCreate.testAutoCreate" -Ptests.jvms=96 "-Ptests.jvmargs=-XX:TieredStopAtLevel=1 -XX:+UseParallelGC -XX:ActiveProcessorCount=1 -XX:ReservedCodeCacheSize=120m" -Ptests.seed=9D5810039CB9F83E -Ptests.file.encoding=UTF-8
- org.apache.solr.cloud.api.collections.SimpleCollectionCreateDeleteTest.testPropertiesOfReplica (:solr:core)
Test output: /tmp/src/solr/solr/core/build/test-results/test/outputs/OUTPUT-org.apache.solr.cloud.api.collections.SimpleCollectionCreateDeleteTest.txt
Reproduce with: gradlew :solr:core:test --tests "org.apache.solr.cloud.api.collections.SimpleCollectionCreateDeleteTest.testPropertiesOfReplica" -Ptests.jvms=96 "-Ptests.jvmargs=-XX:TieredStopAtLevel=1 -XX:+UseParallelGC -XX:ActiveProcessorCount=1 -XX:ReservedCodeCacheSize=120m" -Ptests.seed=9D5810039CB9F83E -Ptests.file.encoding=UTF-8
- org.apache.solr.cloud.MultiThreadedOCPTest.testLongAndShortRunningParallelApiCalls (:solr:core)
Test output: /tmp/src/solr/solr/core/build/test-results/test/outputs/OUTPUT-org.apache.solr.cloud.MultiThreadedOCPTest.txt
Reproduce with: gradlew :solr:core:test --tests "org.apache.solr.cloud.MultiThreadedOCPTest.testLongAndShortRunningParallelApiCalls" -Ptests.jvms=96 "-Ptests.jvmargs=-XX:TieredStopAtLevel=1 -XX:+UseParallelGC -XX:ActiveProcessorCount=1 -XX:ReservedCodeCacheSize=120m" -Ptests.seed=9D5810039CB9F83E -Ptests.file.encoding=UTF-8
- org.apache.solr.handler.TestSolrConfigHandlerCloud.test (:solr:core)
Test output: /tmp/src/solr/solr/core/build/test-results/test/outputs/OUTPUT-org.apache.solr.handler.TestSolrConfigHandlerCloud.txt
Reproduce with: gradlew :solr:core:test --tests "org.apache.solr.handler.TestSolrConfigHandlerCloud.test" -Ptests.jvms=96 "-Ptests.jvmargs=-XX:TieredStopAtLevel=1 -XX:+UseParallelGC -XX:ActiveProcessorCount=1 -XX:ReservedCodeCacheSize=120m" -Ptests.seed=9D5810039CB9F83E -Ptests.file.encoding=UTF-8
- org.apache.solr.cloud.MultiThreadedOCPTest.testTaskExclusivity (:solr:core)
Test output: /tmp/src/solr/solr/core/build/test-results/test/outputs/OUTPUT-org.apache.solr.cloud.MultiThreadedOCPTest.txt
Reproduce with: gradlew :solr:core:test --tests "org.apache.solr.cloud.MultiThreadedOCPTest.testTaskExclusivity" -Ptests.jvms=96 "-Ptests.jvmargs=-XX:TieredStopAtLevel=1 -XX:+UseParallelGC -XX:ActiveProcessorCount=1 -XX:ReservedCodeCacheSize=120m" -Ptests.seed=9D5810039CB9F83E -Ptests.file.encoding=UTF-8
- org.apache.solr.cloud.api.collections.SimpleCollectionCreateDeleteTest.testDeleteAlsoDeletesAutocreatedConfigSet (:solr:core)
Test output: /tmp/src/solr/solr/core/build/test-results/test/outputs/OUTPUT-org.apache.solr.cloud.api.collections.SimpleCollectionCreateDeleteTest.txt
Reproduce with: gradlew :solr:core:test --tests "org.apache.solr.cloud.api.collections.SimpleCollectionCreateDeleteTest.testDeleteAlsoDeletesAutocreatedConfigSet" -Ptests.jvms=96 "-Ptests.jvmargs=-XX:TieredStopAtLevel=1 -XX:+UseParallelGC -XX:ActiveProcessorCount=1 -XX:ReservedCodeCacheSize=120m" -Ptests.seed=9D5810039CB9F83E -Ptests.file.encoding=UTF-8
- org.apache.solr.cloud.TestCloudPivotFacet.test (:solr:core)
Test output: /tmp/src/solr/solr/core/build/test-results/test/outputs/OUTPUT-org.apache.solr.cloud.TestCloudPivotFacet.txt
Reproduce with: gradlew :solr:core:test --tests "org.apache.solr.cloud.TestCloudPivotFacet.test" -Ptests.jvms=96 "-Ptests.jvmargs=-XX:TieredStopAtLevel=1 -XX:+UseParallelGC -XX:ActiveProcessorCount=1 -XX:ReservedCodeCacheSize=120m" -Ptests.seed=9D5810039CB9F83E -Ptests.file.encoding=UTF-8
- org.apache.solr.cloud.api.collections.SimpleCollectionCreateDeleteTest.testCreateAndDeleteThenCreateAgain (:solr:core)
Test output: /tmp/src/solr/solr/core/build/test-results/test/outputs/OUTPUT-org.apache.solr.cloud.api.collections.SimpleCollectionCreateDeleteTest.txt
Reproduce with: gradlew :solr:core:test --tests "org.apache.solr.cloud.api.collections.SimpleCollectionCreateDeleteTest.testCreateAndDeleteThenCreateAgain" -Ptests.jvms=96 "-Ptests.jvmargs=-XX:TieredStopAtLevel=1 -XX:+UseParallelGC -XX:ActiveProcessorCount=1 -XX:ReservedCodeCacheSize=120m" -Ptests.seed=9D5810039CB9F83E -Ptests.file.encoding=UTF-8
- org.apache.solr.schema.TestCloudManagedSchema.test (:solr:core)
Test output: /tmp/src/solr/solr/core/build/test-results/test/outputs/OUTPUT-org.apache.solr.schema.TestCloudManagedSchema.txt
Reproduce with: gradlew :solr:core:test --tests "org.apache.solr.schema.TestCloudManagedSchema.test" -Ptests.jvms=96 "-Ptests.jvmargs=-XX:TieredStopAtLevel=1 -XX:+UseParallelGC -XX:ActiveProcessorCount=1 -XX:ReservedCodeCacheSize=120m" -Ptests.seed=9D5810039CB9F83E -Ptests.file.encoding=UTF-8
- org.apache.solr.handler.TestSolrConfigHandlerConcurrent.test (:solr:core)
Test output: /tmp/src/solr/solr/core/build/test-results/test/outputs/OUTPUT-org.apache.solr.handler.TestSolrConfigHandlerConcurrent.txt
Reproduce with: gradlew :solr:core:test --tests "org.apache.solr.handler.TestSolrConfigHandlerConcurrent.test" -Ptests.jvms=96 "-Ptests.jvmargs=-XX:TieredStopAtLevel=1 -XX:+UseParallelGC -XX:ActiveProcessorCount=1 -XX:ReservedCodeCacheSize=120m" -Ptests.seed=9D5810039CB9F83E -Ptests.file.encoding=UTF-8
- org.apache.solr.cloud.MultiThreadedOCPTest.testParallelCollectionAPICalls (:solr:core)
Test output: /tmp/src/solr/solr/core/build/test-results/test/outputs/OUTPUT-org.apache.solr.cloud.MultiThreadedOCPTest.txt
Reproduce with: gradlew :solr:core:test --tests "org.apache.solr.cloud.MultiThreadedOCPTest.testParallelCollectionAPICalls" -Ptests.jvms=96 "-Ptests.jvmargs=-XX:TieredStopAtLevel=1 -XX:+UseParallelGC -XX:ActiveProcessorCount=1 -XX:ReservedCodeCacheSize=120m" -Ptests.seed=9D5810039CB9F83E -Ptests.file.encoding=UTF-8
- org.apache.solr.cloud.TestStressInPlaceUpdates.stressTest (:solr:core)
Test output: /tmp/src/solr/solr/core/build/test-results/test/outputs/OUTPUT-org.apache.solr.cloud.TestStressInPlaceUpdates.txt
Reproduce with: gradlew :solr:core:test --tests "org.apache.solr.cloud.TestStressInPlaceUpdates.stressTest" -Ptests.jvms=96 "-Ptests.jvmargs=-XX:TieredStopAtLevel=1 -XX:+UseParallelGC -XX:ActiveProcessorCount=1 -XX:ReservedCodeCacheSize=120m" -Ptests.seed=9D5810039CB9F83E -Ptests.file.encoding=UTF-8
- org.apache.solr.update.TestInPlaceUpdatesDistrib.test (:solr:core)
Test output: /tmp/src/solr/solr/core/build/test-results/test/outputs/OUTPUT-org.apache.solr.update.TestInPlaceUpdatesDistrib.txt
Reproduce with: gradlew :solr:core:test --tests "org.apache.solr.update.TestInPlaceUpdatesDistrib.test" -Ptests.jvms=96 "-Ptests.jvmargs=-XX:TieredStopAtLevel=1 -XX:+UseParallelGC -XX:ActiveProcessorCount=1 -XX:ReservedCodeCacheSize=120m" -Ptests.seed=9D5810039CB9F83E -Ptests.file.encoding=UTF-8
- org.apache.solr.handler.TestConfigReload.test (:solr:core)
Test output: /tmp/src/solr/solr/core/build/test-results/test/outputs/OUTPUT-org.apache.solr.handler.TestConfigReload.txt
Reproduce with: gradlew :solr:core:test --tests "org.apache.solr.handler.TestConfigReload.test" -Ptests.jvms=96 "-Ptests.jvmargs=-XX:TieredStopAtLevel=1 -XX:+UseParallelGC -XX:ActiveProcessorCount=1 -XX:ReservedCodeCacheSize=120m" -Ptests.seed=9D5810039CB9F83E -Ptests.file.encoding=UTF-8
- org.apache.solr.handler.component.TestTrackingShardHandlerFactory.testRequestTracking (:solr:core)
Test output: /tmp/src/solr/solr/core/build/test-results/test/outputs/OUTPUT-org.apache.solr.handler.component.TestTrackingShardHandlerFactory.txt
Reproduce with: gradlew :solr:core:test --tests "org.apache.solr.handler.component.TestTrackingShardHandlerFactory.testRequestTracking" -Ptests.jvms=96 "-Ptests.jvmargs=-XX:TieredStopAtLevel=1 -XX:+UseParallelGC -XX:ActiveProcessorCount=1 -XX:ReservedCodeCacheSize=120m" -Ptests.seed=9D5810039CB9F83E -Ptests.file.encoding=UTF-8
- org.apache.solr.security.TestAuthorizationFramework.authorizationFrameworkTest (:solr:core)
Test output: /tmp/src/solr/solr/core/build/test-results/test/outputs/OUTPUT-org.apache.solr.security.TestAuthorizationFramework.txt
Reproduce with: gradlew :solr:core:test --tests "org.apache.solr.security.TestAuthorizationFramework.authorizationFrameworkTest" -Ptests.jvms=96 "-Ptests.jvmargs=-XX:TieredStopAtLevel=1 -XX:+UseParallelGC -XX:ActiveProcessorCount=1 -XX:ReservedCodeCacheSize=120m" -Ptests.seed=9D5810039CB9F83E -Ptests.file.encoding=UTF-8
- org.apache.solr.schema.TestCloudSchemaless.test (:solr:core)
Test output: /tmp/src/solr/solr/core/build/test-results/test/outputs/OUTPUT-org.apache.solr.schema.TestCloudSchemaless.txt
Reproduce with: gradlew :solr:core:test --tests "org.apache.solr.schema.TestCloudSchemaless.test" -Ptests.jvms=96 "-Ptests.jvmargs=-XX:TieredStopAtLevel=1 -XX:+UseParallelGC -XX:ActiveProcessorCount=1 -XX:ReservedCodeCacheSize=120m" -Ptests.seed=9D5810039CB9F83E -Ptests.file.encoding=UTF-8
- org.apache.solr.handler.TestBlobHandler.doBlobHandlerTest (:solr:core)
Test output: /tmp/src/solr/solr/core/build/test-results/test/outputs/OUTPUT-org.apache.solr.handler.TestBlobHandler.txt
Reproduce with: gradlew :solr:core:test --tests "org.apache.solr.handler.TestBlobHandler.doBlobHandlerTest" -Ptests.jvms=96 "-Ptests.jvmargs=-XX:TieredStopAtLevel=1 -XX:+UseParallelGC -XX:ActiveProcessorCount=1 -XX:ReservedCodeCacheSize=120m" -Ptests.seed=9D5810039CB9F83E -Ptests.file.encoding=UTF-8
- org.apache.solr.schema.TestBulkSchemaConcurrent.test (:solr:core)
Test output: /tmp/src/solr/solr/core/build/test-results/test/outputs/OUTPUT-org.apache.solr.schema.TestBulkSchemaConcurrent.txt
Reproduce with: gradlew :solr:core:test --tests "org.apache.solr.schema.TestBulkSchemaConcurrent.test" -Ptests.jvms=96 "-Ptests.jvmargs=-XX:TieredStopAtLevel=1 -XX:+UseParallelGC -XX:ActiveProcessorCount=1 -XX:ReservedCodeCacheSize=120m" -Ptests.seed=9D5810039CB9F83E -Ptests.file.encoding=UTF-8
WARNING: there were unreferenced files under license folder:
- /tmp/src/solr/solr/licenses/jakarta.inject-2.6.1.jar.sha1
FAILURE: Build completed with 2 failures.
1: Task failed with an exception.
-----------
* What went wrong:
Execution failed for task ':solr:modules:hdfs:test'.
> There were failing tests. See the results at: file:///tmp/src/solr/solr/modules/hdfs/build/test-results/test/
* Try:
> Run with --scan to get full insights.
==============================================================================
2: Task failed with an exception.
-----------
* What went wrong:
Execution failed for task ':solr:core:test'.
> There were failing tests. See the results at: file:///tmp/src/solr/solr/core/build/test-results/test/
* Try:
> Run with --scan to get full insights.
==============================================================================
BUILD FAILED in 8m 3s
670 actionable tasks: 668 executed, 2 up-to-date
[0m[?12l[?25h
------------------------------------------------------------------------
Build Failed: returned 1
Total time: 8m35s
------------------------------------------------------------------------
+ status=1
+ ./crave pull '**/build/**/test/TEST-*.xml'
+ ./crave pull '**/*.events'
+ ./crave pull 'heapdumps/**'
Error: rsync: [sender] change_dir "/tmp/src/solr/heapdumps" failed: No such file or directory (2)
rsync error: some files/attrs were not transferred (see previous errors) (code 23) at main.c(1675) [Receiver=3.1.2]
rsync: [Receiver] write error: Broken pipe (32)
+ ./crave pull '**/hs_err_pid*'
+ exit 1
Build step 'Execute shell' marked build as failure
Archiving artifacts
Recording test results
ERROR: Step ‘Publish JUnit test result report’ failed: No test report files were found. Configuration error?
Email was triggered for: Failure - Any
Sending email for trigger: Failure - Any
[JENKINS] Solr » Solr-Check-9.x (Crave) - Build # 6242 - Still Failing!
Posted by Apache Jenkins Server <je...@builds.apache.org>.
Build: https://ci-builds.apache.org/job/Solr/job/Solr-Check-9.x%20(Crave)/6242/
No tests ran.
Build Log:
[...truncated 15479 lines...]
ERROR: The following test(s) have failed:
- org.apache.solr.hdfs.index.CheckHdfsIndexTest.testChecksumsOnlyVerbose (:solr:modules:hdfs)
Test output: /tmp/src/solr/solr/modules/hdfs/build/test-results/test/outputs/OUTPUT-org.apache.solr.hdfs.index.CheckHdfsIndexTest.txt
Reproduce with: gradlew :solr:modules:hdfs:test --tests "org.apache.solr.hdfs.index.CheckHdfsIndexTest.testChecksumsOnlyVerbose" -Ptests.jvms=96 "-Ptests.jvmargs=-XX:TieredStopAtLevel=1 -XX:+UseParallelGC -XX:ActiveProcessorCount=1 -XX:ReservedCodeCacheSize=120m" -Ptests.seed=1F36B9A38C2966D6 -Ptests.file.encoding=ISO-8859-1
- org.apache.solr.hdfs.index.CheckHdfsIndexTest.testChecksumsOnly (:solr:modules:hdfs)
Test output: /tmp/src/solr/solr/modules/hdfs/build/test-results/test/outputs/OUTPUT-org.apache.solr.hdfs.index.CheckHdfsIndexTest.txt
Reproduce with: gradlew :solr:modules:hdfs:test --tests "org.apache.solr.hdfs.index.CheckHdfsIndexTest.testChecksumsOnly" -Ptests.jvms=96 "-Ptests.jvmargs=-XX:TieredStopAtLevel=1 -XX:+UseParallelGC -XX:ActiveProcessorCount=1 -XX:ReservedCodeCacheSize=120m" -Ptests.seed=1F36B9A38C2966D6 -Ptests.file.encoding=ISO-8859-1
- org.apache.solr.hdfs.index.CheckHdfsIndexTest.doTest (:solr:modules:hdfs)
Test output: /tmp/src/solr/solr/modules/hdfs/build/test-results/test/outputs/OUTPUT-org.apache.solr.hdfs.index.CheckHdfsIndexTest.txt
Reproduce with: gradlew :solr:modules:hdfs:test --tests "org.apache.solr.hdfs.index.CheckHdfsIndexTest.doTest" -Ptests.jvms=96 "-Ptests.jvmargs=-XX:TieredStopAtLevel=1 -XX:+UseParallelGC -XX:ActiveProcessorCount=1 -XX:ReservedCodeCacheSize=120m" -Ptests.seed=1F36B9A38C2966D6 -Ptests.file.encoding=ISO-8859-1
- org.apache.solr.hdfs.index.CheckHdfsIndexTest.testDeletedDocs (:solr:modules:hdfs)
Test output: /tmp/src/solr/solr/modules/hdfs/build/test-results/test/outputs/OUTPUT-org.apache.solr.hdfs.index.CheckHdfsIndexTest.txt
Reproduce with: gradlew :solr:modules:hdfs:test --tests "org.apache.solr.hdfs.index.CheckHdfsIndexTest.testDeletedDocs" -Ptests.jvms=96 "-Ptests.jvmargs=-XX:TieredStopAtLevel=1 -XX:+UseParallelGC -XX:ActiveProcessorCount=1 -XX:ReservedCodeCacheSize=120m" -Ptests.seed=1F36B9A38C2966D6 -Ptests.file.encoding=ISO-8859-1
- org.apache.solr.cloud.DistribCursorPagingTest.test (:solr:core)
Test output: /tmp/src/solr/solr/core/build/test-results/test/outputs/OUTPUT-org.apache.solr.cloud.DistribCursorPagingTest.txt
Reproduce with: gradlew :solr:core:test --tests "org.apache.solr.cloud.DistribCursorPagingTest.test" -Ptests.jvms=96 "-Ptests.jvmargs=-XX:TieredStopAtLevel=1 -XX:+UseParallelGC -XX:ActiveProcessorCount=1 -XX:ReservedCodeCacheSize=120m" -Ptests.seed=1F36B9A38C2966D6 -Ptests.file.encoding=ISO-8859-1
- org.apache.solr.cloud.RollingRestartTest.test (:solr:core)
Test output: /tmp/src/solr/solr/core/build/test-results/test/outputs/OUTPUT-org.apache.solr.cloud.RollingRestartTest.txt
Reproduce with: gradlew :solr:core:test --tests "org.apache.solr.cloud.RollingRestartTest.test" -Ptests.jvms=96 "-Ptests.jvmargs=-XX:TieredStopAtLevel=1 -XX:+UseParallelGC -XX:ActiveProcessorCount=1 -XX:ReservedCodeCacheSize=120m" -Ptests.seed=1F36B9A38C2966D6 -Ptests.file.encoding=ISO-8859-1
- org.apache.solr.cloud.SolrCloudExampleTest.testLoadDocsIntoGettingStartedCollection (:solr:core)
Test output: /tmp/src/solr/solr/core/build/test-results/test/outputs/OUTPUT-org.apache.solr.cloud.SolrCloudExampleTest.txt
Reproduce with: gradlew :solr:core:test --tests "org.apache.solr.cloud.SolrCloudExampleTest.testLoadDocsIntoGettingStartedCollection" -Ptests.jvms=96 "-Ptests.jvmargs=-XX:TieredStopAtLevel=1 -XX:+UseParallelGC -XX:ActiveProcessorCount=1 -XX:ReservedCodeCacheSize=120m" -Ptests.seed=1F36B9A38C2966D6 -Ptests.file.encoding=ISO-8859-1
- org.apache.solr.cloud.TestDistribDocBasedVersion.test (:solr:core)
Test output: /tmp/src/solr/solr/core/build/test-results/test/outputs/OUTPUT-org.apache.solr.cloud.TestDistribDocBasedVersion.txt
Reproduce with: gradlew :solr:core:test --tests "org.apache.solr.cloud.TestDistribDocBasedVersion.test" -Ptests.jvms=96 "-Ptests.jvmargs=-XX:TieredStopAtLevel=1 -XX:+UseParallelGC -XX:ActiveProcessorCount=1 -XX:ReservedCodeCacheSize=120m" -Ptests.seed=1F36B9A38C2966D6 -Ptests.file.encoding=ISO-8859-1
- org.apache.solr.cloud.BasicDistributedZkTest.test (:solr:core)
Test output: /tmp/src/solr/solr/core/build/test-results/test/outputs/OUTPUT-org.apache.solr.cloud.BasicDistributedZkTest.txt
Reproduce with: gradlew :solr:core:test --tests "org.apache.solr.cloud.BasicDistributedZkTest.test" -Ptests.jvms=96 "-Ptests.jvmargs=-XX:TieredStopAtLevel=1 -XX:+UseParallelGC -XX:ActiveProcessorCount=1 -XX:ReservedCodeCacheSize=120m" -Ptests.seed=1F36B9A38C2966D6 -Ptests.file.encoding=ISO-8859-1
- org.apache.solr.cloud.api.collections.TestCollectionAPI.testRecreateCollectionAfterFailure (:solr:core)
Test output: /tmp/src/solr/solr/core/build/test-results/test/outputs/OUTPUT-org.apache.solr.cloud.api.collections.TestCollectionAPI.txt
Reproduce with: gradlew :solr:core:test --tests "org.apache.solr.cloud.api.collections.TestCollectionAPI.testRecreateCollectionAfterFailure" -Ptests.jvms=96 "-Ptests.jvmargs=-XX:TieredStopAtLevel=1 -XX:+UseParallelGC -XX:ActiveProcessorCount=1 -XX:ReservedCodeCacheSize=120m" -Ptests.seed=1F36B9A38C2966D6 -Ptests.file.encoding=ISO-8859-1
- org.apache.solr.cloud.BasicDistributedZk2Test.test (:solr:core)
Test output: /tmp/src/solr/solr/core/build/test-results/test/outputs/OUTPUT-org.apache.solr.cloud.BasicDistributedZk2Test.txt
Reproduce with: gradlew :solr:core:test --tests "org.apache.solr.cloud.BasicDistributedZk2Test.test" -Ptests.jvms=96 "-Ptests.jvmargs=-XX:TieredStopAtLevel=1 -XX:+UseParallelGC -XX:ActiveProcessorCount=1 -XX:ReservedCodeCacheSize=120m" -Ptests.seed=1F36B9A38C2966D6 -Ptests.file.encoding=ISO-8859-1
- org.apache.solr.cloud.LeaderFailureAfterFreshStartTest.test (:solr:core)
Test output: /tmp/src/solr/solr/core/build/test-results/test/outputs/OUTPUT-org.apache.solr.cloud.LeaderFailureAfterFreshStartTest.txt
Reproduce with: gradlew :solr:core:test --tests "org.apache.solr.cloud.LeaderFailureAfterFreshStartTest.test" -Ptests.jvms=96 "-Ptests.jvmargs=-XX:TieredStopAtLevel=1 -XX:+UseParallelGC -XX:ActiveProcessorCount=1 -XX:ReservedCodeCacheSize=120m" -Ptests.seed=1F36B9A38C2966D6 -Ptests.file.encoding=ISO-8859-1
- org.apache.solr.cloud.ShardRoutingCustomTest.test (:solr:core)
Test output: /tmp/src/solr/solr/core/build/test-results/test/outputs/OUTPUT-org.apache.solr.cloud.ShardRoutingCustomTest.txt
Reproduce with: gradlew :solr:core:test --tests "org.apache.solr.cloud.ShardRoutingCustomTest.test" -Ptests.jvms=96 "-Ptests.jvmargs=-XX:TieredStopAtLevel=1 -XX:+UseParallelGC -XX:ActiveProcessorCount=1 -XX:ReservedCodeCacheSize=120m" -Ptests.seed=1F36B9A38C2966D6 -Ptests.file.encoding=ISO-8859-1
- org.apache.solr.cloud.SyncSliceTest.test (:solr:core)
Test output: /tmp/src/solr/solr/core/build/test-results/test/outputs/OUTPUT-org.apache.solr.cloud.SyncSliceTest.txt
Reproduce with: gradlew :solr:core:test --tests "org.apache.solr.cloud.SyncSliceTest.test" -Ptests.jvms=96 "-Ptests.jvmargs=-XX:TieredStopAtLevel=1 -XX:+UseParallelGC -XX:ActiveProcessorCount=1 -XX:ReservedCodeCacheSize=120m" -Ptests.seed=1F36B9A38C2966D6 -Ptests.file.encoding=ISO-8859-1
- org.apache.solr.cloud.TestDynamicFieldNamesIndexCorrectly.test (:solr:core)
Test output: /tmp/src/solr/solr/core/build/test-results/test/outputs/OUTPUT-org.apache.solr.cloud.TestDynamicFieldNamesIndexCorrectly.txt
Reproduce with: gradlew :solr:core:test --tests "org.apache.solr.cloud.TestDynamicFieldNamesIndexCorrectly.test" -Ptests.jvms=96 "-Ptests.jvmargs=-XX:TieredStopAtLevel=1 -XX:+UseParallelGC -XX:ActiveProcessorCount=1 -XX:ReservedCodeCacheSize=120m" -Ptests.seed=1F36B9A38C2966D6 -Ptests.file.encoding=ISO-8859-1
- org.apache.solr.cloud.RecoveryAfterSoftCommitTest.test (:solr:core)
Test output: /tmp/src/solr/solr/core/build/test-results/test/outputs/OUTPUT-org.apache.solr.cloud.RecoveryAfterSoftCommitTest.txt
Reproduce with: gradlew :solr:core:test --tests "org.apache.solr.cloud.RecoveryAfterSoftCommitTest.test" -Ptests.jvms=96 "-Ptests.jvmargs=-XX:TieredStopAtLevel=1 -XX:+UseParallelGC -XX:ActiveProcessorCount=1 -XX:ReservedCodeCacheSize=120m" -Ptests.seed=1F36B9A38C2966D6 -Ptests.file.encoding=ISO-8859-1
- org.apache.solr.cloud.UnloadDistributedZkTest.test (:solr:core)
Test output: /tmp/src/solr/solr/core/build/test-results/test/outputs/OUTPUT-org.apache.solr.cloud.UnloadDistributedZkTest.txt
Reproduce with: gradlew :solr:core:test --tests "org.apache.solr.cloud.UnloadDistributedZkTest.test" -Ptests.jvms=96 "-Ptests.jvmargs=-XX:TieredStopAtLevel=1 -XX:+UseParallelGC -XX:ActiveProcessorCount=1 -XX:ReservedCodeCacheSize=120m" -Ptests.seed=1F36B9A38C2966D6 -Ptests.file.encoding=ISO-8859-1
- org.apache.solr.cloud.ShardRoutingTest.test (:solr:core)
Test output: /tmp/src/solr/solr/core/build/test-results/test/outputs/OUTPUT-org.apache.solr.cloud.ShardRoutingTest.txt
Reproduce with: gradlew :solr:core:test --tests "org.apache.solr.cloud.ShardRoutingTest.test" -Ptests.jvms=96 "-Ptests.jvmargs=-XX:TieredStopAtLevel=1 -XX:+UseParallelGC -XX:ActiveProcessorCount=1 -XX:ReservedCodeCacheSize=120m" -Ptests.seed=1F36B9A38C2966D6 -Ptests.file.encoding=ISO-8859-1
- org.apache.solr.cloud.api.collections.TestCollectionAPI.testConfigCaching (:solr:core)
Test output: /tmp/src/solr/solr/core/build/test-results/test/outputs/OUTPUT-org.apache.solr.cloud.api.collections.TestCollectionAPI.txt
Reproduce with: gradlew :solr:core:test --tests "org.apache.solr.cloud.api.collections.TestCollectionAPI.testConfigCaching" -Ptests.jvms=96 "-Ptests.jvmargs=-XX:TieredStopAtLevel=1 -XX:+UseParallelGC -XX:ActiveProcessorCount=1 -XX:ReservedCodeCacheSize=120m" -Ptests.seed=1F36B9A38C2966D6 -Ptests.file.encoding=ISO-8859-1
- org.apache.solr.cloud.api.collections.TestReplicaProperties.test (:solr:core)
Test output: /tmp/src/solr/solr/core/build/test-results/test/outputs/OUTPUT-org.apache.solr.cloud.api.collections.TestReplicaProperties.txt
Reproduce with: gradlew :solr:core:test --tests "org.apache.solr.cloud.api.collections.TestReplicaProperties.test" -Ptests.jvms=96 "-Ptests.jvmargs=-XX:TieredStopAtLevel=1 -XX:+UseParallelGC -XX:ActiveProcessorCount=1 -XX:ReservedCodeCacheSize=120m" -Ptests.seed=1F36B9A38C2966D6 -Ptests.file.encoding=ISO-8859-1
- org.apache.solr.cloud.api.collections.TestRequestStatusCollectionAPI.test (:solr:core)
Test output: /tmp/src/solr/solr/core/build/test-results/test/outputs/OUTPUT-org.apache.solr.cloud.api.collections.TestRequestStatusCollectionAPI.txt
Reproduce with: gradlew :solr:core:test --tests "org.apache.solr.cloud.api.collections.TestRequestStatusCollectionAPI.test" -Ptests.jvms=96 "-Ptests.jvmargs=-XX:TieredStopAtLevel=1 -XX:+UseParallelGC -XX:ActiveProcessorCount=1 -XX:ReservedCodeCacheSize=120m" -Ptests.seed=1F36B9A38C2966D6 -Ptests.file.encoding=ISO-8859-1
- org.apache.solr.cloud.TestOnReconnectListenerSupport.test (:solr:core)
Test output: /tmp/src/solr/solr/core/build/test-results/test/outputs/OUTPUT-org.apache.solr.cloud.TestOnReconnectListenerSupport.txt
Reproduce with: gradlew :solr:core:test --tests "org.apache.solr.cloud.TestOnReconnectListenerSupport.test" -Ptests.jvms=96 "-Ptests.jvmargs=-XX:TieredStopAtLevel=1 -XX:+UseParallelGC -XX:ActiveProcessorCount=1 -XX:ReservedCodeCacheSize=120m" -Ptests.seed=1F36B9A38C2966D6 -Ptests.file.encoding=ISO-8859-1
- org.apache.solr.cloud.ReplicationFactorTest.test (:solr:core)
Test output: /tmp/src/solr/solr/core/build/test-results/test/outputs/OUTPUT-org.apache.solr.cloud.ReplicationFactorTest.txt
Reproduce with: gradlew :solr:core:test --tests "org.apache.solr.cloud.ReplicationFactorTest.test" -Ptests.jvms=96 "-Ptests.jvmargs=-XX:TieredStopAtLevel=1 -XX:+UseParallelGC -XX:ActiveProcessorCount=1 -XX:ReservedCodeCacheSize=120m" -Ptests.seed=1F36B9A38C2966D6 -Ptests.file.encoding=ISO-8859-1
- org.apache.solr.cloud.PeerSyncReplicationTest.test (:solr:core)
Test output: /tmp/src/solr/solr/core/build/test-results/test/outputs/OUTPUT-org.apache.solr.cloud.PeerSyncReplicationTest.txt
Reproduce with: gradlew :solr:core:test --tests "org.apache.solr.cloud.PeerSyncReplicationTest.test" -Ptests.jvms=96 "-Ptests.jvmargs=-XX:TieredStopAtLevel=1 -XX:+UseParallelGC -XX:ActiveProcessorCount=1 -XX:ReservedCodeCacheSize=120m" -Ptests.seed=1F36B9A38C2966D6 -Ptests.file.encoding=ISO-8859-1
- org.apache.solr.cloud.api.collections.SimpleCollectionCreateDeleteTest.testPropertiesOfReplica (:solr:core)
Test output: /tmp/src/solr/solr/core/build/test-results/test/outputs/OUTPUT-org.apache.solr.cloud.api.collections.SimpleCollectionCreateDeleteTest.txt
Reproduce with: gradlew :solr:core:test --tests "org.apache.solr.cloud.api.collections.SimpleCollectionCreateDeleteTest.testPropertiesOfReplica" -Ptests.jvms=96 "-Ptests.jvmargs=-XX:TieredStopAtLevel=1 -XX:+UseParallelGC -XX:ActiveProcessorCount=1 -XX:ReservedCodeCacheSize=120m" -Ptests.seed=1F36B9A38C2966D6 -Ptests.file.encoding=ISO-8859-1
- org.apache.solr.core.TestCustomStream.testDynamicLoadingCustomStream (:solr:core)
Test output: /tmp/src/solr/solr/core/build/test-results/test/outputs/OUTPUT-org.apache.solr.core.TestCustomStream.txt
Reproduce with: gradlew :solr:core:test --tests "org.apache.solr.core.TestCustomStream.testDynamicLoadingCustomStream" -Ptests.jvms=96 "-Ptests.jvmargs=-XX:TieredStopAtLevel=1 -XX:+UseParallelGC -XX:ActiveProcessorCount=1 -XX:ReservedCodeCacheSize=120m" -Ptests.seed=1F36B9A38C2966D6 -Ptests.file.encoding=ISO-8859-1
- org.apache.solr.cloud.MultiThreadedOCPTest.testLongAndShortRunningParallelApiCalls (:solr:core)
Test output: /tmp/src/solr/solr/core/build/test-results/test/outputs/OUTPUT-org.apache.solr.cloud.MultiThreadedOCPTest.txt
Reproduce with: gradlew :solr:core:test --tests "org.apache.solr.cloud.MultiThreadedOCPTest.testLongAndShortRunningParallelApiCalls" -Ptests.jvms=96 "-Ptests.jvmargs=-XX:TieredStopAtLevel=1 -XX:+UseParallelGC -XX:ActiveProcessorCount=1 -XX:ReservedCodeCacheSize=120m" -Ptests.seed=1F36B9A38C2966D6 -Ptests.file.encoding=ISO-8859-1
- org.apache.solr.cloud.TestShortCircuitedRequests.test (:solr:core)
Test output: /tmp/src/solr/solr/core/build/test-results/test/outputs/OUTPUT-org.apache.solr.cloud.TestShortCircuitedRequests.txt
Reproduce with: gradlew :solr:core:test --tests "org.apache.solr.cloud.TestShortCircuitedRequests.test" -Ptests.jvms=96 "-Ptests.jvmargs=-XX:TieredStopAtLevel=1 -XX:+UseParallelGC -XX:ActiveProcessorCount=1 -XX:ReservedCodeCacheSize=120m" -Ptests.seed=1F36B9A38C2966D6 -Ptests.file.encoding=ISO-8859-1
- org.apache.solr.cloud.api.collections.TestCollectionAPI.test (:solr:core)
Test output: /tmp/src/solr/solr/core/build/test-results/test/outputs/OUTPUT-org.apache.solr.cloud.api.collections.TestCollectionAPI.txt
Reproduce with: gradlew :solr:core:test --tests "org.apache.solr.cloud.api.collections.TestCollectionAPI.test" -Ptests.jvms=96 "-Ptests.jvmargs=-XX:TieredStopAtLevel=1 -XX:+UseParallelGC -XX:ActiveProcessorCount=1 -XX:ReservedCodeCacheSize=120m" -Ptests.seed=1F36B9A38C2966D6 -Ptests.file.encoding=ISO-8859-1
- org.apache.solr.cloud.api.collections.SimpleCollectionCreateDeleteTest.testDeleteAlsoDeletesAutocreatedConfigSet (:solr:core)
Test output: /tmp/src/solr/solr/core/build/test-results/test/outputs/OUTPUT-org.apache.solr.cloud.api.collections.SimpleCollectionCreateDeleteTest.txt
Reproduce with: gradlew :solr:core:test --tests "org.apache.solr.cloud.api.collections.SimpleCollectionCreateDeleteTest.testDeleteAlsoDeletesAutocreatedConfigSet" -Ptests.jvms=96 "-Ptests.jvmargs=-XX:TieredStopAtLevel=1 -XX:+UseParallelGC -XX:ActiveProcessorCount=1 -XX:ReservedCodeCacheSize=120m" -Ptests.seed=1F36B9A38C2966D6 -Ptests.file.encoding=ISO-8859-1
- org.apache.solr.cloud.TestRandomRequestDistribution.test (:solr:core)
Test output: /tmp/src/solr/solr/core/build/test-results/test/outputs/OUTPUT-org.apache.solr.cloud.TestRandomRequestDistribution.txt
Reproduce with: gradlew :solr:core:test --tests "org.apache.solr.cloud.TestRandomRequestDistribution.test" -Ptests.jvms=96 "-Ptests.jvmargs=-XX:TieredStopAtLevel=1 -XX:+UseParallelGC -XX:ActiveProcessorCount=1 -XX:ReservedCodeCacheSize=120m" -Ptests.seed=1F36B9A38C2966D6 -Ptests.file.encoding=ISO-8859-1
- org.apache.solr.cloud.MultiThreadedOCPTest.testFillWorkQueue (:solr:core)
Test output: /tmp/src/solr/solr/core/build/test-results/test/outputs/OUTPUT-org.apache.solr.cloud.MultiThreadedOCPTest.txt
Reproduce with: gradlew :solr:core:test --tests "org.apache.solr.cloud.MultiThreadedOCPTest.testFillWorkQueue" -Ptests.jvms=96 "-Ptests.jvmargs=-XX:TieredStopAtLevel=1 -XX:+UseParallelGC -XX:ActiveProcessorCount=1 -XX:ReservedCodeCacheSize=120m" -Ptests.seed=1F36B9A38C2966D6 -Ptests.file.encoding=ISO-8859-1
- org.apache.solr.cloud.api.collections.SimpleCollectionCreateDeleteTest.testCreateAndDeleteThenCreateAgain (:solr:core)
Test output: /tmp/src/solr/solr/core/build/test-results/test/outputs/OUTPUT-org.apache.solr.cloud.api.collections.SimpleCollectionCreateDeleteTest.txt
Reproduce with: gradlew :solr:core:test --tests "org.apache.solr.cloud.api.collections.SimpleCollectionCreateDeleteTest.testCreateAndDeleteThenCreateAgain" -Ptests.jvms=96 "-Ptests.jvmargs=-XX:TieredStopAtLevel=1 -XX:+UseParallelGC -XX:ActiveProcessorCount=1 -XX:ReservedCodeCacheSize=120m" -Ptests.seed=1F36B9A38C2966D6 -Ptests.file.encoding=ISO-8859-1
- org.apache.solr.cloud.api.collections.TestCollectionAPI.testCreateCollectionBooleanValues (:solr:core)
Test output: /tmp/src/solr/solr/core/build/test-results/test/outputs/OUTPUT-org.apache.solr.cloud.api.collections.TestCollectionAPI.txt
Reproduce with: gradlew :solr:core:test --tests "org.apache.solr.cloud.api.collections.TestCollectionAPI.testCreateCollectionBooleanValues" -Ptests.jvms=96 "-Ptests.jvmargs=-XX:TieredStopAtLevel=1 -XX:+UseParallelGC -XX:ActiveProcessorCount=1 -XX:ReservedCodeCacheSize=120m" -Ptests.seed=1F36B9A38C2966D6 -Ptests.file.encoding=ISO-8859-1
- org.apache.solr.cloud.TestCloudPivotFacet.test (:solr:core)
Test output: /tmp/src/solr/solr/core/build/test-results/test/outputs/OUTPUT-org.apache.solr.cloud.TestCloudPivotFacet.txt
Reproduce with: gradlew :solr:core:test --tests "org.apache.solr.cloud.TestCloudPivotFacet.test" -Ptests.jvms=96 "-Ptests.jvmargs=-XX:TieredStopAtLevel=1 -XX:+UseParallelGC -XX:ActiveProcessorCount=1 -XX:ReservedCodeCacheSize=120m" -Ptests.seed=1F36B9A38C2966D6 -Ptests.file.encoding=ISO-8859-1
- org.apache.solr.cloud.api.collections.SimpleCollectionCreateDeleteTest.testDeleteDoesNotDeleteSharedAutocreatedConfigSet (:solr:core)
Test output: /tmp/src/solr/solr/core/build/test-results/test/outputs/OUTPUT-org.apache.solr.cloud.api.collections.SimpleCollectionCreateDeleteTest.txt
Reproduce with: gradlew :solr:core:test --tests "org.apache.solr.cloud.api.collections.SimpleCollectionCreateDeleteTest.testDeleteDoesNotDeleteSharedAutocreatedConfigSet" -Ptests.jvms=96 "-Ptests.jvmargs=-XX:TieredStopAtLevel=1 -XX:+UseParallelGC -XX:ActiveProcessorCount=1 -XX:ReservedCodeCacheSize=120m" -Ptests.seed=1F36B9A38C2966D6 -Ptests.file.encoding=ISO-8859-1
- org.apache.solr.cloud.MultiThreadedOCPTest.testTaskExclusivity (:solr:core)
Test output: /tmp/src/solr/solr/core/build/test-results/test/outputs/OUTPUT-org.apache.solr.cloud.MultiThreadedOCPTest.txt
Reproduce with: gradlew :solr:core:test --tests "org.apache.solr.cloud.MultiThreadedOCPTest.testTaskExclusivity" -Ptests.jvms=96 "-Ptests.jvmargs=-XX:TieredStopAtLevel=1 -XX:+UseParallelGC -XX:ActiveProcessorCount=1 -XX:ReservedCodeCacheSize=120m" -Ptests.seed=1F36B9A38C2966D6 -Ptests.file.encoding=ISO-8859-1
- org.apache.solr.handler.TestSystemCollAutoCreate.testAutoCreate (:solr:core)
Test output: /tmp/src/solr/solr/core/build/test-results/test/outputs/OUTPUT-org.apache.solr.handler.TestSystemCollAutoCreate.txt
Reproduce with: gradlew :solr:core:test --tests "org.apache.solr.handler.TestSystemCollAutoCreate.testAutoCreate" -Ptests.jvms=96 "-Ptests.jvmargs=-XX:TieredStopAtLevel=1 -XX:+UseParallelGC -XX:ActiveProcessorCount=1 -XX:ReservedCodeCacheSize=120m" -Ptests.seed=1F36B9A38C2966D6 -Ptests.file.encoding=ISO-8859-1
- org.apache.solr.cloud.MultiThreadedOCPTest.testDeduplicationOfSubmittedTasks (:solr:core)
Test output: /tmp/src/solr/solr/core/build/test-results/test/outputs/OUTPUT-org.apache.solr.cloud.MultiThreadedOCPTest.txt
Reproduce with: gradlew :solr:core:test --tests "org.apache.solr.cloud.MultiThreadedOCPTest.testDeduplicationOfSubmittedTasks" -Ptests.jvms=96 "-Ptests.jvmargs=-XX:TieredStopAtLevel=1 -XX:+UseParallelGC -XX:ActiveProcessorCount=1 -XX:ReservedCodeCacheSize=120m" -Ptests.seed=1F36B9A38C2966D6 -Ptests.file.encoding=ISO-8859-1
- org.apache.solr.handler.TestSolrConfigHandlerCloud.test (:solr:core)
Test output: /tmp/src/solr/solr/core/build/test-results/test/outputs/OUTPUT-org.apache.solr.handler.TestSolrConfigHandlerCloud.txt
Reproduce with: gradlew :solr:core:test --tests "org.apache.solr.handler.TestSolrConfigHandlerCloud.test" -Ptests.jvms=96 "-Ptests.jvmargs=-XX:TieredStopAtLevel=1 -XX:+UseParallelGC -XX:ActiveProcessorCount=1 -XX:ReservedCodeCacheSize=120m" -Ptests.seed=1F36B9A38C2966D6 -Ptests.file.encoding=ISO-8859-1
- org.apache.solr.schema.TestCloudManagedSchema.test (:solr:core)
Test output: /tmp/src/solr/solr/core/build/test-results/test/outputs/OUTPUT-org.apache.solr.schema.TestCloudManagedSchema.txt
Reproduce with: gradlew :solr:core:test --tests "org.apache.solr.schema.TestCloudManagedSchema.test" -Ptests.jvms=96 "-Ptests.jvmargs=-XX:TieredStopAtLevel=1 -XX:+UseParallelGC -XX:ActiveProcessorCount=1 -XX:ReservedCodeCacheSize=120m" -Ptests.seed=1F36B9A38C2966D6 -Ptests.file.encoding=ISO-8859-1
- org.apache.solr.cloud.MultiThreadedOCPTest.testParallelCollectionAPICalls (:solr:core)
Test output: /tmp/src/solr/solr/core/build/test-results/test/outputs/OUTPUT-org.apache.solr.cloud.MultiThreadedOCPTest.txt
Reproduce with: gradlew :solr:core:test --tests "org.apache.solr.cloud.MultiThreadedOCPTest.testParallelCollectionAPICalls" -Ptests.jvms=96 "-Ptests.jvmargs=-XX:TieredStopAtLevel=1 -XX:+UseParallelGC -XX:ActiveProcessorCount=1 -XX:ReservedCodeCacheSize=120m" -Ptests.seed=1F36B9A38C2966D6 -Ptests.file.encoding=ISO-8859-1
- org.apache.solr.handler.TestSolrConfigHandlerConcurrent.test (:solr:core)
Test output: /tmp/src/solr/solr/core/build/test-results/test/outputs/OUTPUT-org.apache.solr.handler.TestSolrConfigHandlerConcurrent.txt
Reproduce with: gradlew :solr:core:test --tests "org.apache.solr.handler.TestSolrConfigHandlerConcurrent.test" -Ptests.jvms=96 "-Ptests.jvmargs=-XX:TieredStopAtLevel=1 -XX:+UseParallelGC -XX:ActiveProcessorCount=1 -XX:ReservedCodeCacheSize=120m" -Ptests.seed=1F36B9A38C2966D6 -Ptests.file.encoding=ISO-8859-1
- org.apache.solr.update.TestInPlaceUpdatesDistrib.test (:solr:core)
Test output: /tmp/src/solr/solr/core/build/test-results/test/outputs/OUTPUT-org.apache.solr.update.TestInPlaceUpdatesDistrib.txt
Reproduce with: gradlew :solr:core:test --tests "org.apache.solr.update.TestInPlaceUpdatesDistrib.test" -Ptests.jvms=96 "-Ptests.jvmargs=-XX:TieredStopAtLevel=1 -XX:+UseParallelGC -XX:ActiveProcessorCount=1 -XX:ReservedCodeCacheSize=120m" -Ptests.seed=1F36B9A38C2966D6 -Ptests.file.encoding=ISO-8859-1
- org.apache.solr.cloud.TestStressInPlaceUpdates.stressTest (:solr:core)
Test output: /tmp/src/solr/solr/core/build/test-results/test/outputs/OUTPUT-org.apache.solr.cloud.TestStressInPlaceUpdates.txt
Reproduce with: gradlew :solr:core:test --tests "org.apache.solr.cloud.TestStressInPlaceUpdates.stressTest" -Ptests.jvms=96 "-Ptests.jvmargs=-XX:TieredStopAtLevel=1 -XX:+UseParallelGC -XX:ActiveProcessorCount=1 -XX:ReservedCodeCacheSize=120m" -Ptests.seed=1F36B9A38C2966D6 -Ptests.file.encoding=ISO-8859-1
- org.apache.solr.cloud.HttpPartitionOnCommitTest.test (:solr:core)
Test output: /tmp/src/solr/solr/core/build/test-results/test/outputs/OUTPUT-org.apache.solr.cloud.HttpPartitionOnCommitTest.txt
Reproduce with: gradlew :solr:core:test --tests "org.apache.solr.cloud.HttpPartitionOnCommitTest.test" -Ptests.jvms=96 "-Ptests.jvmargs=-XX:TieredStopAtLevel=1 -XX:+UseParallelGC -XX:ActiveProcessorCount=1 -XX:ReservedCodeCacheSize=120m" -Ptests.seed=1F36B9A38C2966D6 -Ptests.file.encoding=ISO-8859-1
- org.apache.solr.handler.TestConfigReload.test (:solr:core)
Test output: /tmp/src/solr/solr/core/build/test-results/test/outputs/OUTPUT-org.apache.solr.handler.TestConfigReload.txt
Reproduce with: gradlew :solr:core:test --tests "org.apache.solr.handler.TestConfigReload.test" -Ptests.jvms=96 "-Ptests.jvmargs=-XX:TieredStopAtLevel=1 -XX:+UseParallelGC -XX:ActiveProcessorCount=1 -XX:ReservedCodeCacheSize=120m" -Ptests.seed=1F36B9A38C2966D6 -Ptests.file.encoding=ISO-8859-1
- org.apache.solr.handler.component.TestTrackingShardHandlerFactory.testRequestTracking (:solr:core)
Test output: /tmp/src/solr/solr/core/build/test-results/test/outputs/OUTPUT-org.apache.solr.handler.component.TestTrackingShardHandlerFactory.txt
Reproduce with: gradlew :solr:core:test --tests "org.apache.solr.handler.component.TestTrackingShardHandlerFactory.testRequestTracking" -Ptests.jvms=96 "-Ptests.jvmargs=-XX:TieredStopAtLevel=1 -XX:+UseParallelGC -XX:ActiveProcessorCount=1 -XX:ReservedCodeCacheSize=120m" -Ptests.seed=1F36B9A38C2966D6 -Ptests.file.encoding=ISO-8859-1
- org.apache.solr.security.TestAuthorizationFramework.authorizationFrameworkTest (:solr:core)
Test output: /tmp/src/solr/solr/core/build/test-results/test/outputs/OUTPUT-org.apache.solr.security.TestAuthorizationFramework.txt
Reproduce with: gradlew :solr:core:test --tests "org.apache.solr.security.TestAuthorizationFramework.authorizationFrameworkTest" -Ptests.jvms=96 "-Ptests.jvmargs=-XX:TieredStopAtLevel=1 -XX:+UseParallelGC -XX:ActiveProcessorCount=1 -XX:ReservedCodeCacheSize=120m" -Ptests.seed=1F36B9A38C2966D6 -Ptests.file.encoding=ISO-8859-1
- org.apache.solr.schema.TestCloudSchemaless.test (:solr:core)
Test output: /tmp/src/solr/solr/core/build/test-results/test/outputs/OUTPUT-org.apache.solr.schema.TestCloudSchemaless.txt
Reproduce with: gradlew :solr:core:test --tests "org.apache.solr.schema.TestCloudSchemaless.test" -Ptests.jvms=96 "-Ptests.jvmargs=-XX:TieredStopAtLevel=1 -XX:+UseParallelGC -XX:ActiveProcessorCount=1 -XX:ReservedCodeCacheSize=120m" -Ptests.seed=1F36B9A38C2966D6 -Ptests.file.encoding=ISO-8859-1
- org.apache.solr.handler.TestBlobHandler.doBlobHandlerTest (:solr:core)
Test output: /tmp/src/solr/solr/core/build/test-results/test/outputs/OUTPUT-org.apache.solr.handler.TestBlobHandler.txt
Reproduce with: gradlew :solr:core:test --tests "org.apache.solr.handler.TestBlobHandler.doBlobHandlerTest" -Ptests.jvms=96 "-Ptests.jvmargs=-XX:TieredStopAtLevel=1 -XX:+UseParallelGC -XX:ActiveProcessorCount=1 -XX:ReservedCodeCacheSize=120m" -Ptests.seed=1F36B9A38C2966D6 -Ptests.file.encoding=ISO-8859-1
- org.apache.solr.schema.TestBulkSchemaConcurrent.test (:solr:core)
Test output: /tmp/src/solr/solr/core/build/test-results/test/outputs/OUTPUT-org.apache.solr.schema.TestBulkSchemaConcurrent.txt
Reproduce with: gradlew :solr:core:test --tests "org.apache.solr.schema.TestBulkSchemaConcurrent.test" -Ptests.jvms=96 "-Ptests.jvmargs=-XX:TieredStopAtLevel=1 -XX:+UseParallelGC -XX:ActiveProcessorCount=1 -XX:ReservedCodeCacheSize=120m" -Ptests.seed=1F36B9A38C2966D6 -Ptests.file.encoding=ISO-8859-1
WARNING: there were unreferenced files under license folder:
- /tmp/src/solr/solr/licenses/jakarta.inject-2.6.1.jar.sha1
FAILURE: Build completed with 2 failures.
1: Task failed with an exception.
-----------
* What went wrong:
Execution failed for task ':solr:modules:hdfs:test'.
> There were failing tests. See the results at: file:///tmp/src/solr/solr/modules/hdfs/build/test-results/test/
* Try:
> Run with --scan to get full insights.
==============================================================================
2: Task failed with an exception.
-----------
* What went wrong:
Execution failed for task ':solr:core:test'.
> There were failing tests. See the results at: file:///tmp/src/solr/solr/core/build/test-results/test/
* Try:
> Run with --scan to get full insights.
==============================================================================
BUILD FAILED in 7m 54s
670 actionable tasks: 668 executed, 2 up-to-date
[0m[?12l[?25h
------------------------------------------------------------------------
Build Failed: returned 1
Total time: 8m18s
------------------------------------------------------------------------
+ status=1
+ ./crave pull '**/build/**/test/TEST-*.xml'
+ ./crave pull '**/*.events'
+ ./crave pull 'heapdumps/**'
Error: rsync: [sender] change_dir "/tmp/src/solr/heapdumps" failed: No such file or directory (2)
rsync error: some files/attrs were not transferred (see previous errors) (code 23) at main.c(1675) [Receiver=3.1.2]
rsync: [Receiver] write error: Broken pipe (32)
+ ./crave pull '**/hs_err_pid*'
+ exit 1
Build step 'Execute shell' marked build as failure
Archiving artifacts
Recording test results
ERROR: Step ‘Publish JUnit test result report’ failed: No test report files were found. Configuration error?
Email was triggered for: Failure - Any
Sending email for trigger: Failure - Any