You are viewing a plain text version of this content. The canonical link for it is here.
Posted to notifications@struts.apache.org by Apache Jenkins Server <je...@builds.apache.org> on 2024/01/22 07:51:17 UTC

Build failed in Jenkins: Struts » Struts-examples-dependency-check #109

See <https://ci-builds.apache.org/job/Struts/job/Struts-examples-dependency-check/109/display/redirect>

Changes:


------------------------------------------
Started by user Lukasz Lenart
Running as SYSTEM
[EnvInject] - Loading node environment variables.
Building remotely on builds34 (ubuntu) in workspace <https://ci-builds.apache.org/job/Struts/job/Struts-examples-dependency-check/ws/>
The recommended git tool is: NONE
No credentials specified
 > git rev-parse --resolve-git-dir <https://ci-builds.apache.org/job/Struts/job/Struts-examples-dependency-check/ws/.git> # timeout=10
Fetching changes from the remote Git repository
 > git config remote.origin.url https://gitbox.apache.org/repos/asf/struts-examples.git # timeout=10
Fetching upstream changes from https://gitbox.apache.org/repos/asf/struts-examples.git
 > git --version # timeout=10
 > git --version # 'git version 2.34.1'
 > git fetch --tags --force --progress -- https://gitbox.apache.org/repos/asf/struts-examples.git +refs/heads/*:refs/remotes/origin/* # timeout=10
 > git rev-parse refs/remotes/origin/master^{commit} # timeout=10
Checking out Revision 7ea0ecfab0809f147daf31ae53b84f8b5d5b4dfc (refs/remotes/origin/master)
 > git config core.sparsecheckout # timeout=10
 > git checkout -f 7ea0ecfab0809f147daf31ae53b84f8b5d5b4dfc # timeout=10
Commit message: "Merge pull request #308 from apache/fix/use-base-package"
 > git rev-list --no-walk 7ea0ecfab0809f147daf31ae53b84f8b5d5b4dfc # timeout=10
ERROR: No tool found matching MAVEN_3_LATEST__HOME
[Struts-examples-dependency-check] $ /bin/sh -xe /tmp/jenkins14132994394135786843.sh
+ export MAVEN_OPTS=-Xms2g -Xmx2g -XX:MaxPermSize=512m -XX:+CMSClassUnloadingEnabled
+ export PATH=:/home/jenkins/tools/java/latest17/bin:/usr/local/sbin:/usr/local/bin:/usr/sbin:/usr/bin:/sbin:/bin:/snap/bin
+ ./mvnw verify -Pdependency-check
Unrecognized VM option 'MaxPermSize=512m'
Error: Could not create the Java Virtual Machine.
Error: A fatal exception has occurred. Program will exit.
Build step 'Execute shell' marked build as failure
ERROR: No tool found matching MAVEN_3_LATEST__HOME

Build failed in Jenkins: Struts » Struts-examples-dependency-check #120

Posted by Apache Jenkins Server <je...@builds.apache.org>.
See <https://ci-builds.apache.org/job/Struts/job/Struts-examples-dependency-check/120/display/redirect>

Changes:


------------------------------------------
[...truncated 24.50 KB...]
[INFO] Created CPE Index (3 seconds)
[INFO] Finished CPE Analyzer (3 seconds)
[INFO] Finished False Positive Analyzer (0 seconds)
[INFO] Finished NVD CVE Analyzer (0 seconds)
[INFO] Finished RetireJS Analyzer (0 seconds)
[INFO] Finished Sonatype OSS Index Analyzer (0 seconds)
[INFO] Finished Vulnerability Suppression Analyzer (0 seconds)
[INFO] Finished Dependency Bundling Analyzer (0 seconds)
[INFO] Analysis Complete (4 seconds)
[INFO] Writing report to: <https://ci-builds.apache.org/job/Struts/job/Struts-examples-dependency-check/ws/annotations/target/dependency-check-report.html>
[WARNING] 

One or more dependencies were identified with known vulnerabilities in Annotations with Convention Plugin:

commons-fileupload-1.5.jar (pkg:maven/commons-fileupload/commons-fileupload@1.5, cpe:2.3:a:apache:commons_fileupload:1.5:*:*:*:*:*:*:*, cpe:2.3:a:apache:commons_net:1.5:*:*:*:*:*:*:*) : CVE-2021-37533
commons-io-2.13.0.jar (pkg:maven/commons-io/commons-io@2.13.0, cpe:2.3:a:apache:commons_io:2.13.0:*:*:*:*:*:*:*, cpe:2.3:a:apache:commons_net:2.13.0:*:*:*:*:*:*:*) : CVE-2021-37533
commons-text-1.10.0.jar (pkg:maven/org.apache.commons/commons-text@1.10.0, cpe:2.3:a:apache:commons_net:1.10.0:*:*:*:*:*:*:*, cpe:2.3:a:apache:commons_text:1.10.0:*:*:*:*:*:*:*) : CVE-2021-37533


See the dependency-check report for more details.


[INFO] 
[INFO] -------------------< org.apache.struts:basic-struts >-------------------
[INFO] Building Basic Struts2 Example 1.1.0                              [4/47]
[INFO]   from basic-struts/pom.xml
[INFO] --------------------------------[ war ]---------------------------------
[INFO] 
[INFO] --- resources:3.3.1:resources (default-resources) @ basic-struts ---
[INFO] Copying 2 resources from src/main/resources to target/classes
[INFO] 
[INFO] --- compiler:3.11.0:compile (default-compile) @ basic-struts ---
[INFO] No sources to compile
[INFO] 
[INFO] --- resources:3.3.1:testResources (default-testResources) @ basic-struts ---
[INFO] skip non existing resourceDirectory <https://ci-builds.apache.org/job/Struts/job/Struts-examples-dependency-check/ws/basic-struts/src/test/resources>
[INFO] 
[INFO] --- compiler:3.11.0:testCompile (default-testCompile) @ basic-struts ---
[INFO] No sources to compile
[INFO] 
[INFO] --- surefire:3.1.2:test (default-test) @ basic-struts ---
[INFO] No tests to run.
[INFO] 
[INFO] --- war:3.4.0:war (default-war) @ basic-struts ---
[INFO] Packaging webapp
[INFO] Assembling webapp [basic-struts] in [<https://ci-builds.apache.org/job/Struts/job/Struts-examples-dependency-check/ws/basic-struts/target/basic-struts]>
[INFO] Processing war project
[INFO] Copying webapp resources [<https://ci-builds.apache.org/job/Struts/job/Struts-examples-dependency-check/ws/basic-struts/src/main/webapp]>
[INFO] Building war: <https://ci-builds.apache.org/job/Struts/job/Struts-examples-dependency-check/ws/basic-struts/target/basic-struts.war>
[INFO] 
[INFO] --- dependency-check:7.2.1:check (default) @ basic-struts ---
[INFO] Checking for updates
[INFO] Skipping NVD check since last check was within 4 hours.
[INFO] Skipping RetireJS update since last update was within 24 hours.
[INFO] Check for updates complete (44 ms)
[INFO] 

Dependency-Check is an open source tool performing a best effort analysis of 3rd party dependencies; false positives and false negatives may exist in the analysis performed by the tool. Use of the tool and the reporting provided constitutes acceptance for use in an AS IS condition, and there are NO warranties, implied or otherwise, with regard to the analysis or its use. Any use of the tool and the reporting provided is at the user’s risk. In no event shall the copyright holder or OWASP be held liable for any damages whatsoever arising out of or in connection with the use of this tool, the analysis performed, or the resulting report.


   About ODC: https://jeremylong.github.io/DependencyCheck/general/internals.html
   False Positives: https://jeremylong.github.io/DependencyCheck/general/suppression.html

💖 Sponsor: https://github.com/sponsors/jeremylong


[INFO] Analysis Started
[INFO] Finished Archive Analyzer (0 seconds)
[INFO] Finished File Name Analyzer (0 seconds)
[INFO] Finished Jar Analyzer (0 seconds)
[INFO] Finished Dependency Merging Analyzer (0 seconds)
[INFO] Finished Version Filter Analyzer (0 seconds)
[INFO] Finished Hint Analyzer (0 seconds)
[INFO] Created CPE Index (2 seconds)
[INFO] Finished CPE Analyzer (3 seconds)
[INFO] Finished False Positive Analyzer (0 seconds)
[INFO] Finished NVD CVE Analyzer (0 seconds)
[INFO] Finished RetireJS Analyzer (0 seconds)
[INFO] Finished Sonatype OSS Index Analyzer (0 seconds)
[INFO] Finished Vulnerability Suppression Analyzer (0 seconds)
[INFO] Finished Dependency Bundling Analyzer (0 seconds)
[INFO] Analysis Complete (3 seconds)
[INFO] Writing report to: <https://ci-builds.apache.org/job/Struts/job/Struts-examples-dependency-check/ws/basic-struts/target/dependency-check-report.html>
[WARNING] 

One or more dependencies were identified with known vulnerabilities in Basic Struts2 Example:

commons-fileupload-1.5.jar (pkg:maven/commons-fileupload/commons-fileupload@1.5, cpe:2.3:a:apache:commons_fileupload:1.5:*:*:*:*:*:*:*, cpe:2.3:a:apache:commons_net:1.5:*:*:*:*:*:*:*) : CVE-2021-37533
commons-io-2.13.0.jar (pkg:maven/commons-io/commons-io@2.13.0, cpe:2.3:a:apache:commons_io:2.13.0:*:*:*:*:*:*:*, cpe:2.3:a:apache:commons_net:2.13.0:*:*:*:*:*:*:*) : CVE-2021-37533
commons-text-1.10.0.jar (pkg:maven/org.apache.commons/commons-text@1.10.0, cpe:2.3:a:apache:commons_net:1.10.0:*:*:*:*:*:*:*, cpe:2.3:a:apache:commons_text:1.10.0:*:*:*:*:*:*:*) : CVE-2021-37533


See the dependency-check report for more details.


[INFO] 
[INFO] -----------------< org.apache.struts:bean-validation >------------------
[INFO] Building Bean Validation 1.1.0                                    [5/47]
[INFO]   from bean-validation/pom.xml
[INFO] --------------------------------[ war ]---------------------------------
[INFO] 
[INFO] --- resources:3.3.1:resources (default-resources) @ bean-validation ---
[INFO] Copying 3 resources from src/main/resources to target/classes
[INFO] 
[INFO] --- compiler:3.11.0:compile (default-compile) @ bean-validation ---
[INFO] Changes detected - recompiling the module! :source
[INFO] Compiling 5 source files with javac [debug target 17] to target/classes
[INFO] <https://ci-builds.apache.org/job/Struts/job/Struts-examples-dependency-check/ws/bean-validation/src/main/java/org/apache/struts/edit/model/Person.java>: <https://ci-builds.apache.org/job/Struts/job/Struts-examples-dependency-check/ws/bean-validation/src/main/java/org/apache/struts/edit/model/Person.java> uses or overrides a deprecated API.
[INFO] <https://ci-builds.apache.org/job/Struts/job/Struts-examples-dependency-check/ws/bean-validation/src/main/java/org/apache/struts/edit/model/Person.java>: Recompile with -Xlint:deprecation for details.
[INFO] 
[INFO] --- resources:3.3.1:testResources (default-testResources) @ bean-validation ---
[INFO] skip non existing resourceDirectory <https://ci-builds.apache.org/job/Struts/job/Struts-examples-dependency-check/ws/bean-validation/src/test/resources>
[INFO] 
[INFO] --- compiler:3.11.0:testCompile (default-testCompile) @ bean-validation ---
[INFO] No sources to compile
[INFO] 
[INFO] --- surefire:3.1.2:test (default-test) @ bean-validation ---
[INFO] No tests to run.
[INFO] 
[INFO] --- war:3.4.0:war (default-war) @ bean-validation ---
[INFO] Packaging webapp
[INFO] Assembling webapp [bean-validation] in [<https://ci-builds.apache.org/job/Struts/job/Struts-examples-dependency-check/ws/bean-validation/target/bean-validation]>
[INFO] Processing war project
[INFO] Copying webapp resources [<https://ci-builds.apache.org/job/Struts/job/Struts-examples-dependency-check/ws/bean-validation/src/main/webapp]>
[INFO] Building war: <https://ci-builds.apache.org/job/Struts/job/Struts-examples-dependency-check/ws/bean-validation/target/bean-validation.war>
[INFO] 
[INFO] --- dependency-check:7.2.1:check (default) @ bean-validation ---
[INFO] Checking for updates
[INFO] Skipping NVD check since last check was within 4 hours.
[INFO] Skipping RetireJS update since last update was within 24 hours.
[INFO] Check for updates complete (38 ms)
[INFO] 

Dependency-Check is an open source tool performing a best effort analysis of 3rd party dependencies; false positives and false negatives may exist in the analysis performed by the tool. Use of the tool and the reporting provided constitutes acceptance for use in an AS IS condition, and there are NO warranties, implied or otherwise, with regard to the analysis or its use. Any use of the tool and the reporting provided is at the user’s risk. In no event shall the copyright holder or OWASP be held liable for any damages whatsoever arising out of or in connection with the use of this tool, the analysis performed, or the resulting report.


   About ODC: https://jeremylong.github.io/DependencyCheck/general/internals.html
   False Positives: https://jeremylong.github.io/DependencyCheck/general/suppression.html

💖 Sponsor: https://github.com/sponsors/jeremylong


[INFO] Analysis Started
[INFO] Finished Archive Analyzer (0 seconds)
[INFO] Finished File Name Analyzer (0 seconds)
[INFO] Finished Jar Analyzer (0 seconds)
[INFO] Finished Dependency Merging Analyzer (0 seconds)
[INFO] Finished Version Filter Analyzer (0 seconds)
[INFO] Finished Hint Analyzer (0 seconds)
[INFO] Created CPE Index (3 seconds)
[INFO] Finished CPE Analyzer (3 seconds)
[INFO] Finished False Positive Analyzer (0 seconds)
[INFO] Finished NVD CVE Analyzer (0 seconds)
[INFO] Finished RetireJS Analyzer (0 seconds)
[INFO] Finished Sonatype OSS Index Analyzer (0 seconds)
[INFO] Finished Vulnerability Suppression Analyzer (0 seconds)
[INFO] Finished Dependency Bundling Analyzer (0 seconds)
[INFO] Analysis Complete (4 seconds)
[INFO] Writing report to: <https://ci-builds.apache.org/job/Struts/job/Struts-examples-dependency-check/ws/bean-validation/target/dependency-check-report.html>
[WARNING] 

One or more dependencies were identified with known vulnerabilities in Bean Validation:

commons-fileupload-1.5.jar (pkg:maven/commons-fileupload/commons-fileupload@1.5, cpe:2.3:a:apache:commons_fileupload:1.5:*:*:*:*:*:*:*, cpe:2.3:a:apache:commons_net:1.5:*:*:*:*:*:*:*) : CVE-2021-37533
commons-io-2.13.0.jar (pkg:maven/commons-io/commons-io@2.13.0, cpe:2.3:a:apache:commons_io:2.13.0:*:*:*:*:*:*:*, cpe:2.3:a:apache:commons_net:2.13.0:*:*:*:*:*:*:*) : CVE-2021-37533
commons-text-1.10.0.jar (pkg:maven/org.apache.commons/commons-text@1.10.0, cpe:2.3:a:apache:commons_net:1.10.0:*:*:*:*:*:*:*, cpe:2.3:a:apache:commons_text:1.10.0:*:*:*:*:*:*:*) : CVE-2021-37533
javax.el-3.0.1-b12.jar (pkg:maven/org.glassfish/javax.el@3.0.1-b12) : CVE-2021-28170


See the dependency-check report for more details.


[INFO] ------------------------------------------------------------------------
[INFO] Reactor Summary for Struts 2 Examples 1.1.0:
[INFO] 
[INFO] Struts 2 Examples .................................. SUCCESS [05:03 min]
[INFO] Action chaining .................................... SUCCESS [  7.529 s]
[INFO] Annotations with Convention Plugin ................. SUCCESS [  6.317 s]
[INFO] Basic Struts2 Example .............................. SUCCESS [  4.791 s]
[INFO] Bean Validation .................................... FAILURE [  6.666 s]
[INFO] Struts 2 Blank Webapp .............................. SKIPPED
[INFO] Coding Struts 2 Action ............................. SKIPPED
[INFO] Control Tags ....................................... SKIPPED
[INFO] CRUD Example ....................................... SKIPPED
[INFO] Debugging Struts ................................... SKIPPED
[INFO] Dynamic Url ........................................ SKIPPED
[INFO] Exception handling ................................. SKIPPED
[INFO] Exclude Parameters ................................. SKIPPED
[INFO] Expression Cache ................................... SKIPPED
[INFO] File upload ........................................ SKIPPED
[INFO] Form Processing .................................... SKIPPED
[INFO] Form Tags .......................................... SKIPPED
[INFO] Form validation .................................... SKIPPED
[INFO] XML based form validation .......................... SKIPPED
[INFO] Hello World Struts 2 Example Application ........... SKIPPED
[INFO] Http Session ....................................... SKIPPED
[INFO] Struts 2 Interceptors .............................. SKIPPED
[INFO] jfreechart ......................................... SKIPPED
[INFO] JSON produce/consume ............................... SKIPPED
[INFO] Customized JSON produce ............................ SKIPPED
[INFO] Struts 2 Mail Reader Webapp ........................ SKIPPED
[INFO] Message resource ................................... SKIPPED
[INFO] Message Store ...................................... SKIPPED
[INFO] Portlet Webapp ..................................... SKIPPED
[INFO] Preparable Interface ............................... SKIPPED
[INFO] Struts 2 Quarkus ................................... SKIPPED
[INFO] REST to Action Mapper Example Application .......... SKIPPED
[INFO] REST Plugin based application with AngularJS ....... SKIPPED
[INFO] Struts2 with Basic Shiro Security Integration ...... SKIPPED
[INFO] Struts2 with Spring Integration .................... SKIPPED
[INFO] Custom TextProvider ................................ SKIPPED
[INFO] Struts Tiles Example ............................... SKIPPED
[INFO] Struts 2 Themes .................................... SKIPPED
[INFO] Struts 2 Themes Override ........................... SKIPPED
[INFO] Type Conversion .................................... SKIPPED
[INFO] Unit Testing ....................................... SKIPPED
[INFO] Unknown handler .................................... SKIPPED
[INFO] Using Struts 2 Tags ................................ SKIPPED
[INFO] validation-messages ................................ SKIPPED
[INFO] Wildcard Method Selection .......................... SKIPPED
[INFO] Wildcard RegEx pattern matching .................... SKIPPED
[INFO] JasperReports Tutorial ............................. SKIPPED
[INFO] ------------------------------------------------------------------------
[INFO] BUILD FAILURE
[INFO] ------------------------------------------------------------------------
[INFO] Total time:  05:31 min
[INFO] Finished at: 2024-03-01T22:04:42Z
[INFO] ------------------------------------------------------------------------
[ERROR] Failed to execute goal org.owasp:dependency-check-maven:7.2.1:check (default) on project bean-validation: 
[ERROR] 
[ERROR] One or more dependencies were identified with vulnerabilities that have a CVSS score greater than or equal to '7.0': 
[ERROR] 
[ERROR] javax.el-3.0.1-b12.jar: CVE-2021-28170(7.5)
[ERROR] 
[ERROR] See the dependency-check report for more details.
[ERROR] 
[ERROR] 
[ERROR] -> [Help 1]
[ERROR] 
[ERROR] To see the full stack trace of the errors, re-run Maven with the -e switch.
[ERROR] Re-run Maven using the -X switch to enable full debug logging.
[ERROR] 
[ERROR] For more information about the errors and possible solutions, please read the following articles:
[ERROR] [Help 1] http://cwiki.apache.org/confluence/display/MAVEN/MojoFailureException
[ERROR] 
[ERROR] After correcting the problems, you can resume the build with the command
[ERROR]   mvn <args> -rf :bean-validation
Build step 'Execute shell' marked build as failure
Setting MAVEN_3_LATEST_HOME=/home/jenkins/tools/maven/latest3

Build failed in Jenkins: Struts » Struts-examples-dependency-check #119

Posted by Apache Jenkins Server <je...@builds.apache.org>.
See <https://ci-builds.apache.org/job/Struts/job/Struts-examples-dependency-check/119/display/redirect?page=changes>

Changes:

[github] Bump org.apache.maven.plugins:maven-failsafe-plugin from 3.2.3 to 3.2.5

[github] Bump actions/cache from 3.3.2 to 4.0.0

[github] Bump org.slf4j:slf4j-simple from 2.0.10 to 2.0.12

[github] Bump net.sf.jasperreports:jasperreports from 6.21.0 to 6.21.2

[github] Bump io.quarkus:quarkus-universe-bom from 3.6.4 to 3.7.3

[github] Bump org.springframework:spring-web from 6.1.2 to 6.1.4

[Lukasz Lenart] Drops unsupported plugin by the latest Maven

[Lukasz Lenart] Uses proper DTD reference

[Lukasz Lenart] Upgrades Maven wrapper to ver 3.9.5


------------------------------------------
[...truncated 23.91 KB...]
[INFO] Finished Dependency Merging Analyzer (0 seconds)
[INFO] Finished Version Filter Analyzer (0 seconds)
[INFO] Finished Hint Analyzer (0 seconds)
[INFO] Created CPE Index (2 seconds)
[INFO] Finished CPE Analyzer (2 seconds)
[INFO] Finished False Positive Analyzer (0 seconds)
[INFO] Finished NVD CVE Analyzer (0 seconds)
[INFO] Finished RetireJS Analyzer (0 seconds)
[INFO] Finished Sonatype OSS Index Analyzer (0 seconds)
[INFO] Finished Vulnerability Suppression Analyzer (0 seconds)
[INFO] Finished Dependency Bundling Analyzer (0 seconds)
[INFO] Analysis Complete (3 seconds)
[INFO] Writing report to: <https://ci-builds.apache.org/job/Struts/job/Struts-examples-dependency-check/ws/annotations/target/dependency-check-report.html>
[WARNING] 

One or more dependencies were identified with known vulnerabilities in Annotations with Convention Plugin:

commons-fileupload-1.5.jar (pkg:maven/commons-fileupload/commons-fileupload@1.5, cpe:2.3:a:apache:commons_fileupload:1.5:*:*:*:*:*:*:*, cpe:2.3:a:apache:commons_net:1.5:*:*:*:*:*:*:*) : CVE-2021-37533
commons-io-2.13.0.jar (pkg:maven/commons-io/commons-io@2.13.0, cpe:2.3:a:apache:commons_io:2.13.0:*:*:*:*:*:*:*, cpe:2.3:a:apache:commons_net:2.13.0:*:*:*:*:*:*:*) : CVE-2021-37533
commons-text-1.10.0.jar (pkg:maven/org.apache.commons/commons-text@1.10.0, cpe:2.3:a:apache:commons_net:1.10.0:*:*:*:*:*:*:*, cpe:2.3:a:apache:commons_text:1.10.0:*:*:*:*:*:*:*) : CVE-2021-37533


See the dependency-check report for more details.


[INFO] 
[INFO] -------------------< org.apache.struts:basic-struts >-------------------
[INFO] Building Basic Struts2 Example 1.1.0                              [4/47]
[INFO]   from basic-struts/pom.xml
[INFO] --------------------------------[ war ]---------------------------------
[INFO] 
[INFO] --- resources:3.3.1:resources (default-resources) @ basic-struts ---
[INFO] Copying 2 resources from src/main/resources to target/classes
[INFO] 
[INFO] --- compiler:3.11.0:compile (default-compile) @ basic-struts ---
[INFO] No sources to compile
[INFO] 
[INFO] --- resources:3.3.1:testResources (default-testResources) @ basic-struts ---
[INFO] skip non existing resourceDirectory <https://ci-builds.apache.org/job/Struts/job/Struts-examples-dependency-check/ws/basic-struts/src/test/resources>
[INFO] 
[INFO] --- compiler:3.11.0:testCompile (default-testCompile) @ basic-struts ---
[INFO] No sources to compile
[INFO] 
[INFO] --- surefire:3.1.2:test (default-test) @ basic-struts ---
[INFO] No tests to run.
[INFO] 
[INFO] --- war:3.4.0:war (default-war) @ basic-struts ---
[INFO] Packaging webapp
[INFO] Assembling webapp [basic-struts] in [<https://ci-builds.apache.org/job/Struts/job/Struts-examples-dependency-check/ws/basic-struts/target/basic-struts]>
[INFO] Processing war project
[INFO] Copying webapp resources [<https://ci-builds.apache.org/job/Struts/job/Struts-examples-dependency-check/ws/basic-struts/src/main/webapp]>
[INFO] Building war: <https://ci-builds.apache.org/job/Struts/job/Struts-examples-dependency-check/ws/basic-struts/target/basic-struts.war>
[INFO] 
[INFO] --- dependency-check:7.2.1:check (default) @ basic-struts ---
[INFO] Checking for updates
[INFO] Skipping NVD check since last check was within 4 hours.
[INFO] Skipping RetireJS update since last update was within 24 hours.
[INFO] Check for updates complete (65 ms)
[INFO] 

Dependency-Check is an open source tool performing a best effort analysis of 3rd party dependencies; false positives and false negatives may exist in the analysis performed by the tool. Use of the tool and the reporting provided constitutes acceptance for use in an AS IS condition, and there are NO warranties, implied or otherwise, with regard to the analysis or its use. Any use of the tool and the reporting provided is at the user’s risk. In no event shall the copyright holder or OWASP be held liable for any damages whatsoever arising out of or in connection with the use of this tool, the analysis performed, or the resulting report.


   About ODC: https://jeremylong.github.io/DependencyCheck/general/internals.html
   False Positives: https://jeremylong.github.io/DependencyCheck/general/suppression.html

💖 Sponsor: https://github.com/sponsors/jeremylong


[INFO] Analysis Started
[INFO] Finished Archive Analyzer (0 seconds)
[INFO] Finished File Name Analyzer (0 seconds)
[INFO] Finished Jar Analyzer (0 seconds)
[INFO] Finished Dependency Merging Analyzer (0 seconds)
[INFO] Finished Version Filter Analyzer (0 seconds)
[INFO] Finished Hint Analyzer (0 seconds)
[INFO] Created CPE Index (2 seconds)
[INFO] Finished CPE Analyzer (2 seconds)
[INFO] Finished False Positive Analyzer (0 seconds)
[INFO] Finished NVD CVE Analyzer (0 seconds)
[INFO] Finished RetireJS Analyzer (0 seconds)
[INFO] Finished Sonatype OSS Index Analyzer (0 seconds)
[INFO] Finished Vulnerability Suppression Analyzer (0 seconds)
[INFO] Finished Dependency Bundling Analyzer (0 seconds)
[INFO] Analysis Complete (2 seconds)
[INFO] Writing report to: <https://ci-builds.apache.org/job/Struts/job/Struts-examples-dependency-check/ws/basic-struts/target/dependency-check-report.html>
[WARNING] 

One or more dependencies were identified with known vulnerabilities in Basic Struts2 Example:

commons-fileupload-1.5.jar (pkg:maven/commons-fileupload/commons-fileupload@1.5, cpe:2.3:a:apache:commons_fileupload:1.5:*:*:*:*:*:*:*, cpe:2.3:a:apache:commons_net:1.5:*:*:*:*:*:*:*) : CVE-2021-37533
commons-io-2.13.0.jar (pkg:maven/commons-io/commons-io@2.13.0, cpe:2.3:a:apache:commons_io:2.13.0:*:*:*:*:*:*:*, cpe:2.3:a:apache:commons_net:2.13.0:*:*:*:*:*:*:*) : CVE-2021-37533
commons-text-1.10.0.jar (pkg:maven/org.apache.commons/commons-text@1.10.0, cpe:2.3:a:apache:commons_net:1.10.0:*:*:*:*:*:*:*, cpe:2.3:a:apache:commons_text:1.10.0:*:*:*:*:*:*:*) : CVE-2021-37533


See the dependency-check report for more details.


[INFO] 
[INFO] -----------------< org.apache.struts:bean-validation >------------------
[INFO] Building Bean Validation 1.1.0                                    [5/47]
[INFO]   from bean-validation/pom.xml
[INFO] --------------------------------[ war ]---------------------------------
[INFO] 
[INFO] --- resources:3.3.1:resources (default-resources) @ bean-validation ---
[INFO] Copying 3 resources from src/main/resources to target/classes
[INFO] 
[INFO] --- compiler:3.11.0:compile (default-compile) @ bean-validation ---
[INFO] Nothing to compile - all classes are up to date
[INFO] 
[INFO] --- resources:3.3.1:testResources (default-testResources) @ bean-validation ---
[INFO] skip non existing resourceDirectory <https://ci-builds.apache.org/job/Struts/job/Struts-examples-dependency-check/ws/bean-validation/src/test/resources>
[INFO] 
[INFO] --- compiler:3.11.0:testCompile (default-testCompile) @ bean-validation ---
[INFO] No sources to compile
[INFO] 
[INFO] --- surefire:3.1.2:test (default-test) @ bean-validation ---
[INFO] No tests to run.
[INFO] 
[INFO] --- war:3.4.0:war (default-war) @ bean-validation ---
[INFO] Packaging webapp
[INFO] Assembling webapp [bean-validation] in [<https://ci-builds.apache.org/job/Struts/job/Struts-examples-dependency-check/ws/bean-validation/target/bean-validation]>
[INFO] Processing war project
[INFO] Copying webapp resources [<https://ci-builds.apache.org/job/Struts/job/Struts-examples-dependency-check/ws/bean-validation/src/main/webapp]>
[INFO] Building war: <https://ci-builds.apache.org/job/Struts/job/Struts-examples-dependency-check/ws/bean-validation/target/bean-validation.war>
[INFO] 
[INFO] --- dependency-check:7.2.1:check (default) @ bean-validation ---
[INFO] Checking for updates
[INFO] Skipping NVD check since last check was within 4 hours.
[INFO] Skipping RetireJS update since last update was within 24 hours.
[INFO] Check for updates complete (62 ms)
[INFO] 

Dependency-Check is an open source tool performing a best effort analysis of 3rd party dependencies; false positives and false negatives may exist in the analysis performed by the tool. Use of the tool and the reporting provided constitutes acceptance for use in an AS IS condition, and there are NO warranties, implied or otherwise, with regard to the analysis or its use. Any use of the tool and the reporting provided is at the user’s risk. In no event shall the copyright holder or OWASP be held liable for any damages whatsoever arising out of or in connection with the use of this tool, the analysis performed, or the resulting report.


   About ODC: https://jeremylong.github.io/DependencyCheck/general/internals.html
   False Positives: https://jeremylong.github.io/DependencyCheck/general/suppression.html

💖 Sponsor: https://github.com/sponsors/jeremylong


[INFO] Analysis Started
[INFO] Finished Archive Analyzer (0 seconds)
[INFO] Finished File Name Analyzer (0 seconds)
[INFO] Finished Jar Analyzer (0 seconds)
[INFO] Finished Dependency Merging Analyzer (0 seconds)
[INFO] Finished Version Filter Analyzer (0 seconds)
[INFO] Finished Hint Analyzer (0 seconds)
[INFO] Created CPE Index (1 seconds)
[INFO] Finished CPE Analyzer (2 seconds)
[INFO] Finished False Positive Analyzer (0 seconds)
[INFO] Finished NVD CVE Analyzer (0 seconds)
[INFO] Finished RetireJS Analyzer (0 seconds)
[INFO] Finished Sonatype OSS Index Analyzer (0 seconds)
[INFO] Finished Vulnerability Suppression Analyzer (0 seconds)
[INFO] Finished Dependency Bundling Analyzer (0 seconds)
[INFO] Analysis Complete (3 seconds)
[INFO] Writing report to: <https://ci-builds.apache.org/job/Struts/job/Struts-examples-dependency-check/ws/bean-validation/target/dependency-check-report.html>
[WARNING] 

One or more dependencies were identified with known vulnerabilities in Bean Validation:

commons-fileupload-1.5.jar (pkg:maven/commons-fileupload/commons-fileupload@1.5, cpe:2.3:a:apache:commons_fileupload:1.5:*:*:*:*:*:*:*, cpe:2.3:a:apache:commons_net:1.5:*:*:*:*:*:*:*) : CVE-2021-37533
commons-io-2.13.0.jar (pkg:maven/commons-io/commons-io@2.13.0, cpe:2.3:a:apache:commons_io:2.13.0:*:*:*:*:*:*:*, cpe:2.3:a:apache:commons_net:2.13.0:*:*:*:*:*:*:*) : CVE-2021-37533
commons-text-1.10.0.jar (pkg:maven/org.apache.commons/commons-text@1.10.0, cpe:2.3:a:apache:commons_net:1.10.0:*:*:*:*:*:*:*, cpe:2.3:a:apache:commons_text:1.10.0:*:*:*:*:*:*:*) : CVE-2021-37533
javax.el-3.0.1-b12.jar (pkg:maven/org.glassfish/javax.el@3.0.1-b12) : CVE-2021-28170


See the dependency-check report for more details.


[INFO] ------------------------------------------------------------------------
[INFO] Reactor Summary for Struts 2 Examples 1.1.0:
[INFO] 
[INFO] Struts 2 Examples .................................. SUCCESS [05:25 min]
[INFO] Action chaining .................................... SUCCESS [  7.535 s]
[INFO] Annotations with Convention Plugin ................. SUCCESS [  5.939 s]
[INFO] Basic Struts2 Example .............................. SUCCESS [  4.718 s]
[INFO] Bean Validation .................................... FAILURE [  7.517 s]
[INFO] Struts 2 Blank Webapp .............................. SKIPPED
[INFO] Coding Struts 2 Action ............................. SKIPPED
[INFO] Control Tags ....................................... SKIPPED
[INFO] CRUD Example ....................................... SKIPPED
[INFO] Debugging Struts ................................... SKIPPED
[INFO] Dynamic Url ........................................ SKIPPED
[INFO] Exception handling ................................. SKIPPED
[INFO] Exclude Parameters ................................. SKIPPED
[INFO] Expression Cache ................................... SKIPPED
[INFO] File upload ........................................ SKIPPED
[INFO] Form Processing .................................... SKIPPED
[INFO] Form Tags .......................................... SKIPPED
[INFO] Form validation .................................... SKIPPED
[INFO] XML based form validation .......................... SKIPPED
[INFO] Hello World Struts 2 Example Application ........... SKIPPED
[INFO] Http Session ....................................... SKIPPED
[INFO] Struts 2 Interceptors .............................. SKIPPED
[INFO] jfreechart ......................................... SKIPPED
[INFO] JSON produce/consume ............................... SKIPPED
[INFO] Customized JSON produce ............................ SKIPPED
[INFO] Struts 2 Mail Reader Webapp ........................ SKIPPED
[INFO] Message resource ................................... SKIPPED
[INFO] Message Store ...................................... SKIPPED
[INFO] Portlet Webapp ..................................... SKIPPED
[INFO] Preparable Interface ............................... SKIPPED
[INFO] Struts 2 Quarkus ................................... SKIPPED
[INFO] REST to Action Mapper Example Application .......... SKIPPED
[INFO] REST Plugin based application with AngularJS ....... SKIPPED
[INFO] Struts2 with Basic Shiro Security Integration ...... SKIPPED
[INFO] Struts2 with Spring Integration .................... SKIPPED
[INFO] Custom TextProvider ................................ SKIPPED
[INFO] Struts Tiles Example ............................... SKIPPED
[INFO] Struts 2 Themes .................................... SKIPPED
[INFO] Struts 2 Themes Override ........................... SKIPPED
[INFO] Type Conversion .................................... SKIPPED
[INFO] Unit Testing ....................................... SKIPPED
[INFO] Unknown handler .................................... SKIPPED
[INFO] Using Struts 2 Tags ................................ SKIPPED
[INFO] validation-messages ................................ SKIPPED
[INFO] Wildcard Method Selection .......................... SKIPPED
[INFO] Wildcard RegEx pattern matching .................... SKIPPED
[INFO] JasperReports Tutorial ............................. SKIPPED
[INFO] ------------------------------------------------------------------------
[INFO] BUILD FAILURE
[INFO] ------------------------------------------------------------------------
[INFO] Total time:  05:55 min
[INFO] Finished at: 2024-02-29T22:05:53Z
[INFO] ------------------------------------------------------------------------
[ERROR] Failed to execute goal org.owasp:dependency-check-maven:7.2.1:check (default) on project bean-validation: 
[ERROR] 
[ERROR] One or more dependencies were identified with vulnerabilities that have a CVSS score greater than or equal to '7.0': 
[ERROR] 
[ERROR] javax.el-3.0.1-b12.jar: CVE-2021-28170(7.5)
[ERROR] 
[ERROR] See the dependency-check report for more details.
[ERROR] 
[ERROR] 
[ERROR] -> [Help 1]
[ERROR] 
[ERROR] To see the full stack trace of the errors, re-run Maven with the -e switch.
[ERROR] Re-run Maven using the -X switch to enable full debug logging.
[ERROR] 
[ERROR] For more information about the errors and possible solutions, please read the following articles:
[ERROR] [Help 1] http://cwiki.apache.org/confluence/display/MAVEN/MojoFailureException
[ERROR] 
[ERROR] After correcting the problems, you can resume the build with the command
[ERROR]   mvn <args> -rf :bean-validation
Build step 'Execute shell' marked build as failure
Setting MAVEN_3_LATEST_HOME=/home/jenkins/tools/maven/latest3

Build failed in Jenkins: Struts » Struts-examples-dependency-check #118

Posted by Apache Jenkins Server <je...@builds.apache.org>.
See <https://ci-builds.apache.org/job/Struts/job/Struts-examples-dependency-check/118/display/redirect>

Changes:


------------------------------------------
[...truncated 82.07 KB...]
[INFO] Building Basic Struts2 Example 1.1.0                              [4/47]
[INFO] --------------------------------[ war ]---------------------------------
[INFO] 
[INFO] --- maven-resources-plugin:2.6:resources (default-resources) @ basic-struts ---
[INFO] Using 'UTF-8' encoding to copy filtered resources.
[INFO] Copying 2 resources
[INFO] 
[INFO] --- maven-compiler-plugin:3.1:compile (default-compile) @ basic-struts ---
[INFO] No sources to compile
[INFO] 
[INFO] --- maven-resources-plugin:2.6:testResources (default-testResources) @ basic-struts ---
[INFO] Using 'UTF-8' encoding to copy filtered resources.
[INFO] skip non existing resourceDirectory <https://ci-builds.apache.org/job/Struts/job/Struts-examples-dependency-check/ws/basic-struts/src/test/resources>
[INFO] 
[INFO] --- maven-compiler-plugin:3.1:testCompile (default-testCompile) @ basic-struts ---
[INFO] No sources to compile
[INFO] 
[INFO] --- maven-surefire-plugin:2.12.4:test (default-test) @ basic-struts ---
[INFO] No tests to run.
[INFO] 
[INFO] --- maven-war-plugin:3.4.0:war (default-war) @ basic-struts ---
[INFO] Packaging webapp
[INFO] Assembling webapp [basic-struts] in [<https://ci-builds.apache.org/job/Struts/job/Struts-examples-dependency-check/ws/basic-struts/target/basic-struts]>
[INFO] Processing war project
[INFO] Copying webapp resources [<https://ci-builds.apache.org/job/Struts/job/Struts-examples-dependency-check/ws/basic-struts/src/main/webapp]>
[INFO] Building war: <https://ci-builds.apache.org/job/Struts/job/Struts-examples-dependency-check/ws/basic-struts/target/basic-struts.war>
[INFO] 
[INFO] --- dependency-check-maven:7.2.1:check (default) @ basic-struts ---
[INFO] Checking for updates
[INFO] Skipping NVD check since last check was within 4 hours.
[INFO] Skipping RetireJS update since last update was within 24 hours.
[INFO] Check for updates complete (125 ms)
[INFO] 

Dependency-Check is an open source tool performing a best effort analysis of 3rd party dependencies; false positives and false negatives may exist in the analysis performed by the tool. Use of the tool and the reporting provided constitutes acceptance for use in an AS IS condition, and there are NO warranties, implied or otherwise, with regard to the analysis or its use. Any use of the tool and the reporting provided is at the user’s risk. In no event shall the copyright holder or OWASP be held liable for any damages whatsoever arising out of or in connection with the use of this tool, the analysis performed, or the resulting report.


   About ODC: https://jeremylong.github.io/DependencyCheck/general/internals.html
   False Positives: https://jeremylong.github.io/DependencyCheck/general/suppression.html

💖 Sponsor: https://github.com/sponsors/jeremylong


[INFO] Analysis Started
[INFO] Finished Archive Analyzer (0 seconds)
[INFO] Finished File Name Analyzer (0 seconds)
[INFO] Finished Jar Analyzer (0 seconds)
[INFO] Finished Dependency Merging Analyzer (0 seconds)
[INFO] Finished Version Filter Analyzer (0 seconds)
[INFO] Finished Hint Analyzer (0 seconds)
[INFO] Created CPE Index (3 seconds)
[INFO] Finished CPE Analyzer (3 seconds)
[INFO] Finished False Positive Analyzer (0 seconds)
[INFO] Finished NVD CVE Analyzer (0 seconds)
[INFO] Finished RetireJS Analyzer (0 seconds)
[INFO] Finished Sonatype OSS Index Analyzer (0 seconds)
[INFO] Finished Vulnerability Suppression Analyzer (0 seconds)
[INFO] Finished Dependency Bundling Analyzer (0 seconds)
[INFO] Analysis Complete (4 seconds)
[INFO] Writing report to: <https://ci-builds.apache.org/job/Struts/job/Struts-examples-dependency-check/ws/basic-struts/target/dependency-check-report.html>
[WARNING] 

One or more dependencies were identified with known vulnerabilities in Basic Struts2 Example:

commons-fileupload-1.5.jar (pkg:maven/commons-fileupload/commons-fileupload@1.5, cpe:2.3:a:apache:commons_fileupload:1.5:*:*:*:*:*:*:*, cpe:2.3:a:apache:commons_net:1.5:*:*:*:*:*:*:*) : CVE-2021-37533
commons-io-2.13.0.jar (pkg:maven/commons-io/commons-io@2.13.0, cpe:2.3:a:apache:commons_io:2.13.0:*:*:*:*:*:*:*, cpe:2.3:a:apache:commons_net:2.13.0:*:*:*:*:*:*:*) : CVE-2021-37533
commons-text-1.10.0.jar (pkg:maven/org.apache.commons/commons-text@1.10.0, cpe:2.3:a:apache:commons_net:1.10.0:*:*:*:*:*:*:*, cpe:2.3:a:apache:commons_text:1.10.0:*:*:*:*:*:*:*) : CVE-2021-37533


See the dependency-check report for more details.


[INFO] 
[INFO] -----------------< org.apache.struts:bean-validation >------------------
[INFO] Building Bean Validation 1.1.0                                    [5/47]
[INFO] --------------------------------[ war ]---------------------------------
Downloading from apache-public: https://repository.apache.org/content/groups/public/org/hibernate/validator/hibernate-validator/6.2.3.Final/hibernate-validator-6.2.3.Final.pom
Downloading from apache-staging: https://repository.apache.org/content/groups/staging/org/hibernate/validator/hibernate-validator/6.2.3.Final/hibernate-validator-6.2.3.Final.pom
Downloading from apache-snapshots: https://repository.apache.org/content/groups/snapshots/org/hibernate/validator/hibernate-validator/6.2.3.Final/hibernate-validator-6.2.3.Final.pom
Downloading from oss-snapshots: https://oss.sonatype.org/content/repositories/snapshots/org/hibernate/validator/hibernate-validator/6.2.3.Final/hibernate-validator-6.2.3.Final.pom
Downloading from central: https://repo.maven.apache.org/maven2/org/hibernate/validator/hibernate-validator/6.2.3.Final/hibernate-validator-6.2.3.Final.pom
Progress (1): 4.1/14 kBProgress (1): 8.2/14 kBProgress (1): 12/14 kB Progress (1): 14 kB                      Downloaded from central: https://repo.maven.apache.org/maven2/org/hibernate/validator/hibernate-validator/6.2.3.Final/hibernate-validator-6.2.3.Final.pom (14 kB at 65 kB/s)
Downloading from apache-public: https://repository.apache.org/content/groups/public/org/hibernate/validator/hibernate-validator-parent/6.2.3.Final/hibernate-validator-parent-6.2.3.Final.pom
Downloading from apache-staging: https://repository.apache.org/content/groups/staging/org/hibernate/validator/hibernate-validator-parent/6.2.3.Final/hibernate-validator-parent-6.2.3.Final.pom
Downloading from apache-snapshots: https://repository.apache.org/content/groups/snapshots/org/hibernate/validator/hibernate-validator-parent/6.2.3.Final/hibernate-validator-parent-6.2.3.Final.pom
Downloading from oss-snapshots: https://oss.sonatype.org/content/repositories/snapshots/org/hibernate/validator/hibernate-validator-parent/6.2.3.Final/hibernate-validator-parent-6.2.3.Final.pom
Downloading from central: https://repo.maven.apache.org/maven2/org/hibernate/validator/hibernate-validator-parent/6.2.3.Final/hibernate-validator-parent-6.2.3.Final.pom
Progress (1): 4.1/78 kBProgress (1): 8.2/78 kBProgress (1): 12/78 kB Progress (1): 16/78 kBProgress (1): 20/78 kBProgress (1): 24/78 kBProgress (1): 28/78 kBProgress (1): 32/78 kBProgress (1): 36/78 kBProgress (1): 40/78 kBProgress (1): 45/78 kBProgress (1): 49/78 kBProgress (1): 53/78 kBProgress (1): 57/78 kBProgress (1): 61/78 kBProgress (1): 65/78 kBProgress (1): 69/78 kBProgress (1): 73/78 kBProgress (1): 77/78 kBProgress (1): 78 kB                      Downloaded from central: https://repo.maven.apache.org/maven2/org/hibernate/validator/hibernate-validator-parent/6.2.3.Final/hibernate-validator-parent-6.2.3.Final.pom (78 kB at 459 kB/s)
Downloading from apache-public: https://repository.apache.org/content/groups/public/org/apache/struts/struts2-bean-validation-plugin/6.3.0.2/struts2-bean-validation-plugin-6.3.0.2.pom
Progress (1): 3.5 kB                    Downloaded from apache-public: https://repository.apache.org/content/groups/public/org/apache/struts/struts2-bean-validation-plugin/6.3.0.2/struts2-bean-validation-plugin-6.3.0.2.pom (3.5 kB at 3.7 kB/s)
Downloading from apache-public: https://repository.apache.org/content/groups/public/org/hibernate/validator/hibernate-validator/6.2.3.Final/hibernate-validator-6.2.3.Final.jar
Downloading from apache-public: https://repository.apache.org/content/groups/public/org/apache/struts/struts2-bean-validation-plugin/6.3.0.2/struts2-bean-validation-plugin-6.3.0.2.jar
Progress (1): 4.1/25 kBProgress (1): 7.8/25 kBProgress (1): 8.2/25 kBProgress (1): 12/25 kB Progress (1): 16/25 kBProgress (1): 20/25 kBProgress (1): 24/25 kBProgress (1): 25/25 kBProgress (1): 25 kB                      Downloaded from apache-public: https://repository.apache.org/content/groups/public/org/apache/struts/struts2-bean-validation-plugin/6.3.0.2/struts2-bean-validation-plugin-6.3.0.2.jar (25 kB at 24 kB/s)
Downloading from apache-staging: https://repository.apache.org/content/groups/staging/org/hibernate/validator/hibernate-validator/6.2.3.Final/hibernate-validator-6.2.3.Final.jar
Downloading from apache-snapshots: https://repository.apache.org/content/groups/snapshots/org/hibernate/validator/hibernate-validator/6.2.3.Final/hibernate-validator-6.2.3.Final.jar
Downloading from oss-snapshots: https://oss.sonatype.org/content/repositories/snapshots/org/hibernate/validator/hibernate-validator/6.2.3.Final/hibernate-validator-6.2.3.Final.jar
Downloading from central: https://repo.maven.apache.org/maven2/org/hibernate/validator/hibernate-validator/6.2.3.Final/hibernate-validator-6.2.3.Final.jar
Progress (1): 0/1.3 MBProgress (1): 0/1.3 MBProgress (1): 0/1.3 MBProgress (1): 0/1.3 MBProgress (1): 0/1.3 MBProgress (1): 0/1.3 MBProgress (1): 0/1.3 MBProgress (1): 0/1.3 MBProgress (1): 0/1.3 MBProgress (1): 0/1.3 MBProgress (1): 0/1.3 MBProgress (1): 0/1.3 MBProgress (1): 0.1/1.3 MBProgress (1): 0.1/1.3 MBProgress (1): 0.1/1.3 MBProgress (1): 0.1/1.3 MBProgress (1): 0.1/1.3 MBProgress (1): 0.1/1.3 MBProgress (1): 0.1/1.3 MBProgress (1): 0.1/1.3 MBProgress (1): 0.1/1.3 MBProgress (1): 0.1/1.3 MBProgress (1): 0.1/1.3 MBProgress (1): 0.1/1.3 MBProgress (1): 0.1/1.3 MBProgress (1): 0.1/1.3 MBProgress (1): 0.1/1.3 MBProgress (1): 0.1/1.3 MBProgress (1): 0.1/1.3 MBProgress (1): 0.1/1.3 MBProgress (1): 0.1/1.3 MBProgress (1): 0.1/1.3 MBProgress (1): 0.1/1.3 MBProgress (1): 0.1/1.3 MBProgress (1): 0.1/1.3 MBProgress (1): 0.1/1.3 MBProgress (1): 0.2/1.3 MBProgress (1): 0.2/1.3 MBProgress (1): 0.2/1.3 MBProgress (1): 0.2/1.3 MBProgress (1): 0.2/1.3 MBProgress (1): 0.2/1.3 MBProgress (1): 0.2/1.3 MBProgress (1): 0.2/1.3 MBProgress (1): 0.2/1.3 MBProgress (1): 0.2/1.3 MBProgress (1): 0.2/1.3 MBProgress (1): 0.2/1.3 MBProgress (1): 0.2/1.3 MBProgress (1): 0.2/1.3 MBProgress (1): 0.2/1.3 MBProgress (1): 0.2/1.3 MBProgress (1): 0.2/1.3 MBProgress (1): 0.2/1.3 MBProgress (1): 0.2/1.3 MBProgress (1): 0.2/1.3 MBProgress (1): 0.2/1.3 MBProgress (1): 0.2/1.3 MBProgress (1): 0.2/1.3 MBProgress (1): 0.2/1.3 MBProgress (1): 0.2/1.3 MBProgress (1): 0.3/1.3 MBProgress (1): 0.3/1.3 MBProgress (1): 0.3/1.3 MBProgress (1): 0.3/1.3 MBProgress (1): 0.3/1.3 MBProgress (1): 0.3/1.3 MBProgress (1): 0.3/1.3 MBProgress (1): 0.3/1.3 MBProgress (1): 0.3/1.3 MBProgress (1): 0.3/1.3 MBProgress (1): 0.3/1.3 MBProgress (1): 0.3/1.3 MBProgress (1): 0.3/1.3 MBProgress (1): 0.3/1.3 MBProgress (1): 0.3/1.3 MBProgress (1): 0.3/1.3 MBProgress (1): 0.3/1.3 MBProgress (1): 0.3/1.3 MBProgress (1): 0.3/1.3 MBProgress (1): 0.3/1.3 MBProgress (1): 0.3/1.3 MBProgress (1): 0.3/1.3 MBProgress (1): 0.3/1.3 MBProgress (1): 0.3/1.3 MBProgress (1): 0.4/1.3 MBProgress (1): 0.4/1.3 MBProgress (1): 0.4/1.3 MBProgress (1): 0.4/1.3 MBProgress (1): 0.4/1.3 MBProgress (1): 0.4/1.3 MBProgress (1): 0.4/1.3 MBProgress (1): 0.4/1.3 MBProgress (1): 0.4/1.3 MBProgress (1): 0.4/1.3 MBProgress (1): 0.4/1.3 MBProgress (1): 0.4/1.3 MBProgress (1): 0.4/1.3 MBProgress (1): 0.4/1.3 MBProgress (1): 0.4/1.3 MBProgress (1): 0.4/1.3 MBProgress (1): 0.4/1.3 MBProgress (1): 0.4/1.3 MBProgress (1): 0.4/1.3 MBProgress (1): 0.4/1.3 MBProgress (1): 0.4/1.3 MBProgress (1): 0.4/1.3 MBProgress (1): 0.4/1.3 MBProgress (1): 0.4/1.3 MBProgress (1): 0.4/1.3 MBProgress (1): 0.5/1.3 MBProgress (1): 0.5/1.3 MBProgress (1): 0.5/1.3 MBProgress (1): 0.5/1.3 MBProgress (1): 0.5/1.3 MBProgress (1): 0.5/1.3 MBProgress (1): 0.5/1.3 MBProgress (1): 0.5/1.3 MBProgress (1): 0.5/1.3 MBProgress (1): 0.5/1.3 MBProgress (1): 0.5/1.3 MBProgress (1): 0.5/1.3 MBProgress (1): 0.5/1.3 MBProgress (1): 0.5/1.3 MBProgress (1): 0.5/1.3 MBProgress (1): 0.5/1.3 MBProgress (1): 0.5/1.3 MBProgress (1): 0.5/1.3 MBProgress (1): 0.5/1.3 MBProgress (1): 0.5/1.3 MBProgress (1): 0.5/1.3 MBProgress (1): 0.5/1.3 MBProgress (1): 0.5/1.3 MBProgress (1): 0.5/1.3 MBProgress (1): 0.6/1.3 MBProgress (1): 0.6/1.3 MBProgress (1): 0.6/1.3 MBProgress (1): 0.6/1.3 MBProgress (1): 0.6/1.3 MBProgress (1): 0.6/1.3 MBProgress (1): 0.6/1.3 MBProgress (1): 0.6/1.3 MBProgress (1): 0.6/1.3 MBProgress (1): 0.6/1.3 MBProgress (1): 0.6/1.3 MBProgress (1): 0.6/1.3 MBProgress (1): 0.6/1.3 MBProgress (1): 0.6/1.3 MBProgress (1): 0.6/1.3 MBProgress (1): 0.6/1.3 MBProgress (1): 0.6/1.3 MBProgress (1): 0.6/1.3 MBProgress (1): 0.6/1.3 MBProgress (1): 0.6/1.3 MBProgress (1): 0.6/1.3 MBProgress (1): 0.6/1.3 MBProgress (1): 0.6/1.3 MBProgress (1): 0.6/1.3 MBProgress (1): 0.6/1.3 MBProgress (1): 0.7/1.3 MBProgress (1): 0.7/1.3 MBProgress (1): 0.7/1.3 MBProgress (1): 0.7/1.3 MBProgress (1): 0.7/1.3 MBProgress (1): 0.7/1.3 MBProgress (1): 0.7/1.3 MBProgress (1): 0.7/1.3 MBProgress (1): 0.7/1.3 MBProgress (1): 0.7/1.3 MBProgress (1): 0.7/1.3 MBProgress (1): 0.7/1.3 MBProgress (1): 0.7/1.3 MBProgress (1): 0.7/1.3 MBProgress (1): 0.7/1.3 MBProgress (1): 0.7/1.3 MBProgress (1): 0.7/1.3 MBProgress (1): 0.7/1.3 MBProgress (1): 0.7/1.3 MBProgress (1): 0.7/1.3 MBProgress (1): 0.7/1.3 MBProgress (1): 0.7/1.3 MBProgress (1): 0.7/1.3 MBProgress (1): 0.7/1.3 MBProgress (1): 0.8/1.3 MBProgress (1): 0.8/1.3 MBProgress (1): 0.8/1.3 MBProgress (1): 0.8/1.3 MBProgress (1): 0.8/1.3 MBProgress (1): 0.8/1.3 MBProgress (1): 0.8/1.3 MBProgress (1): 0.8/1.3 MBProgress (1): 0.8/1.3 MBProgress (1): 0.8/1.3 MBProgress (1): 0.8/1.3 MBProgress (1): 0.8/1.3 MBProgress (1): 0.8/1.3 MBProgress (1): 0.8/1.3 MBProgress (1): 0.8/1.3 MBProgress (1): 0.8/1.3 MBProgress (1): 0.8/1.3 MBProgress (1): 0.8/1.3 MBProgress (1): 0.8/1.3 MBProgress (1): 0.8/1.3 MBProgress (1): 0.8/1.3 MBProgress (1): 0.8/1.3 MBProgress (1): 0.8/1.3 MBProgress (1): 0.8/1.3 MBProgress (1): 0.8/1.3 MBProgress (1): 0.9/1.3 MBProgress (1): 0.9/1.3 MBProgress (1): 0.9/1.3 MBProgress (1): 0.9/1.3 MBProgress (1): 0.9/1.3 MBProgress (1): 0.9/1.3 MBProgress (1): 0.9/1.3 MBProgress (1): 0.9/1.3 MBProgress (1): 0.9/1.3 MBProgress (1): 0.9/1.3 MBProgress (1): 0.9/1.3 MBProgress (1): 0.9/1.3 MBProgress (1): 0.9/1.3 MBProgress (1): 0.9/1.3 MBProgress (1): 0.9/1.3 MBProgress (1): 0.9/1.3 MBProgress (1): 0.9/1.3 MBProgress (1): 0.9/1.3 MBProgress (1): 0.9/1.3 MBProgress (1): 0.9/1.3 MBProgress (1): 0.9/1.3 MBProgress (1): 0.9/1.3 MBProgress (1): 0.9/1.3 MBProgress (1): 0.9/1.3 MBProgress (1): 1.0/1.3 MBProgress (1): 1.0/1.3 MBProgress (1): 1.0/1.3 MBProgress (1): 1.0/1.3 MBProgress (1): 1.0/1.3 MBProgress (1): 1.0/1.3 MBProgress (1): 1.0/1.3 MBProgress (1): 1.0/1.3 MBProgress (1): 1.0/1.3 MBProgress (1): 1.0/1.3 MBProgress (1): 1.0/1.3 MBProgress (1): 1.0/1.3 MBProgress (1): 1.0/1.3 MBProgress (1): 1.0/1.3 MBProgress (1): 1.0/1.3 MBProgress (1): 1.0/1.3 MBProgress (1): 1.0/1.3 MBProgress (1): 1.0/1.3 MBProgress (1): 1.0/1.3 MBProgress (1): 1.0/1.3 MBProgress (1): 1.0/1.3 MBProgress (1): 1.0/1.3 MBProgress (1): 1.0/1.3 MBProgress (1): 1.0/1.3 MBProgress (1): 1.0/1.3 MBProgress (1): 1.1/1.3 MBProgress (1): 1.1/1.3 MBProgress (1): 1.1/1.3 MBProgress (1): 1.1/1.3 MBProgress (1): 1.1/1.3 MBProgress (1): 1.1/1.3 MBProgress (1): 1.1/1.3 MBProgress (1): 1.1/1.3 MBProgress (1): 1.1/1.3 MBProgress (1): 1.1/1.3 MBProgress (1): 1.1/1.3 MBProgress (1): 1.1/1.3 MBProgress (1): 1.1/1.3 MBProgress (1): 1.1/1.3 MBProgress (1): 1.1/1.3 MBProgress (1): 1.1/1.3 MBProgress (1): 1.1/1.3 MBProgress (1): 1.1/1.3 MBProgress (1): 1.1/1.3 MBProgress (1): 1.1/1.3 MBProgress (1): 1.1/1.3 MBProgress (1): 1.1/1.3 MBProgress (1): 1.1/1.3 MBProgress (1): 1.1/1.3 MBProgress (1): 1.2/1.3 MBProgress (1): 1.2/1.3 MBProgress (1): 1.2/1.3 MBProgress (1): 1.2/1.3 MBProgress (1): 1.2/1.3 MBProgress (1): 1.2/1.3 MBProgress (1): 1.2/1.3 MBProgress (1): 1.2/1.3 MBProgress (1): 1.2/1.3 MBProgress (1): 1.2/1.3 MBProgress (1): 1.2/1.3 MBProgress (1): 1.2/1.3 MBProgress (1): 1.2/1.3 MBProgress (1): 1.2/1.3 MBProgress (1): 1.2/1.3 MBProgress (1): 1.2/1.3 MBProgress (1): 1.2/1.3 MBProgress (1): 1.2/1.3 MBProgress (1): 1.2/1.3 MBProgress (1): 1.2/1.3 MBProgress (1): 1.2/1.3 MBProgress (1): 1.2/1.3 MBProgress (1): 1.2/1.3 MBProgress (1): 1.2/1.3 MBProgress (1): 1.3/1.3 MBProgress (1): 1.3/1.3 MBProgress (1): 1.3/1.3 MBProgress (1): 1.3/1.3 MBProgress (1): 1.3/1.3 MBProgress (1): 1.3/1.3 MBProgress (1): 1.3/1.3 MBProgress (1): 1.3/1.3 MBProgress (1): 1.3/1.3 MBProgress (1): 1.3/1.3 MBProgress (1): 1.3/1.3 MBProgress (1): 1.3/1.3 MBProgress (1): 1.3/1.3 MBProgress (1): 1.3/1.3 MBProgress (1): 1.3/1.3 MBProgress (1): 1.3/1.3 MBProgress (1): 1.3/1.3 MBProgress (1): 1.3/1.3 MBProgress (1): 1.3 MB                        Downloaded from central: https://repo.maven.apache.org/maven2/org/hibernate/validator/hibernate-validator/6.2.3.Final/hibernate-validator-6.2.3.Final.jar (1.3 MB at 7.8 MB/s)
[INFO] 
[INFO] --- maven-resources-plugin:2.6:resources (default-resources) @ bean-validation ---
[INFO] Using 'UTF-8' encoding to copy filtered resources.
[INFO] Copying 3 resources
[INFO] 
[INFO] --- maven-compiler-plugin:3.1:compile (default-compile) @ bean-validation ---
[INFO] Changes detected - recompiling the module!
[INFO] Compiling 5 source files to <https://ci-builds.apache.org/job/Struts/job/Struts-examples-dependency-check/ws/bean-validation/target/classes>
[WARNING] <https://ci-builds.apache.org/job/Struts/job/Struts-examples-dependency-check/ws/bean-validation/src/main/java/org/apache/struts/edit/model/Person.java>: <https://ci-builds.apache.org/job/Struts/job/Struts-examples-dependency-check/ws/bean-validation/src/main/java/org/apache/struts/edit/model/Person.java> uses or overrides a deprecated API.
[WARNING] <https://ci-builds.apache.org/job/Struts/job/Struts-examples-dependency-check/ws/bean-validation/src/main/java/org/apache/struts/edit/model/Person.java>: Recompile with -Xlint:deprecation for details.
[INFO] 
[INFO] --- maven-resources-plugin:2.6:testResources (default-testResources) @ bean-validation ---
[INFO] Using 'UTF-8' encoding to copy filtered resources.
[INFO] skip non existing resourceDirectory <https://ci-builds.apache.org/job/Struts/job/Struts-examples-dependency-check/ws/bean-validation/src/test/resources>
[INFO] 
[INFO] --- maven-compiler-plugin:3.1:testCompile (default-testCompile) @ bean-validation ---
[INFO] No sources to compile
[INFO] 
[INFO] --- maven-surefire-plugin:2.12.4:test (default-test) @ bean-validation ---
[INFO] No tests to run.
[INFO] 
[INFO] --- maven-war-plugin:3.4.0:war (default-war) @ bean-validation ---
[INFO] Packaging webapp
[INFO] Assembling webapp [bean-validation] in [<https://ci-builds.apache.org/job/Struts/job/Struts-examples-dependency-check/ws/bean-validation/target/bean-validation]>
[INFO] Processing war project
[INFO] Copying webapp resources [<https://ci-builds.apache.org/job/Struts/job/Struts-examples-dependency-check/ws/bean-validation/src/main/webapp]>
[INFO] Building war: <https://ci-builds.apache.org/job/Struts/job/Struts-examples-dependency-check/ws/bean-validation/target/bean-validation.war>
[INFO] 
[INFO] --- dependency-check-maven:7.2.1:check (default) @ bean-validation ---
[INFO] Checking for updates
[INFO] Skipping NVD check since last check was within 4 hours.
[INFO] Skipping RetireJS update since last update was within 24 hours.
[INFO] Check for updates complete (104 ms)
[INFO] 

Dependency-Check is an open source tool performing a best effort analysis of 3rd party dependencies; false positives and false negatives may exist in the analysis performed by the tool. Use of the tool and the reporting provided constitutes acceptance for use in an AS IS condition, and there are NO warranties, implied or otherwise, with regard to the analysis or its use. Any use of the tool and the reporting provided is at the user’s risk. In no event shall the copyright holder or OWASP be held liable for any damages whatsoever arising out of or in connection with the use of this tool, the analysis performed, or the resulting report.


   About ODC: https://jeremylong.github.io/DependencyCheck/general/internals.html
   False Positives: https://jeremylong.github.io/DependencyCheck/general/suppression.html

💖 Sponsor: https://github.com/sponsors/jeremylong


[INFO] Analysis Started
[INFO] Finished Archive Analyzer (0 seconds)
[INFO] Finished File Name Analyzer (0 seconds)
[INFO] Finished Jar Analyzer (0 seconds)
[INFO] Finished Dependency Merging Analyzer (0 seconds)
[INFO] Finished Version Filter Analyzer (0 seconds)
[INFO] Finished Hint Analyzer (0 seconds)
[INFO] Created CPE Index (3 seconds)
[INFO] Finished CPE Analyzer (3 seconds)
[INFO] Finished False Positive Analyzer (0 seconds)
[INFO] Finished NVD CVE Analyzer (0 seconds)
[INFO] Finished RetireJS Analyzer (0 seconds)
[INFO] Finished Sonatype OSS Index Analyzer (1 seconds)
[INFO] Finished Vulnerability Suppression Analyzer (0 seconds)
[INFO] Finished Dependency Bundling Analyzer (0 seconds)
[INFO] Analysis Complete (6 seconds)
[INFO] Writing report to: <https://ci-builds.apache.org/job/Struts/job/Struts-examples-dependency-check/ws/bean-validation/target/dependency-check-report.html>
[WARNING] 

One or more dependencies were identified with known vulnerabilities in Bean Validation:

commons-fileupload-1.5.jar (pkg:maven/commons-fileupload/commons-fileupload@1.5, cpe:2.3:a:apache:commons_fileupload:1.5:*:*:*:*:*:*:*, cpe:2.3:a:apache:commons_net:1.5:*:*:*:*:*:*:*) : CVE-2021-37533
commons-io-2.13.0.jar (pkg:maven/commons-io/commons-io@2.13.0, cpe:2.3:a:apache:commons_io:2.13.0:*:*:*:*:*:*:*, cpe:2.3:a:apache:commons_net:2.13.0:*:*:*:*:*:*:*) : CVE-2021-37533
commons-text-1.10.0.jar (pkg:maven/org.apache.commons/commons-text@1.10.0, cpe:2.3:a:apache:commons_net:1.10.0:*:*:*:*:*:*:*, cpe:2.3:a:apache:commons_text:1.10.0:*:*:*:*:*:*:*) : CVE-2021-37533
javax.el-3.0.1-b12.jar (pkg:maven/org.glassfish/javax.el@3.0.1-b12) : CVE-2021-28170


See the dependency-check report for more details.


[INFO] ------------------------------------------------------------------------
[INFO] Reactor Summary:
[INFO] 
[INFO] Struts 2 Examples 1.1.0 ............................ SUCCESS [03:52 min]
[INFO] Action chaining .................................... SUCCESS [  8.476 s]
[INFO] Annotations with Convention Plugin ................. SUCCESS [ 10.339 s]
[INFO] Basic Struts2 Example .............................. SUCCESS [  5.794 s]
[INFO] Bean Validation .................................... FAILURE [ 14.977 s]
[INFO] Struts 2 Blank Webapp .............................. SKIPPED
[INFO] Coding Struts 2 Action ............................. SKIPPED
[INFO] Control Tags ....................................... SKIPPED
[INFO] CRUD Example ....................................... SKIPPED
[INFO] Debugging Struts ................................... SKIPPED
[INFO] Dynamic Url ........................................ SKIPPED
[INFO] Exception handling ................................. SKIPPED
[INFO] Exclude Parameters ................................. SKIPPED
[INFO] Expression Cache ................................... SKIPPED
[INFO] File upload ........................................ SKIPPED
[INFO] Form Processing .................................... SKIPPED
[INFO] Form Tags .......................................... SKIPPED
[INFO] Form validation .................................... SKIPPED
[INFO] XML based form validation .......................... SKIPPED
[INFO] Hello World Struts 2 Example Application ........... SKIPPED
[INFO] Http Session ....................................... SKIPPED
[INFO] Struts 2 Interceptors .............................. SKIPPED
[INFO] jfreechart ......................................... SKIPPED
[INFO] JSON produce/consume ............................... SKIPPED
[INFO] Customized JSON produce ............................ SKIPPED
[INFO] Struts 2 Mail Reader Webapp ........................ SKIPPED
[INFO] Message resource ................................... SKIPPED
[INFO] Message Store ...................................... SKIPPED
[INFO] Portlet Webapp ..................................... SKIPPED
[INFO] Preparable Interface ............................... SKIPPED
[INFO] Struts 2 Quarkus ................................... SKIPPED
[INFO] REST to Action Mapper Example Application .......... SKIPPED
[INFO] REST Plugin based application with AngularJS ....... SKIPPED
[INFO] Struts2 with Basic Shiro Security Integration ...... SKIPPED
[INFO] Struts2 with Spring Integration .................... SKIPPED
[INFO] Custom TextProvider ................................ SKIPPED
[INFO] Struts Tiles Example ............................... SKIPPED
[INFO] Struts 2 Themes .................................... SKIPPED
[INFO] Struts 2 Themes Override ........................... SKIPPED
[INFO] Type Conversion .................................... SKIPPED
[INFO] Unit Testing ....................................... SKIPPED
[INFO] Unknown handler .................................... SKIPPED
[INFO] Using Struts 2 Tags ................................ SKIPPED
[INFO] validation-messages ................................ SKIPPED
[INFO] Wildcard Method Selection .......................... SKIPPED
[INFO] Wildcard RegEx pattern matching .................... SKIPPED
[INFO] JasperReports Tutorial 1.1.0 ....................... SKIPPED
[INFO] ------------------------------------------------------------------------
[INFO] BUILD FAILURE
[INFO] ------------------------------------------------------------------------
[INFO] Total time: 04:35 min
[INFO] Finished at: 2024-02-01T22:03:47Z
[INFO] ------------------------------------------------------------------------
[ERROR] Failed to execute goal org.owasp:dependency-check-maven:7.2.1:check (default) on project bean-validation: 
[ERROR] 
[ERROR] One or more dependencies were identified with vulnerabilities that have a CVSS score greater than or equal to '7.0': 
[ERROR] 
[ERROR] javax.el-3.0.1-b12.jar: CVE-2021-28170(7.5)
[ERROR] 
[ERROR] See the dependency-check report for more details.
[ERROR] 
[ERROR] 
[ERROR] -> [Help 1]
[ERROR] 
[ERROR] To see the full stack trace of the errors, re-run Maven with the -e switch.
[ERROR] Re-run Maven using the -X switch to enable full debug logging.
[ERROR] 
[ERROR] For more information about the errors and possible solutions, please read the following articles:
[ERROR] [Help 1] http://cwiki.apache.org/confluence/display/MAVEN/MojoFailureException
[ERROR] 
[ERROR] After correcting the problems, you can resume the build with the command
[ERROR]   mvn <goals> -rf :bean-validation
Build step 'Execute shell' marked build as failure
Setting MAVEN_3_LATEST_HOME=/home/jenkins/tools/maven/latest3

Build failed in Jenkins: Struts » Struts-examples-dependency-check #117

Posted by Apache Jenkins Server <je...@builds.apache.org>.
See <https://ci-builds.apache.org/job/Struts/job/Struts-examples-dependency-check/117/display/redirect>

Changes:


------------------------------------------
[...truncated 64.51 KB...]
[INFO] Building Basic Struts2 Example 1.1.0                              [4/47]
[INFO] --------------------------------[ war ]---------------------------------
[INFO] 
[INFO] --- maven-resources-plugin:2.6:resources (default-resources) @ basic-struts ---
[INFO] Using 'UTF-8' encoding to copy filtered resources.
[INFO] Copying 2 resources
[INFO] 
[INFO] --- maven-compiler-plugin:3.1:compile (default-compile) @ basic-struts ---
[INFO] No sources to compile
[INFO] 
[INFO] --- maven-resources-plugin:2.6:testResources (default-testResources) @ basic-struts ---
[INFO] Using 'UTF-8' encoding to copy filtered resources.
[INFO] skip non existing resourceDirectory <https://ci-builds.apache.org/job/Struts/job/Struts-examples-dependency-check/ws/basic-struts/src/test/resources>
[INFO] 
[INFO] --- maven-compiler-plugin:3.1:testCompile (default-testCompile) @ basic-struts ---
[INFO] No sources to compile
[INFO] 
[INFO] --- maven-surefire-plugin:2.12.4:test (default-test) @ basic-struts ---
[INFO] No tests to run.
[INFO] 
[INFO] --- maven-war-plugin:3.4.0:war (default-war) @ basic-struts ---
[INFO] Packaging webapp
[INFO] Assembling webapp [basic-struts] in [<https://ci-builds.apache.org/job/Struts/job/Struts-examples-dependency-check/ws/basic-struts/target/basic-struts]>
[INFO] Processing war project
[INFO] Copying webapp resources [<https://ci-builds.apache.org/job/Struts/job/Struts-examples-dependency-check/ws/basic-struts/src/main/webapp]>
[INFO] Building war: <https://ci-builds.apache.org/job/Struts/job/Struts-examples-dependency-check/ws/basic-struts/target/basic-struts.war>
[INFO] 
[INFO] --- dependency-check-maven:7.2.1:check (default) @ basic-struts ---
[INFO] Checking for updates
[INFO] Skipping NVD check since last check was within 4 hours.
[INFO] Skipping RetireJS update since last update was within 24 hours.
[INFO] Check for updates complete (70 ms)
[INFO] 

Dependency-Check is an open source tool performing a best effort analysis of 3rd party dependencies; false positives and false negatives may exist in the analysis performed by the tool. Use of the tool and the reporting provided constitutes acceptance for use in an AS IS condition, and there are NO warranties, implied or otherwise, with regard to the analysis or its use. Any use of the tool and the reporting provided is at the user’s risk. In no event shall the copyright holder or OWASP be held liable for any damages whatsoever arising out of or in connection with the use of this tool, the analysis performed, or the resulting report.


   About ODC: https://jeremylong.github.io/DependencyCheck/general/internals.html
   False Positives: https://jeremylong.github.io/DependencyCheck/general/suppression.html

💖 Sponsor: https://github.com/sponsors/jeremylong


[INFO] Analysis Started
[INFO] Finished Archive Analyzer (0 seconds)
[INFO] Finished File Name Analyzer (0 seconds)
[INFO] Finished Jar Analyzer (0 seconds)
[INFO] Finished Dependency Merging Analyzer (0 seconds)
[INFO] Finished Version Filter Analyzer (0 seconds)
[INFO] Finished Hint Analyzer (0 seconds)
[INFO] Created CPE Index (2 seconds)
[INFO] Finished CPE Analyzer (3 seconds)
[INFO] Finished False Positive Analyzer (0 seconds)
[INFO] Finished NVD CVE Analyzer (0 seconds)
[INFO] Finished RetireJS Analyzer (0 seconds)
[INFO] Finished Sonatype OSS Index Analyzer (0 seconds)
[INFO] Finished Vulnerability Suppression Analyzer (0 seconds)
[INFO] Finished Dependency Bundling Analyzer (0 seconds)
[INFO] Analysis Complete (3 seconds)
[INFO] Writing report to: <https://ci-builds.apache.org/job/Struts/job/Struts-examples-dependency-check/ws/basic-struts/target/dependency-check-report.html>
[WARNING] 

One or more dependencies were identified with known vulnerabilities in Basic Struts2 Example:

commons-fileupload-1.5.jar (pkg:maven/commons-fileupload/commons-fileupload@1.5, cpe:2.3:a:apache:commons_fileupload:1.5:*:*:*:*:*:*:*, cpe:2.3:a:apache:commons_net:1.5:*:*:*:*:*:*:*) : CVE-2021-37533
commons-io-2.13.0.jar (pkg:maven/commons-io/commons-io@2.13.0, cpe:2.3:a:apache:commons_io:2.13.0:*:*:*:*:*:*:*, cpe:2.3:a:apache:commons_net:2.13.0:*:*:*:*:*:*:*) : CVE-2021-37533
commons-text-1.10.0.jar (pkg:maven/org.apache.commons/commons-text@1.10.0, cpe:2.3:a:apache:commons_net:1.10.0:*:*:*:*:*:*:*, cpe:2.3:a:apache:commons_text:1.10.0:*:*:*:*:*:*:*) : CVE-2021-37533


See the dependency-check report for more details.


[INFO] 
[INFO] -----------------< org.apache.struts:bean-validation >------------------
[INFO] Building Bean Validation 1.1.0                                    [5/47]
[INFO] --------------------------------[ war ]---------------------------------
Downloading from apache-public: https://repository.apache.org/content/groups/public/org/hibernate/validator/hibernate-validator/6.2.3.Final/hibernate-validator-6.2.3.Final.pom
Downloading from apache-staging: https://repository.apache.org/content/groups/staging/org/hibernate/validator/hibernate-validator/6.2.3.Final/hibernate-validator-6.2.3.Final.pom
Downloading from apache-snapshots: https://repository.apache.org/content/groups/snapshots/org/hibernate/validator/hibernate-validator/6.2.3.Final/hibernate-validator-6.2.3.Final.pom
Downloading from oss-snapshots: https://oss.sonatype.org/content/repositories/snapshots/org/hibernate/validator/hibernate-validator/6.2.3.Final/hibernate-validator-6.2.3.Final.pom
Downloading from central: https://repo.maven.apache.org/maven2/org/hibernate/validator/hibernate-validator/6.2.3.Final/hibernate-validator-6.2.3.Final.pom
Progress (1): 4.1/14 kBProgress (1): 8.2/14 kBProgress (1): 12/14 kB Progress (1): 14 kB                      Downloaded from central: https://repo.maven.apache.org/maven2/org/hibernate/validator/hibernate-validator/6.2.3.Final/hibernate-validator-6.2.3.Final.pom (14 kB at 207 kB/s)
Downloading from apache-public: https://repository.apache.org/content/groups/public/org/hibernate/validator/hibernate-validator-parent/6.2.3.Final/hibernate-validator-parent-6.2.3.Final.pom
Downloading from apache-staging: https://repository.apache.org/content/groups/staging/org/hibernate/validator/hibernate-validator-parent/6.2.3.Final/hibernate-validator-parent-6.2.3.Final.pom
Downloading from apache-snapshots: https://repository.apache.org/content/groups/snapshots/org/hibernate/validator/hibernate-validator-parent/6.2.3.Final/hibernate-validator-parent-6.2.3.Final.pom
Downloading from oss-snapshots: https://oss.sonatype.org/content/repositories/snapshots/org/hibernate/validator/hibernate-validator-parent/6.2.3.Final/hibernate-validator-parent-6.2.3.Final.pom
Downloading from central: https://repo.maven.apache.org/maven2/org/hibernate/validator/hibernate-validator-parent/6.2.3.Final/hibernate-validator-parent-6.2.3.Final.pom
Progress (1): 4.1/78 kBProgress (1): 8.2/78 kBProgress (1): 12/78 kB Progress (1): 16/78 kBProgress (1): 20/78 kBProgress (1): 24/78 kBProgress (1): 28/78 kBProgress (1): 32/78 kBProgress (1): 36/78 kBProgress (1): 40/78 kBProgress (1): 45/78 kBProgress (1): 49/78 kBProgress (1): 53/78 kBProgress (1): 57/78 kBProgress (1): 61/78 kBProgress (1): 65/78 kBProgress (1): 69/78 kBProgress (1): 73/78 kBProgress (1): 77/78 kBProgress (1): 78 kB                      Downloaded from central: https://repo.maven.apache.org/maven2/org/hibernate/validator/hibernate-validator-parent/6.2.3.Final/hibernate-validator-parent-6.2.3.Final.pom (78 kB at 1.2 MB/s)
Downloading from apache-public: https://repository.apache.org/content/groups/public/org/apache/struts/struts2-bean-validation-plugin/6.3.0.2/struts2-bean-validation-plugin-6.3.0.2.pom
Progress (1): 3.5 kB                    Downloaded from apache-public: https://repository.apache.org/content/groups/public/org/apache/struts/struts2-bean-validation-plugin/6.3.0.2/struts2-bean-validation-plugin-6.3.0.2.pom (3.5 kB at 4.2 kB/s)
Downloading from apache-public: https://repository.apache.org/content/groups/public/org/hibernate/validator/hibernate-validator/6.2.3.Final/hibernate-validator-6.2.3.Final.jar
Downloading from apache-public: https://repository.apache.org/content/groups/public/org/apache/struts/struts2-bean-validation-plugin/6.3.0.2/struts2-bean-validation-plugin-6.3.0.2.jar
Progress (1): 4.1/25 kBProgress (1): 7.8/25 kBProgress (1): 8.2/25 kBProgress (1): 12/25 kB Progress (1): 16/25 kBProgress (1): 20/25 kBProgress (1): 24/25 kBProgress (1): 25/25 kBProgress (1): 25 kB                      Downloaded from apache-public: https://repository.apache.org/content/groups/public/org/apache/struts/struts2-bean-validation-plugin/6.3.0.2/struts2-bean-validation-plugin-6.3.0.2.jar (25 kB at 25 kB/s)
Downloading from apache-staging: https://repository.apache.org/content/groups/staging/org/hibernate/validator/hibernate-validator/6.2.3.Final/hibernate-validator-6.2.3.Final.jar
Downloading from apache-snapshots: https://repository.apache.org/content/groups/snapshots/org/hibernate/validator/hibernate-validator/6.2.3.Final/hibernate-validator-6.2.3.Final.jar
Downloading from oss-snapshots: https://oss.sonatype.org/content/repositories/snapshots/org/hibernate/validator/hibernate-validator/6.2.3.Final/hibernate-validator-6.2.3.Final.jar
Downloading from central: https://repo.maven.apache.org/maven2/org/hibernate/validator/hibernate-validator/6.2.3.Final/hibernate-validator-6.2.3.Final.jar
Progress (1): 0/1.3 MBProgress (1): 0/1.3 MBProgress (1): 0/1.3 MBProgress (1): 0/1.3 MBProgress (1): 0/1.3 MBProgress (1): 0/1.3 MBProgress (1): 0/1.3 MBProgress (1): 0/1.3 MBProgress (1): 0/1.3 MBProgress (1): 0/1.3 MBProgress (1): 0/1.3 MBProgress (1): 0/1.3 MBProgress (1): 0.1/1.3 MBProgress (1): 0.1/1.3 MBProgress (1): 0.1/1.3 MBProgress (1): 0.1/1.3 MBProgress (1): 0.1/1.3 MBProgress (1): 0.1/1.3 MBProgress (1): 0.1/1.3 MBProgress (1): 0.1/1.3 MBProgress (1): 0.1/1.3 MBProgress (1): 0.1/1.3 MBProgress (1): 0.1/1.3 MBProgress (1): 0.1/1.3 MBProgress (1): 0.1/1.3 MBProgress (1): 0.1/1.3 MBProgress (1): 0.1/1.3 MBProgress (1): 0.1/1.3 MBProgress (1): 0.1/1.3 MBProgress (1): 0.1/1.3 MBProgress (1): 0.1/1.3 MBProgress (1): 0.1/1.3 MBProgress (1): 0.1/1.3 MBProgress (1): 0.1/1.3 MBProgress (1): 0.1/1.3 MBProgress (1): 0.1/1.3 MBProgress (1): 0.2/1.3 MBProgress (1): 0.2/1.3 MBProgress (1): 0.2/1.3 MBProgress (1): 0.2/1.3 MBProgress (1): 0.2/1.3 MBProgress (1): 0.2/1.3 MBProgress (1): 0.2/1.3 MBProgress (1): 0.2/1.3 MBProgress (1): 0.2/1.3 MBProgress (1): 0.2/1.3 MBProgress (1): 0.2/1.3 MBProgress (1): 0.2/1.3 MBProgress (1): 0.2/1.3 MBProgress (1): 0.2/1.3 MBProgress (1): 0.2/1.3 MBProgress (1): 0.2/1.3 MBProgress (1): 0.2/1.3 MBProgress (1): 0.2/1.3 MBProgress (1): 0.2/1.3 MBProgress (1): 0.2/1.3 MBProgress (1): 0.2/1.3 MBProgress (1): 0.2/1.3 MBProgress (1): 0.2/1.3 MBProgress (1): 0.2/1.3 MBProgress (1): 0.2/1.3 MBProgress (1): 0.3/1.3 MBProgress (1): 0.3/1.3 MBProgress (1): 0.3/1.3 MBProgress (1): 0.3/1.3 MBProgress (1): 0.3/1.3 MBProgress (1): 0.3/1.3 MBProgress (1): 0.3/1.3 MBProgress (1): 0.3/1.3 MBProgress (1): 0.3/1.3 MBProgress (1): 0.3/1.3 MBProgress (1): 0.3/1.3 MBProgress (1): 0.3/1.3 MBProgress (1): 0.3/1.3 MBProgress (1): 0.3/1.3 MBProgress (1): 0.3/1.3 MBProgress (1): 0.3/1.3 MBProgress (1): 0.3/1.3 MBProgress (1): 0.3/1.3 MBProgress (1): 0.3/1.3 MBProgress (1): 0.3/1.3 MBProgress (1): 0.3/1.3 MBProgress (1): 0.3/1.3 MBProgress (1): 0.3/1.3 MBProgress (1): 0.3/1.3 MBProgress (1): 0.4/1.3 MBProgress (1): 0.4/1.3 MBProgress (1): 0.4/1.3 MBProgress (1): 0.4/1.3 MBProgress (1): 0.4/1.3 MBProgress (1): 0.4/1.3 MBProgress (1): 0.4/1.3 MBProgress (1): 0.4/1.3 MBProgress (1): 0.4/1.3 MBProgress (1): 0.4/1.3 MBProgress (1): 0.4/1.3 MBProgress (1): 0.4/1.3 MBProgress (1): 0.4/1.3 MBProgress (1): 0.4/1.3 MBProgress (1): 0.4/1.3 MBProgress (1): 0.4/1.3 MBProgress (1): 0.4/1.3 MBProgress (1): 0.4/1.3 MBProgress (1): 0.4/1.3 MBProgress (1): 0.4/1.3 MBProgress (1): 0.4/1.3 MBProgress (1): 0.4/1.3 MBProgress (1): 0.4/1.3 MBProgress (1): 0.4/1.3 MBProgress (1): 0.4/1.3 MBProgress (1): 0.5/1.3 MBProgress (1): 0.5/1.3 MBProgress (1): 0.5/1.3 MBProgress (1): 0.5/1.3 MBProgress (1): 0.5/1.3 MBProgress (1): 0.5/1.3 MBProgress (1): 0.5/1.3 MBProgress (1): 0.5/1.3 MBProgress (1): 0.5/1.3 MBProgress (1): 0.5/1.3 MBProgress (1): 0.5/1.3 MBProgress (1): 0.5/1.3 MBProgress (1): 0.5/1.3 MBProgress (1): 0.5/1.3 MBProgress (1): 0.5/1.3 MBProgress (1): 0.5/1.3 MBProgress (1): 0.5/1.3 MBProgress (1): 0.5/1.3 MBProgress (1): 0.5/1.3 MBProgress (1): 0.5/1.3 MBProgress (1): 0.5/1.3 MBProgress (1): 0.5/1.3 MBProgress (1): 0.5/1.3 MBProgress (1): 0.5/1.3 MBProgress (1): 0.5/1.3 MBProgress (1): 0.6/1.3 MBProgress (1): 0.6/1.3 MBProgress (1): 0.6/1.3 MBProgress (1): 0.6/1.3 MBProgress (1): 0.6/1.3 MBProgress (1): 0.6/1.3 MBProgress (1): 0.6/1.3 MBProgress (1): 0.6/1.3 MBProgress (1): 0.6/1.3 MBProgress (1): 0.6/1.3 MBProgress (1): 0.6/1.3 MBProgress (1): 0.6/1.3 MBProgress (1): 0.6/1.3 MBProgress (1): 0.6/1.3 MBProgress (1): 0.6/1.3 MBProgress (1): 0.6/1.3 MBProgress (1): 0.6/1.3 MBProgress (1): 0.6/1.3 MBProgress (1): 0.6/1.3 MBProgress (1): 0.6/1.3 MBProgress (1): 0.6/1.3 MBProgress (1): 0.6/1.3 MBProgress (1): 0.6/1.3 MBProgress (1): 0.6/1.3 MBProgress (1): 0.7/1.3 MBProgress (1): 0.7/1.3 MBProgress (1): 0.7/1.3 MBProgress (1): 0.7/1.3 MBProgress (1): 0.7/1.3 MBProgress (1): 0.7/1.3 MBProgress (1): 0.7/1.3 MBProgress (1): 0.7/1.3 MBProgress (1): 0.7/1.3 MBProgress (1): 0.7/1.3 MBProgress (1): 0.7/1.3 MBProgress (1): 0.7/1.3 MBProgress (1): 0.7/1.3 MBProgress (1): 0.7/1.3 MBProgress (1): 0.7/1.3 MBProgress (1): 0.7/1.3 MBProgress (1): 0.7/1.3 MBProgress (1): 0.7/1.3 MBProgress (1): 0.7/1.3 MBProgress (1): 0.7/1.3 MBProgress (1): 0.7/1.3 MBProgress (1): 0.7/1.3 MBProgress (1): 0.7/1.3 MBProgress (1): 0.7/1.3 MBProgress (1): 0.8/1.3 MBProgress (1): 0.8/1.3 MBProgress (1): 0.8/1.3 MBProgress (1): 0.8/1.3 MBProgress (1): 0.8/1.3 MBProgress (1): 0.8/1.3 MBProgress (1): 0.8/1.3 MBProgress (1): 0.8/1.3 MBProgress (1): 0.8/1.3 MBProgress (1): 0.8/1.3 MBProgress (1): 0.8/1.3 MBProgress (1): 0.8/1.3 MBProgress (1): 0.8/1.3 MBProgress (1): 0.8/1.3 MBProgress (1): 0.8/1.3 MBProgress (1): 0.8/1.3 MBProgress (1): 0.8/1.3 MBProgress (1): 0.8/1.3 MBProgress (1): 0.8/1.3 MBProgress (1): 0.8/1.3 MBProgress (1): 0.8/1.3 MBProgress (1): 0.8/1.3 MBProgress (1): 0.8/1.3 MBProgress (1): 0.8/1.3 MBProgress (1): 0.8/1.3 MBProgress (1): 0.9/1.3 MBProgress (1): 0.9/1.3 MBProgress (1): 0.9/1.3 MBProgress (1): 0.9/1.3 MBProgress (1): 0.9/1.3 MBProgress (1): 0.9/1.3 MBProgress (1): 0.9/1.3 MBProgress (1): 0.9/1.3 MBProgress (1): 0.9/1.3 MBProgress (1): 0.9/1.3 MBProgress (1): 0.9/1.3 MBProgress (1): 0.9/1.3 MBProgress (1): 0.9/1.3 MBProgress (1): 0.9/1.3 MBProgress (1): 0.9/1.3 MBProgress (1): 0.9/1.3 MBProgress (1): 0.9/1.3 MBProgress (1): 0.9/1.3 MBProgress (1): 0.9/1.3 MBProgress (1): 0.9/1.3 MBProgress (1): 0.9/1.3 MBProgress (1): 0.9/1.3 MBProgress (1): 0.9/1.3 MBProgress (1): 0.9/1.3 MBProgress (1): 1.0/1.3 MBProgress (1): 1.0/1.3 MBProgress (1): 1.0/1.3 MBProgress (1): 1.0/1.3 MBProgress (1): 1.0/1.3 MBProgress (1): 1.0/1.3 MBProgress (1): 1.0/1.3 MBProgress (1): 1.0/1.3 MBProgress (1): 1.0/1.3 MBProgress (1): 1.0/1.3 MBProgress (1): 1.0/1.3 MBProgress (1): 1.0/1.3 MBProgress (1): 1.0/1.3 MBProgress (1): 1.0/1.3 MBProgress (1): 1.0/1.3 MBProgress (1): 1.0/1.3 MBProgress (1): 1.0/1.3 MBProgress (1): 1.0/1.3 MBProgress (1): 1.0/1.3 MBProgress (1): 1.0/1.3 MBProgress (1): 1.0/1.3 MBProgress (1): 1.0/1.3 MBProgress (1): 1.0/1.3 MBProgress (1): 1.0/1.3 MBProgress (1): 1.0/1.3 MBProgress (1): 1.1/1.3 MBProgress (1): 1.1/1.3 MBProgress (1): 1.1/1.3 MBProgress (1): 1.1/1.3 MBProgress (1): 1.1/1.3 MBProgress (1): 1.1/1.3 MBProgress (1): 1.1/1.3 MBProgress (1): 1.1/1.3 MBProgress (1): 1.1/1.3 MBProgress (1): 1.1/1.3 MBProgress (1): 1.1/1.3 MBProgress (1): 1.1/1.3 MBProgress (1): 1.1/1.3 MBProgress (1): 1.1/1.3 MBProgress (1): 1.1/1.3 MBProgress (1): 1.1/1.3 MBProgress (1): 1.1/1.3 MBProgress (1): 1.1/1.3 MBProgress (1): 1.1/1.3 MBProgress (1): 1.1/1.3 MBProgress (1): 1.1/1.3 MBProgress (1): 1.1/1.3 MBProgress (1): 1.1/1.3 MBProgress (1): 1.1/1.3 MBProgress (1): 1.2/1.3 MBProgress (1): 1.2/1.3 MBProgress (1): 1.2/1.3 MBProgress (1): 1.2/1.3 MBProgress (1): 1.2/1.3 MBProgress (1): 1.2/1.3 MBProgress (1): 1.2/1.3 MBProgress (1): 1.2/1.3 MBProgress (1): 1.2/1.3 MBProgress (1): 1.2/1.3 MBProgress (1): 1.2/1.3 MBProgress (1): 1.2/1.3 MBProgress (1): 1.2/1.3 MBProgress (1): 1.2/1.3 MBProgress (1): 1.2/1.3 MBProgress (1): 1.2/1.3 MBProgress (1): 1.2/1.3 MBProgress (1): 1.2/1.3 MBProgress (1): 1.2/1.3 MBProgress (1): 1.2/1.3 MBProgress (1): 1.2/1.3 MBProgress (1): 1.2/1.3 MBProgress (1): 1.2/1.3 MBProgress (1): 1.2/1.3 MBProgress (1): 1.2/1.3 MBProgress (1): 1.3/1.3 MBProgress (1): 1.3/1.3 MBProgress (1): 1.3/1.3 MBProgress (1): 1.3/1.3 MBProgress (1): 1.3/1.3 MBProgress (1): 1.3/1.3 MBProgress (1): 1.3/1.3 MBProgress (1): 1.3/1.3 MBProgress (1): 1.3/1.3 MBProgress (1): 1.3/1.3 MBProgress (1): 1.3/1.3 MBProgress (1): 1.3/1.3 MBProgress (1): 1.3/1.3 MBProgress (1): 1.3/1.3 MBProgress (1): 1.3/1.3 MBProgress (1): 1.3/1.3 MBProgress (1): 1.3/1.3 MBProgress (1): 1.3 MB                        Downloaded from central: https://repo.maven.apache.org/maven2/org/hibernate/validator/hibernate-validator/6.2.3.Final/hibernate-validator-6.2.3.Final.jar (1.3 MB at 7.0 MB/s)
[INFO] 
[INFO] --- maven-resources-plugin:2.6:resources (default-resources) @ bean-validation ---
[INFO] Using 'UTF-8' encoding to copy filtered resources.
[INFO] Copying 3 resources
[INFO] 
[INFO] --- maven-compiler-plugin:3.1:compile (default-compile) @ bean-validation ---
[INFO] Changes detected - recompiling the module!
[INFO] Compiling 5 source files to <https://ci-builds.apache.org/job/Struts/job/Struts-examples-dependency-check/ws/bean-validation/target/classes>
[WARNING] <https://ci-builds.apache.org/job/Struts/job/Struts-examples-dependency-check/ws/bean-validation/src/main/java/org/apache/struts/edit/model/Person.java>: <https://ci-builds.apache.org/job/Struts/job/Struts-examples-dependency-check/ws/bean-validation/src/main/java/org/apache/struts/edit/model/Person.java> uses or overrides a deprecated API.
[WARNING] <https://ci-builds.apache.org/job/Struts/job/Struts-examples-dependency-check/ws/bean-validation/src/main/java/org/apache/struts/edit/model/Person.java>: Recompile with -Xlint:deprecation for details.
[INFO] 
[INFO] --- maven-resources-plugin:2.6:testResources (default-testResources) @ bean-validation ---
[INFO] Using 'UTF-8' encoding to copy filtered resources.
[INFO] skip non existing resourceDirectory <https://ci-builds.apache.org/job/Struts/job/Struts-examples-dependency-check/ws/bean-validation/src/test/resources>
[INFO] 
[INFO] --- maven-compiler-plugin:3.1:testCompile (default-testCompile) @ bean-validation ---
[INFO] No sources to compile
[INFO] 
[INFO] --- maven-surefire-plugin:2.12.4:test (default-test) @ bean-validation ---
[INFO] No tests to run.
[INFO] 
[INFO] --- maven-war-plugin:3.4.0:war (default-war) @ bean-validation ---
[INFO] Packaging webapp
[INFO] Assembling webapp [bean-validation] in [<https://ci-builds.apache.org/job/Struts/job/Struts-examples-dependency-check/ws/bean-validation/target/bean-validation]>
[INFO] Processing war project
[INFO] Copying webapp resources [<https://ci-builds.apache.org/job/Struts/job/Struts-examples-dependency-check/ws/bean-validation/src/main/webapp]>
[INFO] Building war: <https://ci-builds.apache.org/job/Struts/job/Struts-examples-dependency-check/ws/bean-validation/target/bean-validation.war>
[INFO] 
[INFO] --- dependency-check-maven:7.2.1:check (default) @ bean-validation ---
[INFO] Checking for updates
[INFO] Skipping NVD check since last check was within 4 hours.
[INFO] Skipping RetireJS update since last update was within 24 hours.
[INFO] Check for updates complete (90 ms)
[INFO] 

Dependency-Check is an open source tool performing a best effort analysis of 3rd party dependencies; false positives and false negatives may exist in the analysis performed by the tool. Use of the tool and the reporting provided constitutes acceptance for use in an AS IS condition, and there are NO warranties, implied or otherwise, with regard to the analysis or its use. Any use of the tool and the reporting provided is at the user’s risk. In no event shall the copyright holder or OWASP be held liable for any damages whatsoever arising out of or in connection with the use of this tool, the analysis performed, or the resulting report.


   About ODC: https://jeremylong.github.io/DependencyCheck/general/internals.html
   False Positives: https://jeremylong.github.io/DependencyCheck/general/suppression.html

💖 Sponsor: https://github.com/sponsors/jeremylong


[INFO] Analysis Started
[INFO] Finished Archive Analyzer (0 seconds)
[INFO] Finished File Name Analyzer (0 seconds)
[INFO] Finished Jar Analyzer (0 seconds)
[INFO] Finished Dependency Merging Analyzer (0 seconds)
[INFO] Finished Version Filter Analyzer (0 seconds)
[INFO] Finished Hint Analyzer (0 seconds)
[INFO] Created CPE Index (3 seconds)
[INFO] Finished CPE Analyzer (3 seconds)
[INFO] Finished False Positive Analyzer (0 seconds)
[INFO] Finished NVD CVE Analyzer (0 seconds)
[INFO] Finished RetireJS Analyzer (0 seconds)
[INFO] Finished Sonatype OSS Index Analyzer (1 seconds)
[INFO] Finished Vulnerability Suppression Analyzer (0 seconds)
[INFO] Finished Dependency Bundling Analyzer (0 seconds)
[INFO] Analysis Complete (5 seconds)
[INFO] Writing report to: <https://ci-builds.apache.org/job/Struts/job/Struts-examples-dependency-check/ws/bean-validation/target/dependency-check-report.html>
[WARNING] 

One or more dependencies were identified with known vulnerabilities in Bean Validation:

commons-fileupload-1.5.jar (pkg:maven/commons-fileupload/commons-fileupload@1.5, cpe:2.3:a:apache:commons_fileupload:1.5:*:*:*:*:*:*:*, cpe:2.3:a:apache:commons_net:1.5:*:*:*:*:*:*:*) : CVE-2021-37533
commons-io-2.13.0.jar (pkg:maven/commons-io/commons-io@2.13.0, cpe:2.3:a:apache:commons_io:2.13.0:*:*:*:*:*:*:*, cpe:2.3:a:apache:commons_net:2.13.0:*:*:*:*:*:*:*) : CVE-2021-37533
commons-text-1.10.0.jar (pkg:maven/org.apache.commons/commons-text@1.10.0, cpe:2.3:a:apache:commons_net:1.10.0:*:*:*:*:*:*:*, cpe:2.3:a:apache:commons_text:1.10.0:*:*:*:*:*:*:*) : CVE-2021-37533
javax.el-3.0.1-b12.jar (pkg:maven/org.glassfish/javax.el@3.0.1-b12) : CVE-2021-28170


See the dependency-check report for more details.


[INFO] ------------------------------------------------------------------------
[INFO] Reactor Summary:
[INFO] 
[INFO] Struts 2 Examples 1.1.0 ............................ SUCCESS [03:54 min]
[INFO] Action chaining .................................... SUCCESS [ 14.234 s]
[INFO] Annotations with Convention Plugin ................. SUCCESS [  9.311 s]
[INFO] Basic Struts2 Example .............................. SUCCESS [  5.156 s]
[INFO] Bean Validation .................................... FAILURE [ 13.761 s]
[INFO] Struts 2 Blank Webapp .............................. SKIPPED
[INFO] Coding Struts 2 Action ............................. SKIPPED
[INFO] Control Tags ....................................... SKIPPED
[INFO] CRUD Example ....................................... SKIPPED
[INFO] Debugging Struts ................................... SKIPPED
[INFO] Dynamic Url ........................................ SKIPPED
[INFO] Exception handling ................................. SKIPPED
[INFO] Exclude Parameters ................................. SKIPPED
[INFO] Expression Cache ................................... SKIPPED
[INFO] File upload ........................................ SKIPPED
[INFO] Form Processing .................................... SKIPPED
[INFO] Form Tags .......................................... SKIPPED
[INFO] Form validation .................................... SKIPPED
[INFO] XML based form validation .......................... SKIPPED
[INFO] Hello World Struts 2 Example Application ........... SKIPPED
[INFO] Http Session ....................................... SKIPPED
[INFO] Struts 2 Interceptors .............................. SKIPPED
[INFO] jfreechart ......................................... SKIPPED
[INFO] JSON produce/consume ............................... SKIPPED
[INFO] Customized JSON produce ............................ SKIPPED
[INFO] Struts 2 Mail Reader Webapp ........................ SKIPPED
[INFO] Message resource ................................... SKIPPED
[INFO] Message Store ...................................... SKIPPED
[INFO] Portlet Webapp ..................................... SKIPPED
[INFO] Preparable Interface ............................... SKIPPED
[INFO] Struts 2 Quarkus ................................... SKIPPED
[INFO] REST to Action Mapper Example Application .......... SKIPPED
[INFO] REST Plugin based application with AngularJS ....... SKIPPED
[INFO] Struts2 with Basic Shiro Security Integration ...... SKIPPED
[INFO] Struts2 with Spring Integration .................... SKIPPED
[INFO] Custom TextProvider ................................ SKIPPED
[INFO] Struts Tiles Example ............................... SKIPPED
[INFO] Struts 2 Themes .................................... SKIPPED
[INFO] Struts 2 Themes Override ........................... SKIPPED
[INFO] Type Conversion .................................... SKIPPED
[INFO] Unit Testing ....................................... SKIPPED
[INFO] Unknown handler .................................... SKIPPED
[INFO] Using Struts 2 Tags ................................ SKIPPED
[INFO] validation-messages ................................ SKIPPED
[INFO] Wildcard Method Selection .......................... SKIPPED
[INFO] Wildcard RegEx pattern matching .................... SKIPPED
[INFO] JasperReports Tutorial 1.1.0 ....................... SKIPPED
[INFO] ------------------------------------------------------------------------
[INFO] BUILD FAILURE
[INFO] ------------------------------------------------------------------------
[INFO] Total time: 04:40 min
[INFO] Finished at: 2024-01-29T22:03:53Z
[INFO] ------------------------------------------------------------------------
[ERROR] Failed to execute goal org.owasp:dependency-check-maven:7.2.1:check (default) on project bean-validation: 
[ERROR] 
[ERROR] One or more dependencies were identified with vulnerabilities that have a CVSS score greater than or equal to '7.0': 
[ERROR] 
[ERROR] javax.el-3.0.1-b12.jar: CVE-2021-28170(7.5)
[ERROR] 
[ERROR] See the dependency-check report for more details.
[ERROR] 
[ERROR] 
[ERROR] -> [Help 1]
[ERROR] 
[ERROR] To see the full stack trace of the errors, re-run Maven with the -e switch.
[ERROR] Re-run Maven using the -X switch to enable full debug logging.
[ERROR] 
[ERROR] For more information about the errors and possible solutions, please read the following articles:
[ERROR] [Help 1] http://cwiki.apache.org/confluence/display/MAVEN/MojoFailureException
[ERROR] 
[ERROR] After correcting the problems, you can resume the build with the command
[ERROR]   mvn <goals> -rf :bean-validation
Build step 'Execute shell' marked build as failure
Setting MAVEN_3_LATEST_HOME=/home/jenkins/tools/maven/latest3

Build failed in Jenkins: Struts » Struts-examples-dependency-check #116

Posted by Apache Jenkins Server <je...@builds.apache.org>.
See <https://ci-builds.apache.org/job/Struts/job/Struts-examples-dependency-check/116/display/redirect>

Changes:


------------------------------------------
[...truncated 25.52 KB...]
[INFO] Building Basic Struts2 Example 1.1.0                              [4/47]
[INFO] --------------------------------[ war ]---------------------------------
[INFO] 
[INFO] --- maven-resources-plugin:2.6:resources (default-resources) @ basic-struts ---
[INFO] Using 'UTF-8' encoding to copy filtered resources.
[INFO] Copying 2 resources
[INFO] 
[INFO] --- maven-compiler-plugin:3.1:compile (default-compile) @ basic-struts ---
[INFO] No sources to compile
[INFO] 
[INFO] --- maven-resources-plugin:2.6:testResources (default-testResources) @ basic-struts ---
[INFO] Using 'UTF-8' encoding to copy filtered resources.
[INFO] skip non existing resourceDirectory <https://ci-builds.apache.org/job/Struts/job/Struts-examples-dependency-check/ws/basic-struts/src/test/resources>
[INFO] 
[INFO] --- maven-compiler-plugin:3.1:testCompile (default-testCompile) @ basic-struts ---
[INFO] No sources to compile
[INFO] 
[INFO] --- maven-surefire-plugin:2.12.4:test (default-test) @ basic-struts ---
[INFO] No tests to run.
[INFO] 
[INFO] --- maven-war-plugin:3.4.0:war (default-war) @ basic-struts ---
[INFO] Packaging webapp
[INFO] Assembling webapp [basic-struts] in [<https://ci-builds.apache.org/job/Struts/job/Struts-examples-dependency-check/ws/basic-struts/target/basic-struts]>
[INFO] Processing war project
[INFO] Copying webapp resources [<https://ci-builds.apache.org/job/Struts/job/Struts-examples-dependency-check/ws/basic-struts/src/main/webapp]>
[INFO] Building war: <https://ci-builds.apache.org/job/Struts/job/Struts-examples-dependency-check/ws/basic-struts/target/basic-struts.war>
[INFO] 
[INFO] --- dependency-check-maven:7.2.1:check (default) @ basic-struts ---
[INFO] Checking for updates
[INFO] Skipping NVD check since last check was within 4 hours.
[INFO] Skipping RetireJS update since last update was within 24 hours.
[INFO] Check for updates complete (45 ms)
[INFO] 

Dependency-Check is an open source tool performing a best effort analysis of 3rd party dependencies; false positives and false negatives may exist in the analysis performed by the tool. Use of the tool and the reporting provided constitutes acceptance for use in an AS IS condition, and there are NO warranties, implied or otherwise, with regard to the analysis or its use. Any use of the tool and the reporting provided is at the user’s risk. In no event shall the copyright holder or OWASP be held liable for any damages whatsoever arising out of or in connection with the use of this tool, the analysis performed, or the resulting report.


   About ODC: https://jeremylong.github.io/DependencyCheck/general/internals.html
   False Positives: https://jeremylong.github.io/DependencyCheck/general/suppression.html

💖 Sponsor: https://github.com/sponsors/jeremylong


[INFO] Analysis Started
[INFO] Finished Archive Analyzer (0 seconds)
[INFO] Finished File Name Analyzer (0 seconds)
[INFO] Finished Jar Analyzer (0 seconds)
[INFO] Finished Dependency Merging Analyzer (0 seconds)
[INFO] Finished Version Filter Analyzer (0 seconds)
[INFO] Finished Hint Analyzer (0 seconds)
[INFO] Created CPE Index (2 seconds)
[INFO] Finished CPE Analyzer (2 seconds)
[INFO] Finished False Positive Analyzer (0 seconds)
[INFO] Finished NVD CVE Analyzer (0 seconds)
[INFO] Finished RetireJS Analyzer (0 seconds)
[INFO] Finished Sonatype OSS Index Analyzer (0 seconds)
[INFO] Finished Vulnerability Suppression Analyzer (0 seconds)
[INFO] Finished Dependency Bundling Analyzer (0 seconds)
[INFO] Analysis Complete (3 seconds)
[INFO] Writing report to: <https://ci-builds.apache.org/job/Struts/job/Struts-examples-dependency-check/ws/basic-struts/target/dependency-check-report.html>
[WARNING] 

One or more dependencies were identified with known vulnerabilities in Basic Struts2 Example:

commons-fileupload-1.5.jar (pkg:maven/commons-fileupload/commons-fileupload@1.5, cpe:2.3:a:apache:commons_fileupload:1.5:*:*:*:*:*:*:*, cpe:2.3:a:apache:commons_net:1.5:*:*:*:*:*:*:*) : CVE-2021-37533
commons-io-2.13.0.jar (pkg:maven/commons-io/commons-io@2.13.0, cpe:2.3:a:apache:commons_io:2.13.0:*:*:*:*:*:*:*, cpe:2.3:a:apache:commons_net:2.13.0:*:*:*:*:*:*:*) : CVE-2021-37533
commons-text-1.10.0.jar (pkg:maven/org.apache.commons/commons-text@1.10.0, cpe:2.3:a:apache:commons_net:1.10.0:*:*:*:*:*:*:*, cpe:2.3:a:apache:commons_text:1.10.0:*:*:*:*:*:*:*) : CVE-2021-37533


See the dependency-check report for more details.


[INFO] 
[INFO] -----------------< org.apache.struts:bean-validation >------------------
[INFO] Building Bean Validation 1.1.0                                    [5/47]
[INFO] --------------------------------[ war ]---------------------------------
Downloading from apache-public: https://repository.apache.org/content/groups/public/org/hibernate/validator/hibernate-validator/6.2.3.Final/hibernate-validator-6.2.3.Final.pom
Downloading from apache-staging: https://repository.apache.org/content/groups/staging/org/hibernate/validator/hibernate-validator/6.2.3.Final/hibernate-validator-6.2.3.Final.pom
Downloading from apache-snapshots: https://repository.apache.org/content/groups/snapshots/org/hibernate/validator/hibernate-validator/6.2.3.Final/hibernate-validator-6.2.3.Final.pom
Downloading from oss-snapshots: https://oss.sonatype.org/content/repositories/snapshots/org/hibernate/validator/hibernate-validator/6.2.3.Final/hibernate-validator-6.2.3.Final.pom
Downloading from central: https://repo.maven.apache.org/maven2/org/hibernate/validator/hibernate-validator/6.2.3.Final/hibernate-validator-6.2.3.Final.pom
Progress (1): 1.4/14 kBProgress (1): 2.8/14 kBProgress (1): 4.1/14 kBProgress (1): 5.5/14 kBProgress (1): 6.9/14 kBProgress (1): 8.3/14 kBProgress (1): 9.7/14 kBProgress (1): 11/14 kB Progress (1): 12/14 kBProgress (1): 14 kB                      Downloaded from central: https://repo.maven.apache.org/maven2/org/hibernate/validator/hibernate-validator/6.2.3.Final/hibernate-validator-6.2.3.Final.pom (14 kB at 71 kB/s)
Downloading from apache-public: https://repository.apache.org/content/groups/public/org/hibernate/validator/hibernate-validator-parent/6.2.3.Final/hibernate-validator-parent-6.2.3.Final.pom
Downloading from apache-staging: https://repository.apache.org/content/groups/staging/org/hibernate/validator/hibernate-validator-parent/6.2.3.Final/hibernate-validator-parent-6.2.3.Final.pom
Downloading from apache-snapshots: https://repository.apache.org/content/groups/snapshots/org/hibernate/validator/hibernate-validator-parent/6.2.3.Final/hibernate-validator-parent-6.2.3.Final.pom
Downloading from oss-snapshots: https://oss.sonatype.org/content/repositories/snapshots/org/hibernate/validator/hibernate-validator-parent/6.2.3.Final/hibernate-validator-parent-6.2.3.Final.pom
Downloading from central: https://repo.maven.apache.org/maven2/org/hibernate/validator/hibernate-validator-parent/6.2.3.Final/hibernate-validator-parent-6.2.3.Final.pom
Progress (1): 4.1/78 kBProgress (1): 8.2/78 kBProgress (1): 12/78 kB Progress (1): 16/78 kBProgress (1): 20/78 kBProgress (1): 25/78 kBProgress (1): 29/78 kBProgress (1): 33/78 kBProgress (1): 37/78 kBProgress (1): 41/78 kBProgress (1): 45/78 kBProgress (1): 49/78 kBProgress (1): 53/78 kBProgress (1): 57/78 kBProgress (1): 61/78 kBProgress (1): 66/78 kBProgress (1): 70/78 kBProgress (1): 74/78 kBProgress (1): 78 kB                      Downloaded from central: https://repo.maven.apache.org/maven2/org/hibernate/validator/hibernate-validator-parent/6.2.3.Final/hibernate-validator-parent-6.2.3.Final.pom (78 kB at 775 kB/s)
Downloading from apache-public: https://repository.apache.org/content/groups/public/org/apache/struts/struts2-bean-validation-plugin/6.3.0.2/struts2-bean-validation-plugin-6.3.0.2.pom
Progress (1): 3.5 kB                    Downloaded from apache-public: https://repository.apache.org/content/groups/public/org/apache/struts/struts2-bean-validation-plugin/6.3.0.2/struts2-bean-validation-plugin-6.3.0.2.pom (3.5 kB at 4.3 kB/s)
Downloading from apache-public: https://repository.apache.org/content/groups/public/org/hibernate/validator/hibernate-validator/6.2.3.Final/hibernate-validator-6.2.3.Final.jar
Downloading from apache-public: https://repository.apache.org/content/groups/public/org/apache/struts/struts2-bean-validation-plugin/6.3.0.2/struts2-bean-validation-plugin-6.3.0.2.jar
Progress (1): 4.1/25 kBProgress (1): 7.8/25 kBProgress (1): 8.2/25 kBProgress (1): 12/25 kB Progress (1): 16/25 kBProgress (1): 20/25 kBProgress (1): 24/25 kBProgress (1): 25/25 kBProgress (1): 25 kB                      Downloaded from apache-public: https://repository.apache.org/content/groups/public/org/apache/struts/struts2-bean-validation-plugin/6.3.0.2/struts2-bean-validation-plugin-6.3.0.2.jar (25 kB at 28 kB/s)
Downloading from apache-staging: https://repository.apache.org/content/groups/staging/org/hibernate/validator/hibernate-validator/6.2.3.Final/hibernate-validator-6.2.3.Final.jar
Downloading from apache-snapshots: https://repository.apache.org/content/groups/snapshots/org/hibernate/validator/hibernate-validator/6.2.3.Final/hibernate-validator-6.2.3.Final.jar
Downloading from oss-snapshots: https://oss.sonatype.org/content/repositories/snapshots/org/hibernate/validator/hibernate-validator/6.2.3.Final/hibernate-validator-6.2.3.Final.jar
Downloading from central: https://repo.maven.apache.org/maven2/org/hibernate/validator/hibernate-validator/6.2.3.Final/hibernate-validator-6.2.3.Final.jar
Progress (1): 0/1.3 MBProgress (1): 0/1.3 MBProgress (1): 0/1.3 MBProgress (1): 0/1.3 MBProgress (1): 0/1.3 MBProgress (1): 0/1.3 MBProgress (1): 0/1.3 MBProgress (1): 0/1.3 MBProgress (1): 0/1.3 MBProgress (1): 0/1.3 MBProgress (1): 0/1.3 MBProgress (1): 0/1.3 MBProgress (1): 0.1/1.3 MBProgress (1): 0.1/1.3 MBProgress (1): 0.1/1.3 MBProgress (1): 0.1/1.3 MBProgress (1): 0.1/1.3 MBProgress (1): 0.1/1.3 MBProgress (1): 0.1/1.3 MBProgress (1): 0.1/1.3 MBProgress (1): 0.1/1.3 MBProgress (1): 0.1/1.3 MBProgress (1): 0.1/1.3 MBProgress (1): 0.1/1.3 MBProgress (1): 0.1/1.3 MBProgress (1): 0.1/1.3 MBProgress (1): 0.1/1.3 MBProgress (1): 0.1/1.3 MBProgress (1): 0.1/1.3 MBProgress (1): 0.1/1.3 MBProgress (1): 0.1/1.3 MBProgress (1): 0.1/1.3 MBProgress (1): 0.1/1.3 MBProgress (1): 0.1/1.3 MBProgress (1): 0.1/1.3 MBProgress (1): 0.1/1.3 MBProgress (1): 0.2/1.3 MBProgress (1): 0.2/1.3 MBProgress (1): 0.2/1.3 MBProgress (1): 0.2/1.3 MBProgress (1): 0.2/1.3 MBProgress (1): 0.2/1.3 MBProgress (1): 0.2/1.3 MBProgress (1): 0.2/1.3 MBProgress (1): 0.2/1.3 MBProgress (1): 0.2/1.3 MBProgress (1): 0.2/1.3 MBProgress (1): 0.2/1.3 MBProgress (1): 0.2/1.3 MBProgress (1): 0.2/1.3 MBProgress (1): 0.2/1.3 MBProgress (1): 0.2/1.3 MBProgress (1): 0.2/1.3 MBProgress (1): 0.2/1.3 MBProgress (1): 0.2/1.3 MBProgress (1): 0.2/1.3 MBProgress (1): 0.2/1.3 MBProgress (1): 0.2/1.3 MBProgress (1): 0.2/1.3 MBProgress (1): 0.2/1.3 MBProgress (1): 0.2/1.3 MBProgress (1): 0.3/1.3 MBProgress (1): 0.3/1.3 MBProgress (1): 0.3/1.3 MBProgress (1): 0.3/1.3 MBProgress (1): 0.3/1.3 MBProgress (1): 0.3/1.3 MBProgress (1): 0.3/1.3 MBProgress (1): 0.3/1.3 MBProgress (1): 0.3/1.3 MBProgress (1): 0.3/1.3 MBProgress (1): 0.3/1.3 MBProgress (1): 0.3/1.3 MBProgress (1): 0.3/1.3 MBProgress (1): 0.3/1.3 MBProgress (1): 0.3/1.3 MBProgress (1): 0.3/1.3 MBProgress (1): 0.3/1.3 MBProgress (1): 0.3/1.3 MBProgress (1): 0.3/1.3 MBProgress (1): 0.3/1.3 MBProgress (1): 0.3/1.3 MBProgress (1): 0.3/1.3 MBProgress (1): 0.3/1.3 MBProgress (1): 0.3/1.3 MBProgress (1): 0.4/1.3 MBProgress (1): 0.4/1.3 MBProgress (1): 0.4/1.3 MBProgress (1): 0.4/1.3 MBProgress (1): 0.4/1.3 MBProgress (1): 0.4/1.3 MBProgress (1): 0.4/1.3 MBProgress (1): 0.4/1.3 MBProgress (1): 0.4/1.3 MBProgress (1): 0.4/1.3 MBProgress (1): 0.4/1.3 MBProgress (1): 0.4/1.3 MBProgress (1): 0.4/1.3 MBProgress (1): 0.4/1.3 MBProgress (1): 0.4/1.3 MBProgress (1): 0.4/1.3 MBProgress (1): 0.4/1.3 MBProgress (1): 0.4/1.3 MBProgress (1): 0.4/1.3 MBProgress (1): 0.4/1.3 MBProgress (1): 0.4/1.3 MBProgress (1): 0.4/1.3 MBProgress (1): 0.4/1.3 MBProgress (1): 0.4/1.3 MBProgress (1): 0.4/1.3 MBProgress (1): 0.5/1.3 MBProgress (1): 0.5/1.3 MBProgress (1): 0.5/1.3 MBProgress (1): 0.5/1.3 MBProgress (1): 0.5/1.3 MBProgress (1): 0.5/1.3 MBProgress (1): 0.5/1.3 MBProgress (1): 0.5/1.3 MBProgress (1): 0.5/1.3 MBProgress (1): 0.5/1.3 MBProgress (1): 0.5/1.3 MBProgress (1): 0.5/1.3 MBProgress (1): 0.5/1.3 MBProgress (1): 0.5/1.3 MBProgress (1): 0.5/1.3 MBProgress (1): 0.5/1.3 MBProgress (1): 0.5/1.3 MBProgress (1): 0.5/1.3 MBProgress (1): 0.5/1.3 MBProgress (1): 0.5/1.3 MBProgress (1): 0.5/1.3 MBProgress (1): 0.5/1.3 MBProgress (1): 0.5/1.3 MBProgress (1): 0.5/1.3 MBProgress (1): 0.5/1.3 MBProgress (1): 0.6/1.3 MBProgress (1): 0.6/1.3 MBProgress (1): 0.6/1.3 MBProgress (1): 0.6/1.3 MBProgress (1): 0.6/1.3 MBProgress (1): 0.6/1.3 MBProgress (1): 0.6/1.3 MBProgress (1): 0.6/1.3 MBProgress (1): 0.6/1.3 MBProgress (1): 0.6/1.3 MBProgress (1): 0.6/1.3 MBProgress (1): 0.6/1.3 MBProgress (1): 0.6/1.3 MBProgress (1): 0.6/1.3 MBProgress (1): 0.6/1.3 MBProgress (1): 0.6/1.3 MBProgress (1): 0.6/1.3 MBProgress (1): 0.6/1.3 MBProgress (1): 0.6/1.3 MBProgress (1): 0.6/1.3 MBProgress (1): 0.6/1.3 MBProgress (1): 0.6/1.3 MBProgress (1): 0.6/1.3 MBProgress (1): 0.6/1.3 MBProgress (1): 0.7/1.3 MBProgress (1): 0.7/1.3 MBProgress (1): 0.7/1.3 MBProgress (1): 0.7/1.3 MBProgress (1): 0.7/1.3 MBProgress (1): 0.7/1.3 MBProgress (1): 0.7/1.3 MBProgress (1): 0.7/1.3 MBProgress (1): 0.7/1.3 MBProgress (1): 0.7/1.3 MBProgress (1): 0.7/1.3 MBProgress (1): 0.7/1.3 MBProgress (1): 0.7/1.3 MBProgress (1): 0.7/1.3 MBProgress (1): 0.7/1.3 MBProgress (1): 0.7/1.3 MBProgress (1): 0.7/1.3 MBProgress (1): 0.7/1.3 MBProgress (1): 0.7/1.3 MBProgress (1): 0.7/1.3 MBProgress (1): 0.7/1.3 MBProgress (1): 0.7/1.3 MBProgress (1): 0.7/1.3 MBProgress (1): 0.7/1.3 MBProgress (1): 0.8/1.3 MBProgress (1): 0.8/1.3 MBProgress (1): 0.8/1.3 MBProgress (1): 0.8/1.3 MBProgress (1): 0.8/1.3 MBProgress (1): 0.8/1.3 MBProgress (1): 0.8/1.3 MBProgress (1): 0.8/1.3 MBProgress (1): 0.8/1.3 MBProgress (1): 0.8/1.3 MBProgress (1): 0.8/1.3 MBProgress (1): 0.8/1.3 MBProgress (1): 0.8/1.3 MBProgress (1): 0.8/1.3 MBProgress (1): 0.8/1.3 MBProgress (1): 0.8/1.3 MBProgress (1): 0.8/1.3 MBProgress (1): 0.8/1.3 MBProgress (1): 0.8/1.3 MBProgress (1): 0.8/1.3 MBProgress (1): 0.8/1.3 MBProgress (1): 0.8/1.3 MBProgress (1): 0.8/1.3 MBProgress (1): 0.8/1.3 MBProgress (1): 0.8/1.3 MBProgress (1): 0.9/1.3 MBProgress (1): 0.9/1.3 MBProgress (1): 0.9/1.3 MBProgress (1): 0.9/1.3 MBProgress (1): 0.9/1.3 MBProgress (1): 0.9/1.3 MBProgress (1): 0.9/1.3 MBProgress (1): 0.9/1.3 MBProgress (1): 0.9/1.3 MBProgress (1): 0.9/1.3 MBProgress (1): 0.9/1.3 MBProgress (1): 0.9/1.3 MBProgress (1): 0.9/1.3 MBProgress (1): 0.9/1.3 MBProgress (1): 0.9/1.3 MBProgress (1): 0.9/1.3 MBProgress (1): 0.9/1.3 MBProgress (1): 0.9/1.3 MBProgress (1): 0.9/1.3 MBProgress (1): 0.9/1.3 MBProgress (1): 0.9/1.3 MBProgress (1): 0.9/1.3 MBProgress (1): 0.9/1.3 MBProgress (1): 0.9/1.3 MBProgress (1): 1.0/1.3 MBProgress (1): 1.0/1.3 MBProgress (1): 1.0/1.3 MBProgress (1): 1.0/1.3 MBProgress (1): 1.0/1.3 MBProgress (1): 1.0/1.3 MBProgress (1): 1.0/1.3 MBProgress (1): 1.0/1.3 MBProgress (1): 1.0/1.3 MBProgress (1): 1.0/1.3 MBProgress (1): 1.0/1.3 MBProgress (1): 1.0/1.3 MBProgress (1): 1.0/1.3 MBProgress (1): 1.0/1.3 MBProgress (1): 1.0/1.3 MBProgress (1): 1.0/1.3 MBProgress (1): 1.0/1.3 MBProgress (1): 1.0/1.3 MBProgress (1): 1.0/1.3 MBProgress (1): 1.0/1.3 MBProgress (1): 1.0/1.3 MBProgress (1): 1.0/1.3 MBProgress (1): 1.0/1.3 MBProgress (1): 1.0/1.3 MBProgress (1): 1.0/1.3 MBProgress (1): 1.1/1.3 MBProgress (1): 1.1/1.3 MBProgress (1): 1.1/1.3 MBProgress (1): 1.1/1.3 MBProgress (1): 1.1/1.3 MBProgress (1): 1.1/1.3 MBProgress (1): 1.1/1.3 MBProgress (1): 1.1/1.3 MBProgress (1): 1.1/1.3 MBProgress (1): 1.1/1.3 MBProgress (1): 1.1/1.3 MBProgress (1): 1.1/1.3 MBProgress (1): 1.1/1.3 MBProgress (1): 1.1/1.3 MBProgress (1): 1.1/1.3 MBProgress (1): 1.1/1.3 MBProgress (1): 1.1/1.3 MBProgress (1): 1.1/1.3 MBProgress (1): 1.1/1.3 MBProgress (1): 1.1/1.3 MBProgress (1): 1.1/1.3 MBProgress (1): 1.1/1.3 MBProgress (1): 1.1/1.3 MBProgress (1): 1.1/1.3 MBProgress (1): 1.2/1.3 MBProgress (1): 1.2/1.3 MBProgress (1): 1.2/1.3 MBProgress (1): 1.2/1.3 MBProgress (1): 1.2/1.3 MBProgress (1): 1.2/1.3 MBProgress (1): 1.2/1.3 MBProgress (1): 1.2/1.3 MBProgress (1): 1.2/1.3 MBProgress (1): 1.2/1.3 MBProgress (1): 1.2/1.3 MBProgress (1): 1.2/1.3 MBProgress (1): 1.2/1.3 MBProgress (1): 1.2/1.3 MBProgress (1): 1.2/1.3 MBProgress (1): 1.2/1.3 MBProgress (1): 1.2/1.3 MBProgress (1): 1.2/1.3 MBProgress (1): 1.2/1.3 MBProgress (1): 1.2/1.3 MBProgress (1): 1.2/1.3 MBProgress (1): 1.2/1.3 MBProgress (1): 1.2/1.3 MBProgress (1): 1.2/1.3 MBProgress (1): 1.2/1.3 MBProgress (1): 1.3/1.3 MBProgress (1): 1.3/1.3 MBProgress (1): 1.3/1.3 MBProgress (1): 1.3/1.3 MBProgress (1): 1.3/1.3 MBProgress (1): 1.3/1.3 MBProgress (1): 1.3/1.3 MBProgress (1): 1.3/1.3 MBProgress (1): 1.3/1.3 MBProgress (1): 1.3/1.3 MBProgress (1): 1.3/1.3 MBProgress (1): 1.3/1.3 MBProgress (1): 1.3/1.3 MBProgress (1): 1.3/1.3 MBProgress (1): 1.3/1.3 MBProgress (1): 1.3/1.3 MBProgress (1): 1.3/1.3 MBProgress (1): 1.3 MB                        Downloaded from central: https://repo.maven.apache.org/maven2/org/hibernate/validator/hibernate-validator/6.2.3.Final/hibernate-validator-6.2.3.Final.jar (1.3 MB at 6.4 MB/s)
[INFO] 
[INFO] --- maven-resources-plugin:2.6:resources (default-resources) @ bean-validation ---
[INFO] Using 'UTF-8' encoding to copy filtered resources.
[INFO] Copying 3 resources
[INFO] 
[INFO] --- maven-compiler-plugin:3.1:compile (default-compile) @ bean-validation ---
[INFO] Changes detected - recompiling the module!
[INFO] Compiling 5 source files to <https://ci-builds.apache.org/job/Struts/job/Struts-examples-dependency-check/ws/bean-validation/target/classes>
[WARNING] <https://ci-builds.apache.org/job/Struts/job/Struts-examples-dependency-check/ws/bean-validation/src/main/java/org/apache/struts/edit/model/Person.java>: <https://ci-builds.apache.org/job/Struts/job/Struts-examples-dependency-check/ws/bean-validation/src/main/java/org/apache/struts/edit/model/Person.java> uses or overrides a deprecated API.
[WARNING] <https://ci-builds.apache.org/job/Struts/job/Struts-examples-dependency-check/ws/bean-validation/src/main/java/org/apache/struts/edit/model/Person.java>: Recompile with -Xlint:deprecation for details.
[INFO] 
[INFO] --- maven-resources-plugin:2.6:testResources (default-testResources) @ bean-validation ---
[INFO] Using 'UTF-8' encoding to copy filtered resources.
[INFO] skip non existing resourceDirectory <https://ci-builds.apache.org/job/Struts/job/Struts-examples-dependency-check/ws/bean-validation/src/test/resources>
[INFO] 
[INFO] --- maven-compiler-plugin:3.1:testCompile (default-testCompile) @ bean-validation ---
[INFO] No sources to compile
[INFO] 
[INFO] --- maven-surefire-plugin:2.12.4:test (default-test) @ bean-validation ---
[INFO] No tests to run.
[INFO] 
[INFO] --- maven-war-plugin:3.4.0:war (default-war) @ bean-validation ---
[INFO] Packaging webapp
[INFO] Assembling webapp [bean-validation] in [<https://ci-builds.apache.org/job/Struts/job/Struts-examples-dependency-check/ws/bean-validation/target/bean-validation]>
[INFO] Processing war project
[INFO] Copying webapp resources [<https://ci-builds.apache.org/job/Struts/job/Struts-examples-dependency-check/ws/bean-validation/src/main/webapp]>
[INFO] Building war: <https://ci-builds.apache.org/job/Struts/job/Struts-examples-dependency-check/ws/bean-validation/target/bean-validation.war>
[INFO] 
[INFO] --- dependency-check-maven:7.2.1:check (default) @ bean-validation ---
[INFO] Checking for updates
[INFO] Skipping NVD check since last check was within 4 hours.
[INFO] Skipping RetireJS update since last update was within 24 hours.
[INFO] Check for updates complete (40 ms)
[INFO] 

Dependency-Check is an open source tool performing a best effort analysis of 3rd party dependencies; false positives and false negatives may exist in the analysis performed by the tool. Use of the tool and the reporting provided constitutes acceptance for use in an AS IS condition, and there are NO warranties, implied or otherwise, with regard to the analysis or its use. Any use of the tool and the reporting provided is at the user’s risk. In no event shall the copyright holder or OWASP be held liable for any damages whatsoever arising out of or in connection with the use of this tool, the analysis performed, or the resulting report.


   About ODC: https://jeremylong.github.io/DependencyCheck/general/internals.html
   False Positives: https://jeremylong.github.io/DependencyCheck/general/suppression.html

💖 Sponsor: https://github.com/sponsors/jeremylong


[INFO] Analysis Started
[INFO] Finished Archive Analyzer (0 seconds)
[INFO] Finished File Name Analyzer (0 seconds)
[INFO] Finished Jar Analyzer (0 seconds)
[INFO] Finished Dependency Merging Analyzer (0 seconds)
[INFO] Finished Version Filter Analyzer (0 seconds)
[INFO] Finished Hint Analyzer (0 seconds)
[INFO] Created CPE Index (2 seconds)
[INFO] Finished CPE Analyzer (2 seconds)
[INFO] Finished False Positive Analyzer (0 seconds)
[INFO] Finished NVD CVE Analyzer (0 seconds)
[INFO] Finished RetireJS Analyzer (0 seconds)
[INFO] Finished Sonatype OSS Index Analyzer (0 seconds)
[INFO] Finished Vulnerability Suppression Analyzer (0 seconds)
[INFO] Finished Dependency Bundling Analyzer (0 seconds)
[INFO] Analysis Complete (4 seconds)
[INFO] Writing report to: <https://ci-builds.apache.org/job/Struts/job/Struts-examples-dependency-check/ws/bean-validation/target/dependency-check-report.html>
[WARNING] 

One or more dependencies were identified with known vulnerabilities in Bean Validation:

commons-fileupload-1.5.jar (pkg:maven/commons-fileupload/commons-fileupload@1.5, cpe:2.3:a:apache:commons_fileupload:1.5:*:*:*:*:*:*:*, cpe:2.3:a:apache:commons_net:1.5:*:*:*:*:*:*:*) : CVE-2021-37533
commons-io-2.13.0.jar (pkg:maven/commons-io/commons-io@2.13.0, cpe:2.3:a:apache:commons_io:2.13.0:*:*:*:*:*:*:*, cpe:2.3:a:apache:commons_net:2.13.0:*:*:*:*:*:*:*) : CVE-2021-37533
commons-text-1.10.0.jar (pkg:maven/org.apache.commons/commons-text@1.10.0, cpe:2.3:a:apache:commons_net:1.10.0:*:*:*:*:*:*:*, cpe:2.3:a:apache:commons_text:1.10.0:*:*:*:*:*:*:*) : CVE-2021-37533
javax.el-3.0.1-b12.jar (pkg:maven/org.glassfish/javax.el@3.0.1-b12) : CVE-2021-28170


See the dependency-check report for more details.


[INFO] ------------------------------------------------------------------------
[INFO] Reactor Summary:
[INFO] 
[INFO] Struts 2 Examples 1.1.0 ............................ SUCCESS [03:13 min]
[INFO] Action chaining .................................... SUCCESS [  7.779 s]
[INFO] Annotations with Convention Plugin ................. SUCCESS [  8.216 s]
[INFO] Basic Struts2 Example .............................. SUCCESS [  3.988 s]
[INFO] Bean Validation .................................... FAILURE [ 12.218 s]
[INFO] Struts 2 Blank Webapp .............................. SKIPPED
[INFO] Coding Struts 2 Action ............................. SKIPPED
[INFO] Control Tags ....................................... SKIPPED
[INFO] CRUD Example ....................................... SKIPPED
[INFO] Debugging Struts ................................... SKIPPED
[INFO] Dynamic Url ........................................ SKIPPED
[INFO] Exception handling ................................. SKIPPED
[INFO] Exclude Parameters ................................. SKIPPED
[INFO] Expression Cache ................................... SKIPPED
[INFO] File upload ........................................ SKIPPED
[INFO] Form Processing .................................... SKIPPED
[INFO] Form Tags .......................................... SKIPPED
[INFO] Form validation .................................... SKIPPED
[INFO] XML based form validation .......................... SKIPPED
[INFO] Hello World Struts 2 Example Application ........... SKIPPED
[INFO] Http Session ....................................... SKIPPED
[INFO] Struts 2 Interceptors .............................. SKIPPED
[INFO] jfreechart ......................................... SKIPPED
[INFO] JSON produce/consume ............................... SKIPPED
[INFO] Customized JSON produce ............................ SKIPPED
[INFO] Struts 2 Mail Reader Webapp ........................ SKIPPED
[INFO] Message resource ................................... SKIPPED
[INFO] Message Store ...................................... SKIPPED
[INFO] Portlet Webapp ..................................... SKIPPED
[INFO] Preparable Interface ............................... SKIPPED
[INFO] Struts 2 Quarkus ................................... SKIPPED
[INFO] REST to Action Mapper Example Application .......... SKIPPED
[INFO] REST Plugin based application with AngularJS ....... SKIPPED
[INFO] Struts2 with Basic Shiro Security Integration ...... SKIPPED
[INFO] Struts2 with Spring Integration .................... SKIPPED
[INFO] Custom TextProvider ................................ SKIPPED
[INFO] Struts Tiles Example ............................... SKIPPED
[INFO] Struts 2 Themes .................................... SKIPPED
[INFO] Struts 2 Themes Override ........................... SKIPPED
[INFO] Type Conversion .................................... SKIPPED
[INFO] Unit Testing ....................................... SKIPPED
[INFO] Unknown handler .................................... SKIPPED
[INFO] Using Struts 2 Tags ................................ SKIPPED
[INFO] validation-messages ................................ SKIPPED
[INFO] Wildcard Method Selection .......................... SKIPPED
[INFO] Wildcard RegEx pattern matching .................... SKIPPED
[INFO] JasperReports Tutorial 1.1.0 ....................... SKIPPED
[INFO] ------------------------------------------------------------------------
[INFO] BUILD FAILURE
[INFO] ------------------------------------------------------------------------
[INFO] Total time: 03:46 min
[INFO] Finished at: 2024-01-22T08:13:31Z
[INFO] ------------------------------------------------------------------------
[ERROR] Failed to execute goal org.owasp:dependency-check-maven:7.2.1:check (default) on project bean-validation: 
[ERROR] 
[ERROR] One or more dependencies were identified with vulnerabilities that have a CVSS score greater than or equal to '7.0': 
[ERROR] 
[ERROR] javax.el-3.0.1-b12.jar: CVE-2021-28170(7.5)
[ERROR] 
[ERROR] See the dependency-check report for more details.
[ERROR] 
[ERROR] 
[ERROR] -> [Help 1]
[ERROR] 
[ERROR] To see the full stack trace of the errors, re-run Maven with the -e switch.
[ERROR] Re-run Maven using the -X switch to enable full debug logging.
[ERROR] 
[ERROR] For more information about the errors and possible solutions, please read the following articles:
[ERROR] [Help 1] http://cwiki.apache.org/confluence/display/MAVEN/MojoFailureException
[ERROR] 
[ERROR] After correcting the problems, you can resume the build with the command
[ERROR]   mvn <goals> -rf :bean-validation
Build step 'Execute shell' marked build as failure
Setting MAVEN_3_LATEST_HOME=/home/jenkins/tools/maven/latest3

Build failed in Jenkins: Struts » Struts-examples-dependency-check #115

Posted by Apache Jenkins Server <je...@builds.apache.org>.
See <https://ci-builds.apache.org/job/Struts/job/Struts-examples-dependency-check/115/display/redirect>

Changes:


------------------------------------------
Started by user Lukasz Lenart
Running as SYSTEM
[EnvInject] - Loading node environment variables.
Building remotely on builds34 (ubuntu) in workspace <https://ci-builds.apache.org/job/Struts/job/Struts-examples-dependency-check/ws/>
The recommended git tool is: NONE
No credentials specified
 > git rev-parse --resolve-git-dir <https://ci-builds.apache.org/job/Struts/job/Struts-examples-dependency-check/ws/.git> # timeout=10
Fetching changes from the remote Git repository
 > git config remote.origin.url https://gitbox.apache.org/repos/asf/struts-examples.git # timeout=10
Fetching upstream changes from https://gitbox.apache.org/repos/asf/struts-examples.git
 > git --version # timeout=10
 > git --version # 'git version 2.34.1'
 > git fetch --tags --force --progress -- https://gitbox.apache.org/repos/asf/struts-examples.git +refs/heads/*:refs/remotes/origin/* # timeout=10
 > git rev-parse refs/remotes/origin/master^{commit} # timeout=10
Checking out Revision 7ea0ecfab0809f147daf31ae53b84f8b5d5b4dfc (refs/remotes/origin/master)
 > git config core.sparsecheckout # timeout=10
 > git checkout -f 7ea0ecfab0809f147daf31ae53b84f8b5d5b4dfc # timeout=10
Commit message: "Merge pull request #308 from apache/fix/use-base-package"
 > git rev-list --no-walk 7ea0ecfab0809f147daf31ae53b84f8b5d5b4dfc # timeout=10
Setting MAVEN_3_LATEST_HOME=/home/jenkins/tools/maven/latest3
[Struts-examples-dependency-check] $ /bin/sh -xe /tmp/jenkins5350151925923559480.sh
+ export MAVEN_OPTS=-Xms2g -Xmx2g -XX:+CMSClassUnloadingEnabled
+ export PATH=/home/jenkins/tools/maven/latest3:/home/jenkins/tools/java/latest17/bin:/usr/local/sbin:/usr/local/bin:/usr/sbin:/usr/bin:/sbin:/bin:/snap/bin
+ ./mvnw verify -Pdependency-check
Unrecognized VM option 'CMSClassUnloadingEnabled'
Error: Could not create the Java Virtual Machine.
Error: A fatal exception has occurred. Program will exit.
Build step 'Execute shell' marked build as failure
Setting MAVEN_3_LATEST_HOME=/home/jenkins/tools/maven/latest3

Build failed in Jenkins: Struts » Struts-examples-dependency-check #114

Posted by Apache Jenkins Server <je...@builds.apache.org>.
See <https://ci-builds.apache.org/job/Struts/job/Struts-examples-dependency-check/114/display/redirect>

Changes:


------------------------------------------
Started by user Lukasz Lenart
Running as SYSTEM
[EnvInject] - Loading node environment variables.
Building remotely on builds34 (ubuntu) in workspace <https://ci-builds.apache.org/job/Struts/job/Struts-examples-dependency-check/ws/>
The recommended git tool is: NONE
No credentials specified
 > git rev-parse --resolve-git-dir <https://ci-builds.apache.org/job/Struts/job/Struts-examples-dependency-check/ws/.git> # timeout=10
Fetching changes from the remote Git repository
 > git config remote.origin.url https://gitbox.apache.org/repos/asf/struts-examples.git # timeout=10
Fetching upstream changes from https://gitbox.apache.org/repos/asf/struts-examples.git
 > git --version # timeout=10
 > git --version # 'git version 2.34.1'
 > git fetch --tags --force --progress -- https://gitbox.apache.org/repos/asf/struts-examples.git +refs/heads/*:refs/remotes/origin/* # timeout=10
 > git rev-parse refs/remotes/origin/master^{commit} # timeout=10
Checking out Revision 7ea0ecfab0809f147daf31ae53b84f8b5d5b4dfc (refs/remotes/origin/master)
 > git config core.sparsecheckout # timeout=10
 > git checkout -f 7ea0ecfab0809f147daf31ae53b84f8b5d5b4dfc # timeout=10
Commit message: "Merge pull request #308 from apache/fix/use-base-package"
 > git rev-list --no-walk 7ea0ecfab0809f147daf31ae53b84f8b5d5b4dfc # timeout=10
Setting MAVEN_3_LATEST_HOME=/home/jenkins/tools/maven/latest3
[Struts-examples-dependency-check] $ /bin/sh -xe /tmp/jenkins11792279062967798677.sh
+ export MAVEN_OPTS=-Xms2g -Xmx2g -XX:MaxPermSize=512m -XX:+CMSClassUnloadingEnabled
+ export PATH=/home/jenkins/tools/maven/latest3:/home/jenkins/tools/java/latest17/bin:/usr/local/sbin:/usr/local/bin:/usr/sbin:/usr/bin:/sbin:/bin:/snap/bin
+ ./mvnw verify -Pdependency-check
Unrecognized VM option 'MaxPermSize=512m'
Error: Could not create the Java Virtual Machine.
Error: A fatal exception has occurred. Program will exit.
Build step 'Execute shell' marked build as failure
Setting MAVEN_3_LATEST_HOME=/home/jenkins/tools/maven/latest3

Build failed in Jenkins: Struts » Struts-examples-dependency-check #113

Posted by Apache Jenkins Server <je...@builds.apache.org>.
See <https://ci-builds.apache.org/job/Struts/job/Struts-examples-dependency-check/113/display/redirect>

Changes:


------------------------------------------
Started by user Lukasz Lenart
Running as SYSTEM
[EnvInject] - Loading node environment variables.
Building remotely on builds34 (ubuntu) in workspace <https://ci-builds.apache.org/job/Struts/job/Struts-examples-dependency-check/ws/>
The recommended git tool is: NONE
No credentials specified
 > git rev-parse --resolve-git-dir <https://ci-builds.apache.org/job/Struts/job/Struts-examples-dependency-check/ws/.git> # timeout=10
Fetching changes from the remote Git repository
 > git config remote.origin.url https://gitbox.apache.org/repos/asf/struts-examples.git # timeout=10
Fetching upstream changes from https://gitbox.apache.org/repos/asf/struts-examples.git
 > git --version # timeout=10
 > git --version # 'git version 2.34.1'
 > git fetch --tags --force --progress -- https://gitbox.apache.org/repos/asf/struts-examples.git +refs/heads/*:refs/remotes/origin/* # timeout=10
 > git rev-parse refs/remotes/origin/master^{commit} # timeout=10
Checking out Revision 7ea0ecfab0809f147daf31ae53b84f8b5d5b4dfc (refs/remotes/origin/master)
 > git config core.sparsecheckout # timeout=10
 > git checkout -f 7ea0ecfab0809f147daf31ae53b84f8b5d5b4dfc # timeout=10
Commit message: "Merge pull request #308 from apache/fix/use-base-package"
 > git rev-list --no-walk 7ea0ecfab0809f147daf31ae53b84f8b5d5b4dfc # timeout=10
ERROR: No tool found matching MAVEN_3_LATEST__HOME
Setting MAVEN_3_LATEST_HOME=/home/jenkins/tools/maven/latest3
[Struts-examples-dependency-check] $ /bin/sh -xe /tmp/jenkins1732166464700667019.sh
+ export MAVEN_OPTS=-Xms2g -Xmx2g -XX:MaxPermSize=512m -XX:+CMSClassUnloadingEnabled
+ export PATH=/home/jenkins/tools/maven/latest3:/home/jenkins/tools/java/latest17/bin:/usr/local/sbin:/usr/local/bin:/usr/sbin:/usr/bin:/sbin:/bin:/snap/bin
+ ./mvnw verify -Pdependency-check
Unrecognized VM option 'MaxPermSize=512m'
Error: Could not create the Java Virtual Machine.
Error: A fatal exception has occurred. Program will exit.
Build step 'Execute shell' marked build as failure
ERROR: No tool found matching MAVEN_3_LATEST__HOME
Setting MAVEN_3_LATEST_HOME=/home/jenkins/tools/maven/latest3

Build failed in Jenkins: Struts » Struts-examples-dependency-check #112

Posted by Apache Jenkins Server <je...@builds.apache.org>.
See <https://ci-builds.apache.org/job/Struts/job/Struts-examples-dependency-check/112/display/redirect>

Changes:


------------------------------------------
Started by user Lukasz Lenart
Running as SYSTEM
[EnvInject] - Loading node environment variables.
Building remotely on builds34 (ubuntu) in workspace <https://ci-builds.apache.org/job/Struts/job/Struts-examples-dependency-check/ws/>
The recommended git tool is: NONE
No credentials specified
 > git rev-parse --resolve-git-dir <https://ci-builds.apache.org/job/Struts/job/Struts-examples-dependency-check/ws/.git> # timeout=10
Fetching changes from the remote Git repository
 > git config remote.origin.url https://gitbox.apache.org/repos/asf/struts-examples.git # timeout=10
Fetching upstream changes from https://gitbox.apache.org/repos/asf/struts-examples.git
 > git --version # timeout=10
 > git --version # 'git version 2.34.1'
 > git fetch --tags --force --progress -- https://gitbox.apache.org/repos/asf/struts-examples.git +refs/heads/*:refs/remotes/origin/* # timeout=10
 > git rev-parse refs/remotes/origin/master^{commit} # timeout=10
Checking out Revision 7ea0ecfab0809f147daf31ae53b84f8b5d5b4dfc (refs/remotes/origin/master)
 > git config core.sparsecheckout # timeout=10
 > git checkout -f 7ea0ecfab0809f147daf31ae53b84f8b5d5b4dfc # timeout=10
Commit message: "Merge pull request #308 from apache/fix/use-base-package"
 > git rev-list --no-walk 7ea0ecfab0809f147daf31ae53b84f8b5d5b4dfc # timeout=10
ERROR: No tool found matching MAVEN_3_LATEST__HOME
Setting MAVEN_3_9_6_HOME=/home/jenkins/tools/maven/apache-maven-3.9.6
[Struts-examples-dependency-check] $ /bin/sh -xe /tmp/jenkins15771568629368537792.sh
+ export MAVEN_OPTS=-Xms2g -Xmx2g -XX:MaxPermSize=512m -XX:+CMSClassUnloadingEnabled
+ export PATH=/home/jenkins/tools/maven/apache-maven-3.9.6:/home/jenkins/tools/java/latest17/bin:/usr/local/sbin:/usr/local/bin:/usr/sbin:/usr/bin:/sbin:/bin:/snap/bin
+ ./mvnw verify -Pdependency-check
Unrecognized VM option 'MaxPermSize=512m'
Error: Could not create the Java Virtual Machine.
Error: A fatal exception has occurred. Program will exit.
Build step 'Execute shell' marked build as failure
ERROR: No tool found matching MAVEN_3_LATEST__HOME
Setting MAVEN_3_9_6_HOME=/home/jenkins/tools/maven/apache-maven-3.9.6

Build failed in Jenkins: Struts » Struts-examples-dependency-check #111

Posted by Apache Jenkins Server <je...@builds.apache.org>.
See <https://ci-builds.apache.org/job/Struts/job/Struts-examples-dependency-check/111/display/redirect>

Changes:


------------------------------------------
Started by user Lukasz Lenart
Running as SYSTEM
[EnvInject] - Loading node environment variables.
Building remotely on builds34 (ubuntu) in workspace <https://ci-builds.apache.org/job/Struts/job/Struts-examples-dependency-check/ws/>
The recommended git tool is: NONE
No credentials specified
 > git rev-parse --resolve-git-dir <https://ci-builds.apache.org/job/Struts/job/Struts-examples-dependency-check/ws/.git> # timeout=10
Fetching changes from the remote Git repository
 > git config remote.origin.url https://gitbox.apache.org/repos/asf/struts-examples.git # timeout=10
Fetching upstream changes from https://gitbox.apache.org/repos/asf/struts-examples.git
 > git --version # timeout=10
 > git --version # 'git version 2.34.1'
 > git fetch --tags --force --progress -- https://gitbox.apache.org/repos/asf/struts-examples.git +refs/heads/*:refs/remotes/origin/* # timeout=10
 > git rev-parse refs/remotes/origin/master^{commit} # timeout=10
Checking out Revision 7ea0ecfab0809f147daf31ae53b84f8b5d5b4dfc (refs/remotes/origin/master)
 > git config core.sparsecheckout # timeout=10
 > git checkout -f 7ea0ecfab0809f147daf31ae53b84f8b5d5b4dfc # timeout=10
Commit message: "Merge pull request #308 from apache/fix/use-base-package"
 > git rev-list --no-walk 7ea0ecfab0809f147daf31ae53b84f8b5d5b4dfc # timeout=10
ERROR: No tool found matching MAVEN_3_LATEST__HOME
Setting MAVEN_3_LATEST_HOME=/home/jenkins/tools/maven/latest3
[Struts-examples-dependency-check] $ /bin/sh -xe /tmp/jenkins10343334810196716505.sh
+ export MAVEN_OPTS=-Xms2g -Xmx2g -XX:MaxPermSize=512m -XX:+CMSClassUnloadingEnabled
+ export PATH=/home/jenkins/tools/maven/latest3:/home/jenkins/tools/java/latest17/bin:/usr/local/sbin:/usr/local/bin:/usr/sbin:/usr/bin:/sbin:/bin:/snap/bin
+ ./mvnw verify -Pdependency-check
Unrecognized VM option 'MaxPermSize=512m'
Error: Could not create the Java Virtual Machine.
Error: A fatal exception has occurred. Program will exit.
Build step 'Execute shell' marked build as failure
ERROR: No tool found matching MAVEN_3_LATEST__HOME
Setting MAVEN_3_LATEST_HOME=/home/jenkins/tools/maven/latest3

Build failed in Jenkins: Struts » Struts-examples-dependency-check #110

Posted by Apache Jenkins Server <je...@builds.apache.org>.
See <https://ci-builds.apache.org/job/Struts/job/Struts-examples-dependency-check/110/display/redirect>

Changes:


------------------------------------------
Started by user Lukasz Lenart
Running as SYSTEM
[EnvInject] - Loading node environment variables.
Building remotely on builds34 (ubuntu) in workspace <https://ci-builds.apache.org/job/Struts/job/Struts-examples-dependency-check/ws/>
The recommended git tool is: NONE
No credentials specified
 > git rev-parse --resolve-git-dir <https://ci-builds.apache.org/job/Struts/job/Struts-examples-dependency-check/ws/.git> # timeout=10
Fetching changes from the remote Git repository
 > git config remote.origin.url https://gitbox.apache.org/repos/asf/struts-examples.git # timeout=10
Fetching upstream changes from https://gitbox.apache.org/repos/asf/struts-examples.git
 > git --version # timeout=10
 > git --version # 'git version 2.34.1'
 > git fetch --tags --force --progress -- https://gitbox.apache.org/repos/asf/struts-examples.git +refs/heads/*:refs/remotes/origin/* # timeout=10
 > git rev-parse refs/remotes/origin/master^{commit} # timeout=10
Checking out Revision 7ea0ecfab0809f147daf31ae53b84f8b5d5b4dfc (refs/remotes/origin/master)
 > git config core.sparsecheckout # timeout=10
 > git checkout -f 7ea0ecfab0809f147daf31ae53b84f8b5d5b4dfc # timeout=10
Commit message: "Merge pull request #308 from apache/fix/use-base-package"
 > git rev-list --no-walk 7ea0ecfab0809f147daf31ae53b84f8b5d5b4dfc # timeout=10
ERROR: No tool found matching MAVEN_3_LATEST__HOME
Setting MAVEN_3_LATEST_HOME=/home/jenkins/tools/maven/latest3
[Struts-examples-dependency-check] $ /bin/sh -xe /tmp/jenkins16279006064588367957.sh
+ export MAVEN_OPTS=-Xms2g -Xmx2g -XX:MaxPermSize=512m -XX:+CMSClassUnloadingEnabled
+ export PATH=/home/jenkins/tools/maven/latest3:/home/jenkins/tools/java/latest17/bin:/usr/local/sbin:/usr/local/bin:/usr/sbin:/usr/bin:/sbin:/bin:/snap/bin
+ ./mvnw verify -Pdependency-check
Unrecognized VM option 'MaxPermSize=512m'
Error: Could not create the Java Virtual Machine.
Error: A fatal exception has occurred. Program will exit.
Build step 'Execute shell' marked build as failure
ERROR: No tool found matching MAVEN_3_LATEST__HOME
Setting MAVEN_3_LATEST_HOME=/home/jenkins/tools/maven/latest3