You are viewing a plain text version of this content. The canonical link for it is here.
Posted to dev@shindig.apache.org by "patrick chanezon (JIRA)" <ji...@apache.org> on 2009/03/18 08:47:50 UTC
[jira] Created: (SHINDIG-982) the build is broken
the build is broken
-------------------
Key: SHINDIG-982
URL: https://issues.apache.org/jira/browse/SHINDIG-982
Project: Shindig
Issue Type: Bug
Affects Versions: trunk
Environment: Maven version: 2.0.10
Java version: 1.5.0_13
OS name: "mac os x" version: "10.5.5" arch: "i386" Family: "unix"
Reporter: patrick chanezon
I checked the trunk tonight and it does not build.
I have not built it since a year, so I did a fresh install following the docs at http://incubator.apache.org/shindig/#tab-building.
P@
----
INFO] Compiling 118 source files to /Users/chanezon/code/shin2/java/common/target/classes
[INFO] ------------------------------------------------------------------------
[ERROR] BUILD FAILURE
[INFO] ------------------------------------------------------------------------
[INFO] Compilation failure
/Users/chanezon/code/shin2/java/common/src/main/java/org/apache/shindig/protocol/conversion/BeanJsonConverter.java:[105,26] type parameters of <T>T cannot be determined; no unique maximal instance exists for type variable T with upper bounds T,java.lang.Object
/Users/chanezon/code/shin2/java/common/src/main/java/org/apache/shindig/protocol/conversion/BeanJsonConverter.java:[105,26] type parameters of <T>T cannot be determined; no unique maximal instance exists for type variable T with upper bounds T,java.lang.Object
[INFO] ------------------------------------------------------------------------
[INFO] Trace
org.apache.maven.BuildFailureException: Compilation failure
/Users/chanezon/code/shin2/java/common/src/main/java/org/apache/shindig/protocol/conversion/BeanJsonConverter.java:[105,26] type parameters of <T>T cannot be determined; no unique maximal instance exists for type variable T with upper bounds T,java.lang.Object
at org.apache.maven.lifecycle.DefaultLifecycleExecutor.executeGoals(DefaultLifecycleExecutor.java:580)
at org.apache.maven.lifecycle.DefaultLifecycleExecutor.executeGoalWithLifecycle(DefaultLifecycleExecutor.java:500)
at org.apache.maven.lifecycle.DefaultLifecycleExecutor.executeGoal(DefaultLifecycleExecutor.java:479)
at org.apache.maven.lifecycle.DefaultLifecycleExecutor.executeGoalAndHandleFailures(DefaultLifecycleExecutor.java:331)
at org.apache.maven.lifecycle.DefaultLifecycleExecutor.executeTaskSegments(DefaultLifecycleExecutor.java:292)
at org.apache.maven.lifecycle.DefaultLifecycleExecutor.execute(DefaultLifecycleExecutor.java:142)
at org.apache.maven.DefaultMaven.doExecute(DefaultMaven.java:336)
at org.apache.maven.DefaultMaven.execute(DefaultMaven.java:129)
at org.apache.maven.cli.MavenCli.main(MavenCli.java:301)
at sun.reflect.NativeMethodAccessorImpl.invoke0(Native Method)
at sun.reflect.NativeMethodAccessorImpl.invoke(NativeMethodAccessorImpl.java:39)
at sun.reflect.DelegatingMethodAccessorImpl.invoke(DelegatingMethodAccessorImpl.java:25)
at java.lang.reflect.Method.invoke(Method.java:585)
at org.codehaus.classworlds.Launcher.launchEnhanced(Launcher.java:315)
at org.codehaus.classworlds.Launcher.launch(Launcher.java:255)
at org.codehaus.classworlds.Launcher.mainWithExitCode(Launcher.java:430)
at org.codehaus.classworlds.Launcher.main(Launcher.java:375)
Caused by: org.apache.maven.plugin.CompilationFailureException: Compilation failure
/Users/chanezon/code/shin2/java/common/src/main/java/org/apache/shindig/protocol/conversion/BeanJsonConverter.java:[105,26] type parameters of <T>T cannot be determined; no unique maximal instance exists for type variable T with upper bounds T,java.lang.Object
at org.apache.maven.plugin.AbstractCompilerMojo.execute(AbstractCompilerMojo.java:516)
at org.apache.maven.plugin.CompilerMojo.execute(CompilerMojo.java:114)
at org.apache.maven.plugin.DefaultPluginManager.executeMojo(DefaultPluginManager.java:453)
at org.apache.maven.lifecycle.DefaultLifecycleExecutor.executeGoals(DefaultLifecycleExecutor.java:559)
... 16 more
[INFO] ------------------------------------------------------------------------
[INFO] Total time: 14 seconds
[INFO] Finished at: Wed Mar 18 00:41:21 PDT 2009
[INFO] Final Memory: 27M/254M
[INFO] ------------------------------------------------------------------------
--
This message is automatically generated by JIRA.
-
You can reply to this email to add a comment to the issue online.
[jira] Assigned: (SHINDIG-982) the build is broken
Posted by "Louis Ryan (JIRA)" <ji...@apache.org>.
[ https://issues.apache.org/jira/browse/SHINDIG-982?page=com.atlassian.jira.plugin.system.issuetabpanels:all-tabpanel ]
Louis Ryan reassigned SHINDIG-982:
----------------------------------
Assignee: Louis Ryan
> the build is broken
> -------------------
>
> Key: SHINDIG-982
> URL: https://issues.apache.org/jira/browse/SHINDIG-982
> Project: Shindig
> Issue Type: Bug
> Affects Versions: trunk
> Environment: Maven version: 2.0.10
> Java version: 1.5.0_13
> OS name: "mac os x" version: "10.5.5" arch: "i386" Family: "unix"
> Reporter: patrick chanezon
> Assignee: Louis Ryan
>
> I checked the trunk tonight and it does not build.
> I have not built it since a year, so I did a fresh install following the docs at http://incubator.apache.org/shindig/#tab-building.
> P@
> ----
> INFO] Compiling 118 source files to /Users/chanezon/code/shin2/java/common/target/classes
> [INFO] ------------------------------------------------------------------------
> [ERROR] BUILD FAILURE
> [INFO] ------------------------------------------------------------------------
> [INFO] Compilation failure
> /Users/chanezon/code/shin2/java/common/src/main/java/org/apache/shindig/protocol/conversion/BeanJsonConverter.java:[105,26] type parameters of <T>T cannot be determined; no unique maximal instance exists for type variable T with upper bounds T,java.lang.Object
> /Users/chanezon/code/shin2/java/common/src/main/java/org/apache/shindig/protocol/conversion/BeanJsonConverter.java:[105,26] type parameters of <T>T cannot be determined; no unique maximal instance exists for type variable T with upper bounds T,java.lang.Object
> [INFO] ------------------------------------------------------------------------
> [INFO] Trace
> org.apache.maven.BuildFailureException: Compilation failure
> /Users/chanezon/code/shin2/java/common/src/main/java/org/apache/shindig/protocol/conversion/BeanJsonConverter.java:[105,26] type parameters of <T>T cannot be determined; no unique maximal instance exists for type variable T with upper bounds T,java.lang.Object
> at org.apache.maven.lifecycle.DefaultLifecycleExecutor.executeGoals(DefaultLifecycleExecutor.java:580)
> at org.apache.maven.lifecycle.DefaultLifecycleExecutor.executeGoalWithLifecycle(DefaultLifecycleExecutor.java:500)
> at org.apache.maven.lifecycle.DefaultLifecycleExecutor.executeGoal(DefaultLifecycleExecutor.java:479)
> at org.apache.maven.lifecycle.DefaultLifecycleExecutor.executeGoalAndHandleFailures(DefaultLifecycleExecutor.java:331)
> at org.apache.maven.lifecycle.DefaultLifecycleExecutor.executeTaskSegments(DefaultLifecycleExecutor.java:292)
> at org.apache.maven.lifecycle.DefaultLifecycleExecutor.execute(DefaultLifecycleExecutor.java:142)
> at org.apache.maven.DefaultMaven.doExecute(DefaultMaven.java:336)
> at org.apache.maven.DefaultMaven.execute(DefaultMaven.java:129)
> at org.apache.maven.cli.MavenCli.main(MavenCli.java:301)
> at sun.reflect.NativeMethodAccessorImpl.invoke0(Native Method)
> at sun.reflect.NativeMethodAccessorImpl.invoke(NativeMethodAccessorImpl.java:39)
> at sun.reflect.DelegatingMethodAccessorImpl.invoke(DelegatingMethodAccessorImpl.java:25)
> at java.lang.reflect.Method.invoke(Method.java:585)
> at org.codehaus.classworlds.Launcher.launchEnhanced(Launcher.java:315)
> at org.codehaus.classworlds.Launcher.launch(Launcher.java:255)
> at org.codehaus.classworlds.Launcher.mainWithExitCode(Launcher.java:430)
> at org.codehaus.classworlds.Launcher.main(Launcher.java:375)
> Caused by: org.apache.maven.plugin.CompilationFailureException: Compilation failure
> /Users/chanezon/code/shin2/java/common/src/main/java/org/apache/shindig/protocol/conversion/BeanJsonConverter.java:[105,26] type parameters of <T>T cannot be determined; no unique maximal instance exists for type variable T with upper bounds T,java.lang.Object
> at org.apache.maven.plugin.AbstractCompilerMojo.execute(AbstractCompilerMojo.java:516)
> at org.apache.maven.plugin.CompilerMojo.execute(CompilerMojo.java:114)
> at org.apache.maven.plugin.DefaultPluginManager.executeMojo(DefaultPluginManager.java:453)
> at org.apache.maven.lifecycle.DefaultLifecycleExecutor.executeGoals(DefaultLifecycleExecutor.java:559)
> ... 16 more
> [INFO] ------------------------------------------------------------------------
> [INFO] Total time: 14 seconds
> [INFO] Finished at: Wed Mar 18 00:41:21 PDT 2009
> [INFO] Final Memory: 27M/254M
> [INFO] ------------------------------------------------------------------------
--
This message is automatically generated by JIRA.
-
You can reply to this email to add a comment to the issue online.
[jira] Closed: (SHINDIG-982) the build is broken
Posted by "Louis Ryan (JIRA)" <ji...@apache.org>.
[ https://issues.apache.org/jira/browse/SHINDIG-982?page=com.atlassian.jira.plugin.system.issuetabpanels:all-tabpanel ]
Louis Ryan closed SHINDIG-982.
------------------------------
Resolution: Fixed
Fix Version/s: trunk
Fixed. Added explicit cast
> the build is broken
> -------------------
>
> Key: SHINDIG-982
> URL: https://issues.apache.org/jira/browse/SHINDIG-982
> Project: Shindig
> Issue Type: Bug
> Affects Versions: trunk
> Environment: Maven version: 2.0.10
> Java version: 1.5.0_13
> OS name: "mac os x" version: "10.5.5" arch: "i386" Family: "unix"
> Reporter: patrick chanezon
> Assignee: Louis Ryan
> Fix For: trunk
>
>
> I checked the trunk tonight and it does not build.
> I have not built it since a year, so I did a fresh install following the docs at http://incubator.apache.org/shindig/#tab-building.
> P@
> ----
> INFO] Compiling 118 source files to /Users/chanezon/code/shin2/java/common/target/classes
> [INFO] ------------------------------------------------------------------------
> [ERROR] BUILD FAILURE
> [INFO] ------------------------------------------------------------------------
> [INFO] Compilation failure
> /Users/chanezon/code/shin2/java/common/src/main/java/org/apache/shindig/protocol/conversion/BeanJsonConverter.java:[105,26] type parameters of <T>T cannot be determined; no unique maximal instance exists for type variable T with upper bounds T,java.lang.Object
> /Users/chanezon/code/shin2/java/common/src/main/java/org/apache/shindig/protocol/conversion/BeanJsonConverter.java:[105,26] type parameters of <T>T cannot be determined; no unique maximal instance exists for type variable T with upper bounds T,java.lang.Object
> [INFO] ------------------------------------------------------------------------
> [INFO] Trace
> org.apache.maven.BuildFailureException: Compilation failure
> /Users/chanezon/code/shin2/java/common/src/main/java/org/apache/shindig/protocol/conversion/BeanJsonConverter.java:[105,26] type parameters of <T>T cannot be determined; no unique maximal instance exists for type variable T with upper bounds T,java.lang.Object
> at org.apache.maven.lifecycle.DefaultLifecycleExecutor.executeGoals(DefaultLifecycleExecutor.java:580)
> at org.apache.maven.lifecycle.DefaultLifecycleExecutor.executeGoalWithLifecycle(DefaultLifecycleExecutor.java:500)
> at org.apache.maven.lifecycle.DefaultLifecycleExecutor.executeGoal(DefaultLifecycleExecutor.java:479)
> at org.apache.maven.lifecycle.DefaultLifecycleExecutor.executeGoalAndHandleFailures(DefaultLifecycleExecutor.java:331)
> at org.apache.maven.lifecycle.DefaultLifecycleExecutor.executeTaskSegments(DefaultLifecycleExecutor.java:292)
> at org.apache.maven.lifecycle.DefaultLifecycleExecutor.execute(DefaultLifecycleExecutor.java:142)
> at org.apache.maven.DefaultMaven.doExecute(DefaultMaven.java:336)
> at org.apache.maven.DefaultMaven.execute(DefaultMaven.java:129)
> at org.apache.maven.cli.MavenCli.main(MavenCli.java:301)
> at sun.reflect.NativeMethodAccessorImpl.invoke0(Native Method)
> at sun.reflect.NativeMethodAccessorImpl.invoke(NativeMethodAccessorImpl.java:39)
> at sun.reflect.DelegatingMethodAccessorImpl.invoke(DelegatingMethodAccessorImpl.java:25)
> at java.lang.reflect.Method.invoke(Method.java:585)
> at org.codehaus.classworlds.Launcher.launchEnhanced(Launcher.java:315)
> at org.codehaus.classworlds.Launcher.launch(Launcher.java:255)
> at org.codehaus.classworlds.Launcher.mainWithExitCode(Launcher.java:430)
> at org.codehaus.classworlds.Launcher.main(Launcher.java:375)
> Caused by: org.apache.maven.plugin.CompilationFailureException: Compilation failure
> /Users/chanezon/code/shin2/java/common/src/main/java/org/apache/shindig/protocol/conversion/BeanJsonConverter.java:[105,26] type parameters of <T>T cannot be determined; no unique maximal instance exists for type variable T with upper bounds T,java.lang.Object
> at org.apache.maven.plugin.AbstractCompilerMojo.execute(AbstractCompilerMojo.java:516)
> at org.apache.maven.plugin.CompilerMojo.execute(CompilerMojo.java:114)
> at org.apache.maven.plugin.DefaultPluginManager.executeMojo(DefaultPluginManager.java:453)
> at org.apache.maven.lifecycle.DefaultLifecycleExecutor.executeGoals(DefaultLifecycleExecutor.java:559)
> ... 16 more
> [INFO] ------------------------------------------------------------------------
> [INFO] Total time: 14 seconds
> [INFO] Finished at: Wed Mar 18 00:41:21 PDT 2009
> [INFO] Final Memory: 27M/254M
> [INFO] ------------------------------------------------------------------------
--
This message is automatically generated by JIRA.
-
You can reply to this email to add a comment to the issue online.