You are viewing a plain text version of this content. The canonical link for it is here.
Posted to dev@kafka.apache.org by Apache Jenkins Server <je...@builds.apache.org> on 2024/06/13 12:40:35 UTC

Build failed in Jenkins: Kafka » Kafka Branch Builder » 3.7 #177

See <https://ci-builds.apache.org/job/Kafka/job/kafka/job/3.7/177/display/redirect>

Changes:


------------------------------------------
[...truncated 2938 lines...]
[2024-06-13T12:32:18.908Z] > Task :connect:json:checkstyleTest
[2024-06-13T12:32:22.085Z] > Task :connect:basic-auth-extension:spotbugsMain
[2024-06-13T12:32:22.085Z] > Task :connect:basic-auth-extension:check
[2024-06-13T12:32:22.085Z] > Task :connect:json:spotbugsTest SKIPPED
[2024-06-13T12:32:22.085Z] > Task :connect:mirror-client:compileJava
[2024-06-13T12:32:23.551Z] > Task :connect:mirror:compileJava
[2024-06-13T12:32:23.551Z] > Task :connect:mirror:classes
[2024-06-13T12:32:23.560Z] 
[2024-06-13T12:32:23.560Z] FAILURE: Build failed with an exception.
[2024-06-13T12:32:23.560Z] 
[2024-06-13T12:32:23.560Z] * What went wrong:
[2024-06-13T12:32:23.560Z] Execution failed for task ':core:compileTestScala'.
[2024-06-13T12:32:23.560Z] > Compilation failed
[2024-06-13T12:32:23.560Z] 
[2024-06-13T12:32:23.560Z] * Try:
[2024-06-13T12:32:23.560Z] > Run with --info option to get more log output.
[2024-06-13T12:32:23.560Z] 
[2024-06-13T12:32:23.560Z] Deprecated Gradle features were used in this build, making it incompatible with Gradle 9.0.
[2024-06-13T12:32:23.560Z] 
[2024-06-13T12:32:23.560Z] You can use '--warning-mode all' to show the individual deprecation warnings and determine if they come from your own scripts or plugins.
[2024-06-13T12:32:23.560Z] 
[2024-06-13T12:32:23.560Z] For more on this, please refer to https://docs.gradle.org/8.6/userguide/command_line_interface.html#sec:command_line_warnings in the Gradle documentation.
[2024-06-13T12:32:23.560Z] 
[2024-06-13T12:32:23.560Z] BUILD FAILED in 9m 28s
[2024-06-13T12:32:23.560Z] 267 actionable tasks: 214 executed, 53 up-to-date
[2024-06-13T12:32:23.560Z] 
[2024-06-13T12:32:23.560Z] Publishing build scan...
[2024-06-13T12:32:23.560Z] https://ge.apache.org/s/b6wk6sw4nvc2i
[2024-06-13T12:32:23.560Z] 
[2024-06-13T12:32:23.560Z] 
[2024-06-13T12:32:23.560Z] See the profiling report at: file:///home/jenkins/workspace/Kafka_kafka_3.7/build/reports/profile/profile-2024-06-13-12-22-58.html
[2024-06-13T12:32:23.560Z] A fine-grained performance profile is available: use the --scan option.
[Pipeline] }
[Pipeline] // withEnv
[Pipeline] }
[Pipeline] // withEnv
[Pipeline] }
[Pipeline] // withEnv
[Pipeline] }
[Pipeline] // node
[Pipeline] }
[Pipeline] // timestamps
[Pipeline] }
[Pipeline] // timeout
[Pipeline] }
[Pipeline] // stage
[Pipeline] }
Failed in branch JDK 17 and Scala 2.13
[2024-06-13T12:32:25.850Z] > Task :connect:mirror:checkstyleMain
[2024-06-13T12:32:26.663Z] > Task :connect:file:spotbugsMain
[2024-06-13T12:32:26.663Z] > Task :connect:mirror-client:classes
[2024-06-13T12:32:27.240Z] > Task :connect:mirror-client:checkstyleMain
[2024-06-13T12:32:28.089Z] > Task :connect:mirror-client:compileTestJava
[2024-06-13T12:32:28.089Z] > Task :connect:mirror-client:testClasses
[2024-06-13T12:32:28.089Z] > Task :connect:mirror-client:checkstyleTest
[2024-06-13T12:32:36.028Z] 
[2024-06-13T12:32:36.028Z] FAILURE: Build failed with an exception.
[2024-06-13T12:32:36.028Z] 
[2024-06-13T12:32:36.028Z] * What went wrong:
[2024-06-13T12:32:36.028Z] Execution failed for task ':core:compileTestScala'.
[2024-06-13T12:32:36.028Z] > Compilation failed
[2024-06-13T12:32:36.028Z] 
[2024-06-13T12:32:36.028Z] * Try:
[2024-06-13T12:32:36.028Z] > Run with --info option to get more log output.
[2024-06-13T12:32:36.028Z] 
[2024-06-13T12:32:36.028Z] Deprecated Gradle features were used in this build, making it incompatible with Gradle 9.0.
[2024-06-13T12:32:36.028Z] 
[2024-06-13T12:32:36.028Z] You can use '--warning-mode all' to show the individual deprecation warnings and determine if they come from your own scripts or plugins.
[2024-06-13T12:32:36.028Z] 
[2024-06-13T12:32:36.028Z] For more on this, please refer to https://docs.gradle.org/8.6/userguide/command_line_interface.html#sec:command_line_warnings in the Gradle documentation.
[2024-06-13T12:32:36.028Z] 
[2024-06-13T12:32:36.028Z] BUILD FAILED in 9m 53s
[2024-06-13T12:32:36.028Z] 267 actionable tasks: 214 executed, 53 up-to-date
[2024-06-13T12:32:36.028Z] 
[2024-06-13T12:32:36.028Z] Publishing build scan...
[2024-06-13T12:32:36.028Z] https://ge.apache.org/s/xf6kwppu2554a
[2024-06-13T12:32:36.028Z] 
[2024-06-13T12:32:36.028Z] 
[2024-06-13T12:32:36.028Z] See the profiling report at: file:///home/jenkins/jenkins-agent/workspace/Kafka_kafka_3.7/build/reports/profile/profile-2024-06-13-12-22-47.html
[2024-06-13T12:32:36.028Z] A fine-grained performance profile is available: use the --scan option.
[Pipeline] }
[Pipeline] // withEnv
[Pipeline] }
[Pipeline] // withEnv
[Pipeline] }
[Pipeline] // withEnv
[Pipeline] }
[Pipeline] // node
[Pipeline] }
[Pipeline] // timestamps
[Pipeline] }
[Pipeline] // timeout
[Pipeline] }
[Pipeline] // stage
[Pipeline] }
Failed in branch JDK 11 and Scala 2.13
[2024-06-13T12:32:42.598Z] > Task :connect:json:spotbugsMain
[2024-06-13T12:32:42.599Z] > Task :connect:json:check
[2024-06-13T12:32:42.599Z] > Task :connect:mirror-client:spotbugsTest SKIPPED
[2024-06-13T12:32:46.141Z] > Task :core:spotbugsMain
[2024-06-13T12:32:47.301Z] > Task :connect:mirror-client:spotbugsMain
[2024-06-13T12:32:47.301Z] > Task :connect:mirror-client:check
[2024-06-13T12:32:49.859Z] > Task :connect:runtime:checkstyleMain
[2024-06-13T12:32:49.859Z] > Task :connect:test-plugins:classes
[2024-06-13T12:32:50.482Z] > Task :connect:test-plugins:checkstyleMain
[2024-06-13T12:32:50.482Z] > Task :connect:test-plugins:compileTestJava NO-SOURCE
[2024-06-13T12:32:50.482Z] > Task :connect:test-plugins:testClasses UP-TO-DATE
[2024-06-13T12:32:50.482Z] > Task :connect:test-plugins:checkstyleTest NO-SOURCE
[2024-06-13T12:32:55.829Z] > Task :connect:mirror:spotbugsMain
[2024-06-13T12:33:00.336Z] > Task :connect:test-plugins:spotbugsTest SKIPPED
[2024-06-13T12:33:00.336Z] > Task :connect:transforms:classes
[2024-06-13T12:33:00.856Z] > Task :connect:transforms:checkstyleMain
[2024-06-13T12:33:03.206Z] > Task :connect:transforms:compileTestJava
[2024-06-13T12:33:03.206Z] > Task :connect:transforms:testClasses
[2024-06-13T12:33:03.748Z] > Task :connect:transforms:checkstyleTest
[2024-06-13T12:33:08.720Z] > Task :connect:test-plugins:spotbugsMain
[2024-06-13T12:33:08.720Z] > Task :connect:test-plugins:check
[2024-06-13T12:33:08.720Z] > Task :connect:transforms:spotbugsTest SKIPPED
[2024-06-13T12:33:09.359Z] > Task :storage:storage-api:checkstyleMain
[2024-06-13T12:33:09.359Z] > Task :storage:storage-api:checkstyleTest
[2024-06-13T12:33:17.636Z] > Task :connect:runtime:spotbugsMain
[2024-06-13T12:33:29.683Z] > Task :storage:storage-api:spotbugsMain
[2024-06-13T12:33:29.683Z] > Task :storage:storage-api:spotbugsTest SKIPPED
[2024-06-13T12:33:29.683Z] > Task :storage:storage-api:check
[2024-06-13T12:33:31.833Z] > Task :streams:examples:compileJava
[2024-06-13T12:33:31.833Z] > Task :streams:examples:classes
[2024-06-13T12:33:32.546Z] > Task :streams:examples:checkstyleMain
[2024-06-13T12:33:32.546Z] > Task :connect:transforms:spotbugsMain
[2024-06-13T12:33:32.546Z] > Task :connect:transforms:check
[2024-06-13T12:33:32.546Z] > Task :streams:streams-scala:compileJava NO-SOURCE
[2024-06-13T12:33:32.546Z] > Task :streams:examples:compileTestJava
[2024-06-13T12:33:32.546Z] > Task :streams:examples:testClasses
[2024-06-13T12:33:33.205Z] > Task :streams:examples:checkstyleTest
[2024-06-13T12:33:39.258Z] > Task :streams:streams-scala:compileScala
[2024-06-13T12:33:39.258Z] > Task :streams:examples:spotbugsTest SKIPPED
[2024-06-13T12:33:39.258Z] > Task :streams:streams-scala:classes
[2024-06-13T12:33:39.258Z] > Task :streams:streams-scala:checkstyleMain NO-SOURCE
[2024-06-13T12:33:55.742Z] > Task :streams:examples:spotbugsMain
[2024-06-13T12:33:55.742Z] > Task :streams:examples:check
[2024-06-13T12:33:55.742Z] > Task :streams:test-utils:classes
[2024-06-13T12:33:55.742Z] > Task :streams:test-utils:checkstyleMain
[2024-06-13T12:33:57.112Z] > Task :streams:upgrade-system-tests-33:spotbugsMain NO-SOURCE
[2024-06-13T12:33:57.112Z] > Task :streams:upgrade-system-tests-33:spotbugsTest SKIPPED
[2024-06-13T12:33:57.112Z] > Task :streams:upgrade-system-tests-33:check
[2024-06-13T12:33:57.112Z] > Task :streams:upgrade-system-tests-34:processTestResources NO-SOURCE
[2024-06-13T12:33:57.112Z] > Task :streams:upgrade-system-tests-34:testClasses
[2024-06-13T12:33:57.112Z] > Task :streams:test-utils:compileTestJava
[2024-06-13T12:33:57.112Z] > Task :streams:test-utils:testClasses
[2024-06-13T12:33:58.577Z] > Task :streams:upgrade-system-tests-34:checkstyleTest
[2024-06-13T12:33:58.577Z] > Task :streams:test-utils:checkstyleTest
[2024-06-13T12:33:58.577Z] > Task :streams:test-utils:spotbugsTest SKIPPED
[2024-06-13T12:33:58.577Z] > Task :streams:upgrade-system-tests-34:spotbugsMain NO-SOURCE
[2024-06-13T12:33:58.577Z] > Task :streams:upgrade-system-tests-34:spotbugsTest SKIPPED
[2024-06-13T12:33:58.577Z] > Task :streams:upgrade-system-tests-34:check
[2024-06-13T12:33:58.577Z] > Task :streams:upgrade-system-tests-35:processTestResources NO-SOURCE
[2024-06-13T12:33:58.577Z] > Task :streams:upgrade-system-tests-35:testClasses
[2024-06-13T12:33:59.181Z] > Task :streams:upgrade-system-tests-35:checkstyleTest
[2024-06-13T12:33:59.181Z] > Task :streams:upgrade-system-tests-35:spotbugsMain NO-SOURCE
[2024-06-13T12:33:59.181Z] > Task :streams:upgrade-system-tests-35:spotbugsTest SKIPPED
[2024-06-13T12:33:59.181Z] > Task :streams:upgrade-system-tests-35:check
[2024-06-13T12:33:59.181Z] > Task :streams:upgrade-system-tests-36:compileJava NO-SOURCE
[2024-06-13T12:33:59.181Z] > Task :streams:upgrade-system-tests-36:processResources NO-SOURCE
[2024-06-13T12:33:59.181Z] > Task :streams:upgrade-system-tests-36:classes UP-TO-DATE
[2024-06-13T12:33:59.181Z] > Task :streams:upgrade-system-tests-36:checkstyleMain NO-SOURCE
[2024-06-13T12:34:02.670Z] > Task :streams:upgrade-system-tests-36:compileTestJava
[2024-06-13T12:34:02.670Z] > Task :streams:upgrade-system-tests-36:processTestResources NO-SOURCE
[2024-06-13T12:34:02.670Z] > Task :streams:upgrade-system-tests-36:testClasses
[2024-06-13T12:34:03.197Z] > Task :streams:upgrade-system-tests-36:checkstyleTest
[2024-06-13T12:34:03.788Z] > Task :streams:upgrade-system-tests-36:spotbugsMain NO-SOURCE
[2024-06-13T12:34:03.788Z] > Task :streams:upgrade-system-tests-36:spotbugsTest SKIPPED
[2024-06-13T12:34:03.788Z] > Task :streams:upgrade-system-tests-36:check
[2024-06-13T12:34:03.788Z] > Task :tools:tools-api:processResources NO-SOURCE
[2024-06-13T12:34:03.788Z] > Task :tools:tools-api:classes
[2024-06-13T12:34:03.788Z] > Task :tools:tools-api:checkstyleMain
[2024-06-13T12:34:04.335Z] > Task :tools:tools-api:compileTestJava
[2024-06-13T12:34:04.335Z] > Task :tools:tools-api:processTestResources NO-SOURCE
[2024-06-13T12:34:04.335Z] > Task :tools:tools-api:testClasses
[2024-06-13T12:34:04.335Z] > Task :streams:streams-scala:spotbugsMain
[2024-06-13T12:34:04.335Z] > Task :tools:tools-api:checkstyleTest
[2024-06-13T12:34:04.335Z] > Task :tools:tools-api:spotbugsTest SKIPPED
[2024-06-13T12:34:15.705Z] > Task :tools:tools-api:spotbugsMain
[2024-06-13T12:34:15.705Z] > Task :tools:tools-api:check
[2024-06-13T12:34:17.664Z] > Task :streams:test-utils:spotbugsMain
[2024-06-13T12:34:17.664Z] > Task :streams:test-utils:check
[2024-06-13T12:35:02.619Z] 
[2024-06-13T12:35:02.619Z] FAILURE: Build failed with an exception.
[2024-06-13T12:35:02.619Z] 
[2024-06-13T12:35:02.619Z] * What went wrong:
[2024-06-13T12:35:02.619Z] Execution failed for task ':core:compileTestScala'.
[2024-06-13T12:35:02.619Z] > Compilation failed
[2024-06-13T12:35:02.619Z] 
[2024-06-13T12:35:02.619Z] * Try:
[2024-06-13T12:35:02.619Z] > Run with --info option to get more log output.
[2024-06-13T12:35:02.619Z] 
[2024-06-13T12:35:02.619Z] Deprecated Gradle features were used in this build, making it incompatible with Gradle 9.0.
[2024-06-13T12:35:02.619Z] 
[2024-06-13T12:35:02.619Z] You can use '--warning-mode all' to show the individual deprecation warnings and determine if they come from your own scripts or plugins.
[2024-06-13T12:35:02.619Z] 
[2024-06-13T12:35:02.619Z] For more on this, please refer to https://docs.gradle.org/8.6/userguide/command_line_interface.html#sec:command_line_warnings in the Gradle documentation.
[2024-06-13T12:35:02.619Z] 
[2024-06-13T12:35:02.619Z] BUILD FAILED in 11m 5s
[2024-06-13T12:35:02.619Z] 267 actionable tasks: 214 executed, 53 up-to-date
[2024-06-13T12:35:02.619Z] 
[2024-06-13T12:35:02.619Z] Publishing build scan...
[2024-06-13T12:35:02.619Z] https://ge.apache.org/s/xgfba7ntyr2ho
[2024-06-13T12:35:02.619Z] 
[2024-06-13T12:35:02.619Z] 
[2024-06-13T12:35:02.619Z] See the profiling report at: file:///home/jenkins/workspace/Kafka_kafka_3.7/build/reports/profile/profile-2024-06-13-12-24-08.html
[2024-06-13T12:35:02.619Z] A fine-grained performance profile is available: use the --scan option.
[Pipeline] }
[Pipeline] // withEnv
[Pipeline] }
[Pipeline] // withEnv
[Pipeline] }
[Pipeline] // withEnv
[Pipeline] }
[Pipeline] // node
[Pipeline] }
[Pipeline] // timestamps
[Pipeline] }
[Pipeline] // timeout
[Pipeline] }
[Pipeline] // stage
[Pipeline] }
Failed in branch JDK 21 and Scala 2.13
[Pipeline] // parallel
[Pipeline] }
[Pipeline] // stage
[Pipeline] stage
[Pipeline] { (Declarative: Post Actions)
[Pipeline] script
[Pipeline] {
[Pipeline] node
Still waiting to schedule task
‘EC2 (ec2-Jenkins Ephemeral Node User-CLI) - Jenkins Ephemeral Node - ubuntu label (i-03c9f3ab14456442b)’ is offline
‘builds41’ is offline
‘builds42’ is offline
‘builds43’ is offline
‘builds45’ is offline
‘builds50’ doesn’t have label ‘ubuntu’
‘builds56’ doesn’t have label ‘ubuntu’
‘jenkins-osu-power9-2’ doesn’t have label ‘ubuntu’
‘jenkins-s390x-6’ doesn’t have label ‘ubuntu’
‘lucene-solr-2’ doesn’t have label ‘ubuntu’
‘openwhisk1’ doesn’t have label ‘ubuntu’
‘plc4x2’ doesn’t have label ‘ubuntu’
Running on builds28 in /home/jenkins/jenkins-agent/workspace/Kafka_kafka_3.7
[Pipeline] {
[Pipeline] step

Jenkins build is still unstable: Kafka » Kafka Branch Builder » 3.7 #183

Posted by Apache Jenkins Server <je...@builds.apache.org>.
See <https://ci-builds.apache.org/job/Kafka/job/kafka/job/3.7/183/display/redirect>


Jenkins build is still unstable: Kafka » Kafka Branch Builder » 3.7 #182

Posted by Apache Jenkins Server <je...@builds.apache.org>.
See <https://ci-builds.apache.org/job/Kafka/job/kafka/job/3.7/182/display/redirect>


Jenkins build is unstable: Kafka » Kafka Branch Builder » 3.7 #181

Posted by Apache Jenkins Server <je...@builds.apache.org>.
See <https://ci-builds.apache.org/job/Kafka/job/kafka/job/3.7/181/display/redirect>


Build failed in Jenkins: Kafka » Kafka Branch Builder » 3.7 #180

Posted by Apache Jenkins Server <je...@builds.apache.org>.
See <https://ci-builds.apache.org/job/Kafka/job/kafka/job/3.7/180/display/redirect>

Changes:


------------------------------------------
[...truncated 2871 lines...]
[2024-06-14T22:12:47.275Z] [Warn] /home/jenkins/workspace/Kafka_kafka_3.7/streams/streams-scala/src/main/scala/org/apache/kafka/streams/scala/kstream/KStream.scala:722:4: Usage of named or default arguments transformed this annotation
[2024-06-14T22:12:47.275Z] constructor call into a block. The corresponding AnnotationInfo
[2024-06-14T22:12:47.275Z] will contain references to local values and default getters instead
[2024-06-14T22:12:47.275Z] of the actual argument trees
[2024-06-14T22:12:47.275Z] [Warn] /home/jenkins/workspace/Kafka_kafka_3.7/streams/streams-scala/src/main/scala/org/apache/kafka/streams/scala/kstream/KStream.scala:744:4: Usage of named or default arguments transformed this annotation
[2024-06-14T22:12:47.275Z] constructor call into a block. The corresponding AnnotationInfo
[2024-06-14T22:12:47.275Z] will contain references to local values and default getters instead
[2024-06-14T22:12:47.275Z] of the actual argument trees
[2024-06-14T22:12:47.275Z] [Warn] /home/jenkins/workspace/Kafka_kafka_3.7/streams/streams-scala/src/main/scala/org/apache/kafka/streams/scala/kstream/KStream.scala:766:4: Usage of named or default arguments transformed this annotation
[2024-06-14T22:12:47.275Z] constructor call into a block. The corresponding AnnotationInfo
[2024-06-14T22:12:47.275Z] will contain references to local values and default getters instead
[2024-06-14T22:12:47.275Z] of the actual argument trees
[2024-06-14T22:12:47.275Z] [Warn] /home/jenkins/workspace/Kafka_kafka_3.7/streams/streams-scala/src/main/scala/org/apache/kafka/streams/scala/kstream/KStream.scala:788:4: Usage of named or default arguments transformed this annotation
[2024-06-14T22:12:47.275Z] constructor call into a block. The corresponding AnnotationInfo
[2024-06-14T22:12:47.275Z] will contain references to local values and default getters instead
[2024-06-14T22:12:47.275Z] of the actual argument trees
[2024-06-14T22:12:47.275Z] [Warn] /home/jenkins/workspace/Kafka_kafka_3.7/streams/streams-scala/src/main/scala/org/apache/kafka/streams/scala/kstream/KStream.scala:810:4: Usage of named or default arguments transformed this annotation
[2024-06-14T22:12:47.275Z] constructor call into a block. The corresponding AnnotationInfo
[2024-06-14T22:12:47.275Z] will contain references to local values and default getters instead
[2024-06-14T22:12:47.275Z] of the actual argument trees
[2024-06-14T22:12:47.275Z] [Warn] /home/jenkins/workspace/Kafka_kafka_3.7/streams/streams-scala/src/main/scala/org/apache/kafka/streams/scala/kstream/KStream.scala:830:4: Usage of named or default arguments transformed this annotation
[2024-06-14T22:12:47.275Z] constructor call into a block. The corresponding AnnotationInfo
[2024-06-14T22:12:47.275Z] will contain references to local values and default getters instead
[2024-06-14T22:12:47.275Z] of the actual argument trees
[2024-06-14T22:12:47.275Z] [Warn] /home/jenkins/workspace/Kafka_kafka_3.7/streams/streams-scala/src/main/scala/org/apache/kafka/streams/scala/kstream/KStream.scala:852:4: Usage of named or default arguments transformed this annotation
[2024-06-14T22:12:47.275Z] constructor call into a block. The corresponding AnnotationInfo
[2024-06-14T22:12:47.275Z] will contain references to local values and default getters instead
[2024-06-14T22:12:47.275Z] of the actual argument trees
[2024-06-14T22:12:57.609Z] 
[2024-06-14T22:12:57.609Z] > Task :metadata:testClasses
[2024-06-14T22:12:57.609Z] > Task :metadata:spotbugsTest SKIPPED
[2024-06-14T22:13:13.248Z] 
[2024-06-14T22:13:13.248Z] > Task :core:compileScala
[2024-06-14T22:13:13.248Z] [Warn] /home/jenkins/workspace/Kafka_kafka_3.7/core/src/main/scala/kafka/admin/FeatureCommand.scala:20:2: Usage of named or default arguments transformed this annotation
[2024-06-14T22:13:13.248Z] constructor call into a block. The corresponding AnnotationInfo
[2024-06-14T22:13:13.248Z] will contain references to local values and default getters instead
[2024-06-14T22:13:13.248Z] of the actual argument trees
[2024-06-14T22:13:13.248Z] 
[2024-06-14T22:13:13.248Z] > Task :group-coordinator:checkstyleTest
[2024-06-14T22:13:17.526Z] > Task :group-coordinator:check
[2024-06-14T22:13:27.592Z] > Task :metadata:checkstyleTest
[2024-06-14T22:13:33.381Z] 
[2024-06-14T22:13:33.381Z] > Task :core:compileScala
[2024-06-14T22:13:33.381Z] [Warn] /home/jenkins/workspace/Kafka_kafka_3.7/core/src/main/scala/kafka/coordinator/group/MemberMetadata.scala:31:16: private object MemberMetadata in package group is never used
[2024-06-14T22:13:36.474Z] 
[2024-06-14T22:13:36.474Z] > Task :streams:streams-scala:compileScala
[2024-06-14T22:13:36.474Z] 14 warnings found
[2024-06-14T22:13:38.920Z] 
[2024-06-14T22:13:38.920Z] > Task :streams:streams-scala:classes
[2024-06-14T22:13:38.920Z] > Task :streams:streams-scala:checkstyleMain NO-SOURCE
[2024-06-14T22:13:41.534Z] 
[2024-06-14T22:13:41.535Z] FAILURE: Build failed with an exception.
[2024-06-14T22:13:41.535Z] 
[2024-06-14T22:13:41.535Z] * What went wrong:
[2024-06-14T22:13:41.535Z] Execution failed for task ':core:compileTestScala'.
[2024-06-14T22:13:41.535Z] > Compilation failed
[2024-06-14T22:13:41.535Z] 
[2024-06-14T22:13:41.535Z] * Try:
[2024-06-14T22:13:41.535Z] > Run with --info option to get more log output.
[2024-06-14T22:13:41.535Z] 
[2024-06-14T22:13:41.535Z] Deprecated Gradle features were used in this build, making it incompatible with Gradle 9.0.
[2024-06-14T22:13:41.535Z] 
[2024-06-14T22:13:41.535Z] You can use '--warning-mode all' to show the individual deprecation warnings and determine if they come from your own scripts or plugins.
[2024-06-14T22:13:41.535Z] 
[2024-06-14T22:13:41.535Z] For more on this, please refer to https://docs.gradle.org/8.6/userguide/command_line_interface.html#sec:command_line_warnings in the Gradle documentation.
[2024-06-14T22:13:41.535Z] 
[2024-06-14T22:13:41.535Z] BUILD FAILED in 9m 34s
[2024-06-14T22:13:41.535Z] 267 actionable tasks: 214 executed, 53 up-to-date
[2024-06-14T22:13:41.535Z] 
[2024-06-14T22:13:41.535Z] Publishing build scan...
[2024-06-14T22:13:41.535Z] https://ge.apache.org/s/y74lk66b6kclq
[2024-06-14T22:13:41.535Z] 
[2024-06-14T22:13:41.535Z] 
[2024-06-14T22:13:41.535Z] See the profiling report at: file:///home/jenkins/jenkins-agent/workspace/Kafka_kafka_3.7/build/reports/profile/profile-2024-06-14-22-04-08.html
[2024-06-14T22:13:41.535Z] A fine-grained performance profile is available: use the --scan option.
[Pipeline] }
[Pipeline] // withEnv
[Pipeline] }
[Pipeline] // withEnv
[Pipeline] }
[Pipeline] // withEnv
[Pipeline] }
[Pipeline] // node
[Pipeline] }
[Pipeline] // timestamps
[Pipeline] }
[Pipeline] // timeout
[Pipeline] }
[Pipeline] // stage
[Pipeline] }
Failed in branch JDK 17 and Scala 2.13
[2024-06-14T22:13:52.859Z] > Task :metadata:check
[2024-06-14T22:13:57.158Z] 
[2024-06-14T22:13:57.158Z] > Task :core:compileScala
[2024-06-14T22:13:57.158Z] [Warn] /home/jenkins/workspace/Kafka_kafka_3.7/core/src/main/scala/kafka/server/KafkaConfig.scala:475:89: value MESSAGE_FORMAT_VERSION_CONFIG in class TopicConfig is deprecated
[2024-06-14T22:13:57.158Z] [Warn] /home/jenkins/workspace/Kafka_kafka_3.7/core/src/main/scala/kafka/server/KafkaConfig.scala:481:100: value MESSAGE_TIMESTAMP_DIFFERENCE_MAX_MS_CONFIG in class TopicConfig is deprecated
[2024-06-14T22:13:57.158Z] [Warn] /home/jenkins/workspace/Kafka_kafka_3.7/core/src/main/scala/kafka/server/KafkaConfig.scala:594:64: value AUTO_INCLUDE_JMX_REPORTER_CONFIG in class CommonClientConfigs is deprecated
[2024-06-14T22:14:02.918Z] [Warn] /home/jenkins/workspace/Kafka_kafka_3.7/core/src/main/scala/kafka/tools/ClusterTool.scala:21:2: Usage of named or default arguments transformed this annotation
[2024-06-14T22:14:02.918Z] constructor call into a block. The corresponding AnnotationInfo
[2024-06-14T22:14:02.918Z] will contain references to local values and default getters instead
[2024-06-14T22:14:02.918Z] of the actual argument trees
[2024-06-14T22:14:04.283Z] [Warn] /home/jenkins/workspace/Kafka_kafka_3.7/core/src/main/scala/kafka/tools/EndToEndLatency.scala:22:2: Usage of named or default arguments transformed this annotation
[2024-06-14T22:14:04.283Z] constructor call into a block. The corresponding AnnotationInfo
[2024-06-14T22:14:04.283Z] will contain references to local values and default getters instead
[2024-06-14T22:14:04.283Z] of the actual argument trees
[2024-06-14T22:14:04.283Z] [Warn] /home/jenkins/workspace/Kafka_kafka_3.7/core/src/main/scala/kafka/tools/JmxTool.scala:21:2: Usage of named or default arguments transformed this annotation
[2024-06-14T22:14:04.283Z] constructor call into a block. The corresponding AnnotationInfo
[2024-06-14T22:14:04.283Z] will contain references to local values and default getters instead
[2024-06-14T22:14:04.283Z] of the actual argument trees
[2024-06-14T22:14:04.283Z] [Warn] /home/jenkins/workspace/Kafka_kafka_3.7/core/src/main/scala/kafka/tools/StateChangeLogMerger.scala:47:2: Usage of named or default arguments transformed this annotation
[2024-06-14T22:14:04.283Z] constructor call into a block. The corresponding AnnotationInfo
[2024-06-14T22:14:04.283Z] will contain references to local values and default getters instead
[2024-06-14T22:14:04.283Z] of the actual argument trees
[2024-06-14T22:14:05.836Z] 
[2024-06-14T22:14:05.836Z] > Task :streams:streams-scala:spotbugsMain
[2024-06-14T22:14:05.836Z] 
[2024-06-14T22:14:05.836Z] > Task :core:compileScala
[2024-06-14T22:14:05.836Z] [Warn] /home/jenkins/workspace/Kafka_kafka_3.7/core/src/main/scala/kafka/utils/NotNothing.scala:40:47: parameter value n in method notNothingEvidence is never used
[2024-06-14T22:14:05.836Z] [Warn] /home/jenkins/workspace/Kafka_kafka_3.7/core/src/main/scala/kafka/utils/json/DecodeJson.scala:88:29: higher-kinded type should be enabled
[2024-06-14T22:14:05.836Z] by making the implicit value scala.language.higherKinds visible.
[2024-06-14T22:14:05.836Z] ----
[2024-06-14T22:14:05.836Z] This can be achieved by adding the import clause 'import scala.language.higherKinds'
[2024-06-14T22:14:05.836Z] or by setting the compiler option -language:higherKinds.
[2024-06-14T22:14:05.836Z] See the Scaladoc for value scala.language.higherKinds for a discussion
[2024-06-14T22:14:05.836Z] why the feature should be explicitly enabled.
[2024-06-14T22:14:05.836Z] [Warn] /home/jenkins/workspace/Kafka_kafka_3.7/core/src/main/scala/kafka/utils/json/DecodeJson.scala:94:29: higher-kinded type should be enabled
[2024-06-14T22:14:05.836Z] by making the implicit value scala.language.higherKinds visible.
[2024-06-14T22:15:30.997Z] [Warn] /home/jenkins/workspace/Kafka_kafka_3.7/core/src/main/scala/kafka/utils/Implicits.scala:58:4: @nowarn annotation does not suppress any warnings
[2024-06-14T22:15:30.997Z] [Warn] /home/jenkins/workspace/Kafka_kafka_3.7/core/src/main/scala/kafka/raft/KafkaMetadataLog.scala:473:4: @nowarn annotation does not suppress any warnings
[2024-06-14T22:15:30.997Z] [Warn] /home/jenkins/workspace/Kafka_kafka_3.7/core/src/main/scala/kafka/security/authorizer/AclAuthorizer.scala:535:4: @nowarn annotation does not suppress any warnings
[2024-06-14T22:15:30.997Z] [Warn] /home/jenkins/workspace/Kafka_kafka_3.7/core/src/main/scala/kafka/tools/ConsoleProducer.scala:38:2: @nowarn annotation does not suppress any warnings
[2024-06-14T22:15:30.997Z] [Warn] /home/jenkins/workspace/Kafka_kafka_3.7/core/src/main/scala/kafka/utils/CoreUtils.scala:290:4: @nowarn annotation does not suppress any warnings
[2024-06-14T22:15:30.997Z] 17 warnings found
[2024-06-14T22:15:39.798Z] 
[2024-06-14T22:15:39.798Z] > Task :core:classes
[2024-06-14T22:15:39.798Z] > Task :core:compileTestJava NO-SOURCE
[2024-06-14T22:15:41.313Z] > Task :core:checkstyleMain
[2024-06-14T22:15:42.906Z] > Task :shell:compileJava
[2024-06-14T22:15:42.906Z] > Task :shell:classes
[2024-06-14T22:15:44.426Z] > Task :shell:checkstyleMain
[2024-06-14T22:15:47.897Z] 
[2024-06-14T22:15:47.897Z] > Task :core:compileTestScala
[2024-06-14T22:15:47.897Z] [Error] /home/jenkins/workspace/Kafka_kafka_3.7/core/src/test/scala/integration/kafka/admin/AdminFenceProducersIntegrationTest.scala:25:37: object transaction is not a member of package org.apache.kafka.coordinator
[2024-06-14T22:15:47.897Z] [Error] /home/jenkins/workspace/Kafka_kafka_3.7/core/src/test/scala/integration/kafka/admin/AdminFenceProducersIntegrationTest.scala:26:8: object ServerLogConfigs is not a member of package org.apache.kafka.server.config
[2024-06-14T22:15:49.355Z] [Error] /home/jenkins/workspace/Kafka_kafka_3.7/core/src/test/scala/integration/kafka/admin/AdminFenceProducersIntegrationTest.scala:60:15: not found: value ServerLogConfigs
[2024-06-14T22:15:49.355Z] [Error] /home/jenkins/workspace/Kafka_kafka_3.7/core/src/test/scala/integration/kafka/admin/AdminFenceProducersIntegrationTest.scala:62:15: not found: value TransactionLogConfigs
[2024-06-14T22:15:49.355Z] [Error] /home/jenkins/workspace/Kafka_kafka_3.7/core/src/test/scala/integration/kafka/admin/AdminFenceProducersIntegrationTest.scala:63:15: not found: value TransactionLogConfigs
[2024-06-14T22:15:49.355Z] [Error] /home/jenkins/workspace/Kafka_kafka_3.7/core/src/test/scala/integration/kafka/admin/AdminFenceProducersIntegrationTest.scala:64:15: not found: value TransactionLogConfigs
[2024-06-14T22:15:49.355Z] [Error] /home/jenkins/workspace/Kafka_kafka_3.7/core/src/test/scala/integration/kafka/admin/AdminFenceProducersIntegrationTest.scala:65:15: not found: value TransactionStateManagerConfigs
[2024-06-14T22:15:49.355Z] [Warn] /home/jenkins/workspace/Kafka_kafka_3.7/core/src/test/scala/integration/kafka/admin/AdminFenceProducersIntegrationTest.scala:25:50: Unused import
[2024-06-14T22:15:49.355Z] [Warn] /home/jenkins/workspace/Kafka_kafka_3.7/core/src/test/scala/integration/kafka/admin/AdminFenceProducersIntegrationTest.scala:25:73: Unused import
[2024-06-14T22:15:49.355Z] [Warn] /home/jenkins/workspace/Kafka_kafka_3.7/core/src/test/scala/integration/kafka/admin/AdminFenceProducersIntegrationTest.scala:26:39: Unused import
[2024-06-14T22:15:57.211Z] 
[2024-06-14T22:15:57.211Z] > Task :shell:spotbugsMain
[2024-06-14T22:16:02.260Z] > Task :clients:check
[2024-06-14T22:16:24.016Z] 
[2024-06-14T22:16:24.016Z] > Task :core:compileTestScala
[2024-06-14T22:16:24.016Z] [Warn] /home/jenkins/workspace/Kafka_kafka_3.7/core/src/test/scala/unit/kafka/server/AdvertiseBrokerTest.scala:22:21: imported `QuorumTestHarness` is permanently hidden by definition of object QuorumTestHarness in package server
[2024-06-14T22:16:24.016Z] [Warn] /home/jenkins/workspace/Kafka_kafka_3.7/core/src/test/scala/unit/kafka/server/BrokerEpochIntegrationTest.scala:27:21: imported `QuorumTestHarness` is permanently hidden by definition of object QuorumTestHarness in package server
[2024-06-14T22:16:25.529Z] [Warn] /home/jenkins/workspace/Kafka_kafka_3.7/core/src/test/scala/unit/kafka/server/DynamicConfigTest.scala:20:21: imported `QuorumTestHarness` is permanently hidden by definition of object QuorumTestHarness in package server
[2024-06-14T22:16:27.045Z] [Warn] /home/jenkins/workspace/Kafka_kafka_3.7/core/src/test/scala/unit/kafka/server/FetcherThreadTestUtils.scala:21:21: imported `InitialFetchState` is permanently hidden by definition of object InitialFetchState in package server
[2024-06-14T22:16:29.746Z] [Warn] /home/jenkins/workspace/Kafka_kafka_3.7/core/src/test/scala/unit/kafka/server/KafkaMetricReporterClusterIdTest.scala:23:21: imported `QuorumTestHarness` is permanently hidden by definition of object QuorumTestHarness in package server
[2024-06-14T22:16:29.746Z] [Warn] /home/jenkins/workspace/Kafka_kafka_3.7/core/src/test/scala/unit/kafka/server/LeaderElectionTest.scala:32:21: imported `QuorumTestHarness` is permanently hidden by definition of object QuorumTestHarness in package server
[2024-06-14T22:16:29.746Z] [Warn] /home/jenkins/workspace/Kafka_kafka_3.7/core/src/test/scala/unit/kafka/server/LogRecoveryTest.scala:25:21: imported `QuorumTestHarness` is permanently hidden by definition of object QuorumTestHarness in package server
[2024-06-14T22:16:36.300Z] [Warn] /home/jenkins/workspace/Kafka_kafka_3.7/core/src/test/scala/integration/kafka/api/AdminClientWithPoliciesIntegrationTest.scala:107:4: @nowarn annotation does not suppress any warnings
[2024-06-14T22:16:36.300Z] [Warn] /home/jenkins/workspace/Kafka_kafka_3.7/core/src/test/scala/integration/kafka/api/AuthorizerIntegrationTest.scala:1156:4: @nowarn annotation does not suppress any warnings
[2024-06-14T22:16:36.300Z] [Warn] /home/jenkins/workspace/Kafka_kafka_3.7/core/src/test/scala/integration/kafka/api/AuthorizerIntegrationTest.scala:1193:4: @nowarn annotation does not suppress any warnings
[2024-06-14T22:16:36.300Z] [Warn] /home/jenkins/workspace/Kafka_kafka_3.7/core/src/test/scala/integration/kafka/api/AuthorizerIntegrationTest.scala:1226:4: @nowarn annotation does not suppress any warnings
[2024-06-14T22:16:36.300Z] [Warn] /home/jenkins/workspace/Kafka_kafka_3.7/core/src/test/scala/integration/kafka/api/ConsumerBounceTest.scala:391:4: @nowarn annotation does not suppress any warnings
[2024-06-14T22:16:36.300Z] [Warn] /home/jenkins/workspace/Kafka_kafka_3.7/core/src/test/scala/integration/kafka/api/PlaintextAdminIntegrationTest.scala:2437:4: @nowarn annotation does not suppress any warnings
[2024-06-14T22:16:36.300Z] [Warn] /home/jenkins/workspace/Kafka_kafka_3.7/core/src/test/scala/integration/kafka/api/PlaintextAdminIntegrationTest.scala:2618:4: @nowarn annotation does not suppress any warnings
[2024-06-14T22:16:36.300Z] [Warn] /home/jenkins/workspace/Kafka_kafka_3.7/core/src/test/scala/integration/kafka/api/PlaintextAdminIntegrationTest.scala:2687:4: @nowarn annotation does not suppress any warnings
[2024-06-14T22:16:36.300Z] [Warn] /home/jenkins/workspace/Kafka_kafka_3.7/core/src/test/scala/integration/kafka/api/TransactionsBounceTest.scala:76:4: @nowarn annotation does not suppress any warnings
[2024-06-14T22:16:36.300Z] [Warn] /home/jenkins/workspace/Kafka_kafka_3.7/core/src/test/scala/integration/kafka/api/TransactionsTest.scala:305:4: @nowarn annotation does not suppress any warnings
[2024-06-14T22:16:36.300Z] [Warn] /home/jenkins/workspace/Kafka_kafka_3.7/core/src/test/scala/integration/kafka/server/DynamicBrokerReconfigurationTest.scala:621:4: @nowarn annotation does not suppress any warnings
[2024-06-14T22:16:36.300Z] [Warn] /home/jenkins/workspace/Kafka_kafka_3.7/core/src/test/scala/integration/kafka/server/DynamicBrokerReconfigurationTest.scala:1511:4: @nowarn annotation does not suppress any warnings
[2024-06-14T22:16:36.300Z] [Warn] /home/jenkins/workspace/Kafka_kafka_3.7/core/src/test/scala/integration/kafka/server/DynamicBrokerReconfigurationTest.scala:1538:4: @nowarn annotation does not suppress any warnings
[2024-06-14T22:16:36.300Z] [Warn] /home/jenkins/workspace/Kafka_kafka_3.7/core/src/test/scala/integration/kafka/server/DynamicBrokerReconfigurationTest.scala:1547:4: @nowarn annotation does not suppress any warnings
[2024-06-14T22:16:36.300Z] [Warn] /home/jenkins/workspace/Kafka_kafka_3.7/core/src/test/scala/integration/kafka/server/KRaftClusterTest.scala:783:4: @nowarn annotation does not suppress any warnings
[2024-06-14T22:16:36.300Z] [Warn] /home/jenkins/workspace/Kafka_kafka_3.7/core/src/test/scala/unit/kafka/integration/UncleanLeaderElectionTest.scala:342:4: @nowarn annotation does not suppress any warnings
[2024-06-14T22:16:36.300Z] [Warn] /home/jenkins/workspace/Kafka_kafka_3.7/core/src/test/scala/unit/kafka/log/LogConfigTest.scala:406:4: @nowarn annotation does not suppress any warnings
[2024-06-14T22:16:36.300Z] [Warn] /home/jenkins/workspace/Kafka_kafka_3.7/core/src/test/scala/unit/kafka/log/OffsetIndexTest.scala:52:4: @nowarn annotation does not suppress any warnings
[2024-06-14T22:16:36.300Z] [Warn] /home/jenkins/workspace/Kafka_kafka_3.7/core/src/test/scala/unit/kafka/server/DynamicBrokerConfigTest.scala:201:4: @nowarn annotation does not suppress any warnings
[2024-06-14T22:16:36.300Z] [Warn] /home/jenkins/workspace/Kafka_kafka_3.7/core/src/test/scala/unit/kafka/server/DynamicBrokerConfigTest.scala:680:4: @nowarn annotation does not suppress any warnings
[2024-06-14T22:16:36.300Z] [Warn] /home/jenkins/workspace/Kafka_kafka_3.7/core/src/test/scala/unit/kafka/server/DynamicConfigChangeTest.scala:458:4: @nowarn annotation does not suppress any warnings
[2024-06-14T22:16:36.300Z] [Warn] /home/jenkins/workspace/Kafka_kafka_3.7/core/src/test/scala/unit/kafka/server/KafkaConfigTest.scala:591:4: @nowarn annotation does not suppress any warnings
[2024-06-14T22:16:36.300Z] [Warn] /home/jenkins/workspace/Kafka_kafka_3.7/core/src/test/scala/unit/kafka/server/KafkaConfigTest.scala:738:4: @nowarn annotation does not suppress any warnings
[2024-06-14T22:16:36.300Z] [Warn] /home/jenkins/workspace/Kafka_kafka_3.7/core/src/test/scala/unit/kafka/server/KafkaConfigTest.scala:765:4: @nowarn annotation does not suppress any warnings
[2024-06-14T22:16:36.300Z] [Warn] /home/jenkins/workspace/Kafka_kafka_3.7/core/src/test/scala/unit/kafka/server/LogDirFailureTest.scala:74:4: @nowarn annotation does not suppress any warnings
[2024-06-14T22:16:36.300Z] [Warn] /home/jenkins/workspace/Kafka_kafka_3.7/core/src/test/scala/unit/kafka/tools/ConsoleProducerTest.scala:263:2: @nowarn annotation does not suppress any warnings
[2024-06-14T22:16:36.300Z] [Warn] /home/jenkins/workspace/Kafka_kafka_3.7/core/src/test/scala/unit/kafka/tools/MirrorMakerTest.scala:29:2: @nowarn annotation does not suppress any warnings
[2024-06-14T22:16:36.300Z] [Warn] /home/jenkins/workspace/Kafka_kafka_3.7/core/src/test/scala/unit/kafka/utils/TestUtils.scala:409:4: @nowarn annotation does not suppress any warnings
[2024-06-14T22:16:36.300Z] 38 warnings found
[2024-06-14T22:16:36.300Z] 7 errors found
[2024-06-14T22:16:36.300Z] 
[2024-06-14T22:16:36.300Z] > Task :core:compileTestScala FAILED
[2024-06-14T22:17:07.823Z] > Task :core:spotbugsMain
[2024-06-14T22:18:21.074Z] 
[2024-06-14T22:18:21.074Z] FAILURE: Build failed with an exception.
[2024-06-14T22:18:21.074Z] 
[2024-06-14T22:18:21.074Z] * What went wrong:
[2024-06-14T22:18:21.074Z] Execution failed for task ':core:compileTestScala'.
[2024-06-14T22:18:21.074Z] > Compilation failed
[2024-06-14T22:18:21.074Z] 
[2024-06-14T22:18:21.074Z] * Try:
[2024-06-14T22:18:21.074Z] > Run with --info option to get more log output.
[2024-06-14T22:18:21.074Z] 
[2024-06-14T22:18:21.074Z] Deprecated Gradle features were used in this build, making it incompatible with Gradle 9.0.
[2024-06-14T22:18:21.074Z] 
[2024-06-14T22:18:21.074Z] You can use '--warning-mode all' to show the individual deprecation warnings and determine if they come from your own scripts or plugins.
[2024-06-14T22:18:21.074Z] 
[2024-06-14T22:18:21.074Z] For more on this, please refer to https://docs.gradle.org/8.6/userguide/command_line_interface.html#sec:command_line_warnings in the Gradle documentation.
[2024-06-14T22:18:21.074Z] 
[2024-06-14T22:18:21.074Z] BUILD FAILED in 13m 13s
[2024-06-14T22:18:21.074Z] 264 actionable tasks: 210 executed, 54 up-to-date
[2024-06-14T22:18:21.074Z] 
[2024-06-14T22:18:21.074Z] Publishing build scan...
[2024-06-14T22:18:21.074Z] https://ge.apache.org/s/znwdxv2zlrzpq
[2024-06-14T22:18:21.074Z] 
[2024-06-14T22:18:21.074Z] 
[2024-06-14T22:18:21.074Z] See the profiling report at: file:///home/jenkins/workspace/Kafka_kafka_3.7/build/reports/profile/profile-2024-06-14-22-05-52.html
[2024-06-14T22:18:21.074Z] A fine-grained performance profile is available: use the --scan option.
[Pipeline] }
[Pipeline] // withEnv
[Pipeline] }
[Pipeline] // withEnv
[Pipeline] }
[Pipeline] // withEnv
[Pipeline] }
[Pipeline] // node
[Pipeline] }
[Pipeline] // timestamps
[Pipeline] }
[Pipeline] // timeout
[Pipeline] }
[Pipeline] // stage
[Pipeline] }
Failed in branch JDK 8 and Scala 2.12
[Pipeline] // parallel
[Pipeline] }
[Pipeline] // stage
[Pipeline] stage
[Pipeline] { (Declarative: Post Actions)
[Pipeline] script
[Pipeline] {
[Pipeline] node
Running on builds49 in /home/jenkins/jenkins-agent/workspace/Kafka_kafka_3.7
[Pipeline] {
[Pipeline] step

Build failed in Jenkins: Kafka » Kafka Branch Builder » 3.7 #179

Posted by Apache Jenkins Server <je...@builds.apache.org>.
See <https://ci-builds.apache.org/job/Kafka/job/kafka/job/3.7/179/display/redirect>

Changes:


------------------------------------------
[...truncated 2961 lines...]
[2024-06-14T00:13:23.859Z] > Task :connect:basic-auth-extension:compileTestJava
[2024-06-14T00:13:23.859Z] > Task :connect:basic-auth-extension:testClasses
[2024-06-14T00:13:24.697Z] > Task :streams:test-utils:check
[2024-06-14T00:13:25.487Z] > Task :connect:json:compileTestJava
[2024-06-14T00:13:25.487Z] > Task :connect:basic-auth-extension:spotbugsTest SKIPPED
[2024-06-14T00:13:25.487Z] > Task :connect:json:testClasses
[2024-06-14T00:13:25.487Z] > Task :connect:mirror-client:compileTestJava
[2024-06-14T00:13:25.487Z] > Task :connect:mirror-client:testClasses
[2024-06-14T00:13:27.231Z] > Task :connect:basic-auth-extension:checkstyleTest
[2024-06-14T00:13:27.231Z] > Task :connect:basic-auth-extension:check
[2024-06-14T00:13:27.231Z] > Task :connect:json:spotbugsTest SKIPPED
[2024-06-14T00:13:27.231Z] > Task :connect:mirror-client:spotbugsTest SKIPPED
[2024-06-14T00:13:27.231Z] > Task :connect:test-plugins:check
[2024-06-14T00:13:27.231Z] > Task :metadata:compileTestJava
[2024-06-14T00:13:28.892Z] > Task :connect:api:compileTestJava
[2024-06-14T00:13:28.892Z] > Task :connect:api:testClasses
[2024-06-14T00:13:28.892Z] > Task :connect:mirror-client:checkstyleTest
[2024-06-14T00:13:28.892Z] > Task :connect:api:spotbugsTest SKIPPED
[2024-06-14T00:13:28.892Z] > Task :connect:mirror-client:check
[2024-06-14T00:13:30.823Z] > Task :trogdor:checkstyleTest
[2024-06-14T00:13:30.823Z] > Task :trogdor:check
[2024-06-14T00:13:30.823Z] > Task :storage:storage-api:spotbugsTest SKIPPED
[2024-06-14T00:13:30.823Z] > Task :streams:examples:classes
[2024-06-14T00:13:30.823Z] > Task :connect:json:checkstyleTest
[2024-06-14T00:13:30.823Z] > Task :connect:json:check
[2024-06-14T00:13:30.823Z] > Task :storage:storage-api:checkstyleTest
[2024-06-14T00:13:30.823Z] > Task :storage:storage-api:check
[2024-06-14T00:13:30.823Z] > Task :streams:streams-scala:compileJava NO-SOURCE
[2024-06-14T00:13:32.404Z] > Task :connect:transforms:compileTestJava
[2024-06-14T00:13:32.404Z] > Task :connect:transforms:testClasses
[2024-06-14T00:13:34.149Z] > Task :streams:examples:compileTestJava
[2024-06-14T00:13:34.149Z] > Task :connect:transforms:spotbugsTest SKIPPED
[2024-06-14T00:13:34.149Z] > Task :streams:examples:testClasses
[2024-06-14T00:13:34.149Z] > Task :streams:examples:checkstyleMain
[2024-06-14T00:13:35.685Z] > Task :connect:api:checkstyleTest
[2024-06-14T00:13:35.685Z] > Task :connect:api:check
[2024-06-14T00:13:35.685Z] > Task :streams:examples:spotbugsTest SKIPPED
[2024-06-14T00:13:35.685Z] > Task :streams:test-utils:classes
[2024-06-14T00:13:35.685Z] > Task :streams:examples:checkstyleTest
[2024-06-14T00:13:35.685Z] > Task :tools:tools-api:check
[2024-06-14T00:13:39.224Z] > Task :streams:test-utils:checkstyleMain
[2024-06-14T00:13:39.644Z] > Task :streams:streams-scala:classes
[2024-06-14T00:13:39.644Z] > Task :streams:streams-scala:checkstyleMain NO-SOURCE
[2024-06-14T00:13:42.214Z] > Task :metadata:testClasses
[2024-06-14T00:13:42.214Z] > Task :connect:transforms:checkstyleTest
[2024-06-14T00:13:42.214Z] > Task :connect:transforms:check
[2024-06-14T00:13:42.214Z] > Task :metadata:spotbugsTest SKIPPED
[2024-06-14T00:13:43.977Z] > Task :streams:test-utils:compileTestJava
[2024-06-14T00:13:43.977Z] > Task :streams:test-utils:testClasses
[2024-06-14T00:13:43.977Z] > Task :streams:test-utils:spotbugsTest SKIPPED
[2024-06-14T00:13:47.007Z] > Task :group-coordinator:checkstyleTest
[2024-06-14T00:13:48.651Z] > Task :streams:test-utils:checkstyleTest
[2024-06-14T00:13:51.803Z] > Task :group-coordinator:check
[2024-06-14T00:13:53.797Z] > Task :streams:streams-scala:spotbugsMain
[2024-06-14T00:14:01.520Z] > Task :streams:streams-scala:compileScala
[2024-06-14T00:14:04.433Z] > Task :streams:examples:spotbugsMain
[2024-06-14T00:14:12.865Z] > Task :metadata:checkstyleTest
[2024-06-14T00:14:14.260Z] > Task :streams:test-utils:spotbugsMain
[2024-06-14T00:14:17.534Z] > Task :metadata:check
[2024-06-14T00:14:22.163Z] > Task :streams:examples:check
[2024-06-14T00:14:31.994Z] 
[2024-06-14T00:14:31.994Z] > Task :core:compileScala
[2024-06-14T00:14:31.994Z] Unexpected javac output: warning: [options] bootstrap class path not set in conjunction with -source 8
[2024-06-14T00:14:31.994Z] warning: [options] source value 8 is obsolete and will be removed in a future release
[2024-06-14T00:14:31.994Z] warning: [options] target value 8 is obsolete and will be removed in a future release
[2024-06-14T00:14:31.994Z] warning: [options] To suppress warnings about obsolete options, use -Xlint:-options.
[2024-06-14T00:14:31.994Z] /home/jenkins/jenkins-agent/workspace/Kafka_kafka_3.7/core/src/main/java/kafka/log/remote/RemoteLogManager.java:236: warning: [removal] AccessController in java.security has been deprecated and marked for removal
[2024-06-14T00:14:31.994Z]         return java.security.AccessController.doPrivileged(new PrivilegedAction<RemoteStorageManager>() {
[2024-06-14T00:14:31.994Z]                             ^
[2024-06-14T00:14:31.994Z] /home/jenkins/jenkins-agent/workspace/Kafka_kafka_3.7/core/src/main/java/kafka/log/remote/RemoteLogManager.java:258: warning: [removal] AccessController in java.security has been deprecated and marked for removal
[2024-06-14T00:14:31.994Z]         return java.security.AccessController.doPrivileged(new PrivilegedAction<RemoteLogMetadataManager>() {
[2024-06-14T00:14:31.994Z]                             ^
[2024-06-14T00:14:31.994Z] Note: Some input files use or override a deprecated API.
[2024-06-14T00:14:31.994Z] Note: Recompile with -Xlint:deprecation for details.
[2024-06-14T00:14:31.994Z] Note: /home/jenkins/jenkins-agent/workspace/Kafka_kafka_3.7/core/src/main/java/kafka/log/remote/RemoteLogManager.java uses unchecked or unsafe operations.
[2024-06-14T00:14:31.994Z] Note: Recompile with -Xlint:unchecked for details.
[2024-06-14T00:14:31.994Z] 6 warnings.
[2024-06-14T00:14:35.234Z] 
[2024-06-14T00:14:35.234Z] > Task :core:classes
[2024-06-14T00:14:35.234Z] > Task :core:compileTestJava NO-SOURCE
[2024-06-14T00:14:35.234Z] > Task :core:checkstyleMain
[2024-06-14T00:14:36.692Z] > Task :streams:test-utils:check
[2024-06-14T00:14:36.808Z] > Task :shell:compileJava
[2024-06-14T00:14:36.808Z] > Task :shell:classes
[2024-06-14T00:14:36.808Z] > Task :shell:checkstyleMain
[2024-06-14T00:14:40.029Z] 
[2024-06-14T00:14:40.029Z] > Task :core:compileTestScala
[2024-06-14T00:14:40.029Z] [Error] /home/jenkins/jenkins-agent/workspace/Kafka_kafka_3.7/core/src/test/scala/integration/kafka/admin/AdminFenceProducersIntegrationTest.scala:25:37: object transaction is not a member of package org.apache.kafka.coordinator
[2024-06-14T00:14:40.029Z] [Error] /home/jenkins/jenkins-agent/workspace/Kafka_kafka_3.7/core/src/test/scala/integration/kafka/admin/AdminFenceProducersIntegrationTest.scala:26:8: object ServerLogConfigs is not a member of package org.apache.kafka.server.config
[2024-06-14T00:14:40.029Z] [Error] /home/jenkins/jenkins-agent/workspace/Kafka_kafka_3.7/core/src/test/scala/integration/kafka/admin/AdminFenceProducersIntegrationTest.scala:60:15: not found: value ServerLogConfigs
[2024-06-14T00:14:40.029Z] [Error] /home/jenkins/jenkins-agent/workspace/Kafka_kafka_3.7/core/src/test/scala/integration/kafka/admin/AdminFenceProducersIntegrationTest.scala:62:15: not found: value TransactionLogConfigs
[2024-06-14T00:14:40.029Z] [Error] /home/jenkins/jenkins-agent/workspace/Kafka_kafka_3.7/core/src/test/scala/integration/kafka/admin/AdminFenceProducersIntegrationTest.scala:63:15: not found: value TransactionLogConfigs
[2024-06-14T00:14:40.029Z] [Error] /home/jenkins/jenkins-agent/workspace/Kafka_kafka_3.7/core/src/test/scala/integration/kafka/admin/AdminFenceProducersIntegrationTest.scala:64:15: not found: value TransactionLogConfigs
[2024-06-14T00:14:40.029Z] [Error] /home/jenkins/jenkins-agent/workspace/Kafka_kafka_3.7/core/src/test/scala/integration/kafka/admin/AdminFenceProducersIntegrationTest.scala:65:15: not found: value TransactionStateManagerConfigs
[2024-06-14T00:14:40.029Z] [Error] /home/jenkins/jenkins-agent/workspace/Kafka_kafka_3.7/core/src/test/scala/integration/kafka/admin/AdminFenceProducersIntegrationTest.scala:25:50: Unused import
[2024-06-14T00:14:40.029Z] [Error] /home/jenkins/jenkins-agent/workspace/Kafka_kafka_3.7/core/src/test/scala/integration/kafka/admin/AdminFenceProducersIntegrationTest.scala:25:73: Unused import
[2024-06-14T00:14:40.029Z] [Error] /home/jenkins/jenkins-agent/workspace/Kafka_kafka_3.7/core/src/test/scala/integration/kafka/admin/AdminFenceProducersIntegrationTest.scala:26:39: Unused import
[2024-06-14T00:14:48.980Z] 
[2024-06-14T00:14:48.980Z] > Task :shell:spotbugsMain
[2024-06-14T00:14:56.436Z] > Task :streams:streams-scala:classes
[2024-06-14T00:14:56.436Z] > Task :streams:streams-scala:checkstyleMain NO-SOURCE
[2024-06-14T00:15:00.771Z] > Task :clients:check
[2024-06-14T00:15:16.745Z] > Task :streams:streams-scala:spotbugsMain
[2024-06-14T00:15:20.404Z] 
[2024-06-14T00:15:20.404Z] > Task :core:compileTestScala
[2024-06-14T00:15:20.404Z] 10 errors found
[2024-06-14T00:15:20.404Z] 
[2024-06-14T00:15:20.404Z] > Task :core:compileTestScala FAILED
[2024-06-14T00:15:49.797Z] > Task :core:spotbugsMain
[2024-06-14T00:16:00.436Z] 
[2024-06-14T00:16:00.437Z] > Task :core:compileScala
[2024-06-14T00:16:00.437Z] [Warn] /home/jenkins/.gradle/workers/warning:[options] bootstrap class path not set in conjunction with -source 8
[2024-06-14T00:16:00.437Z] /home/jenkins/workspace/Kafka_kafka_3.7/core/src/main/java/kafka/log/remote/RemoteLogManager.java:236:  [removal] AccessController in java.security has been deprecated and marked for removal
[2024-06-14T00:16:00.437Z] [Warn] /home/jenkins/workspace/Kafka_kafka_3.7/core/src/main/java/kafka/log/remote/RemoteLogManager.java:258:  [removal] AccessController in java.security has been deprecated and marked for removal
[2024-06-14T00:16:02.344Z] 
[2024-06-14T00:16:02.344Z] > Task :core:classes
[2024-06-14T00:16:02.344Z] > Task :core:compileTestJava NO-SOURCE
[2024-06-14T00:16:04.288Z] > Task :core:checkstyleMain
[2024-06-14T00:16:06.144Z] > Task :shell:compileJava
[2024-06-14T00:16:06.144Z] > Task :shell:classes
[2024-06-14T00:16:07.721Z] > Task :shell:checkstyleMain
[2024-06-14T00:16:09.111Z] 
[2024-06-14T00:16:09.111Z] > Task :core:compileTestScala
[2024-06-14T00:16:09.111Z] [Error] /home/jenkins/workspace/Kafka_kafka_3.7/core/src/test/scala/integration/kafka/admin/AdminFenceProducersIntegrationTest.scala:25:37: object transaction is not a member of package org.apache.kafka.coordinator
[2024-06-14T00:16:09.111Z] [Error] /home/jenkins/workspace/Kafka_kafka_3.7/core/src/test/scala/integration/kafka/admin/AdminFenceProducersIntegrationTest.scala:26:8: object ServerLogConfigs is not a member of package org.apache.kafka.server.config
[2024-06-14T00:16:09.111Z] [Error] /home/jenkins/workspace/Kafka_kafka_3.7/core/src/test/scala/integration/kafka/admin/AdminFenceProducersIntegrationTest.scala:60:15: not found: value ServerLogConfigs
[2024-06-14T00:16:09.111Z] [Error] /home/jenkins/workspace/Kafka_kafka_3.7/core/src/test/scala/integration/kafka/admin/AdminFenceProducersIntegrationTest.scala:62:15: not found: value TransactionLogConfigs
[2024-06-14T00:16:09.111Z] [Error] /home/jenkins/workspace/Kafka_kafka_3.7/core/src/test/scala/integration/kafka/admin/AdminFenceProducersIntegrationTest.scala:63:15: not found: value TransactionLogConfigs
[2024-06-14T00:16:09.111Z] [Error] /home/jenkins/workspace/Kafka_kafka_3.7/core/src/test/scala/integration/kafka/admin/AdminFenceProducersIntegrationTest.scala:64:15: not found: value TransactionLogConfigs
[2024-06-14T00:16:09.111Z] [Error] /home/jenkins/workspace/Kafka_kafka_3.7/core/src/test/scala/integration/kafka/admin/AdminFenceProducersIntegrationTest.scala:65:15: not found: value TransactionStateManagerConfigs
[2024-06-14T00:16:09.111Z] [Error] /home/jenkins/workspace/Kafka_kafka_3.7/core/src/test/scala/integration/kafka/admin/AdminFenceProducersIntegrationTest.scala:25:50: Unused import
[2024-06-14T00:16:09.111Z] [Error] /home/jenkins/workspace/Kafka_kafka_3.7/core/src/test/scala/integration/kafka/admin/AdminFenceProducersIntegrationTest.scala:25:73: Unused import
[2024-06-14T00:16:09.111Z] [Error] /home/jenkins/workspace/Kafka_kafka_3.7/core/src/test/scala/integration/kafka/admin/AdminFenceProducersIntegrationTest.scala:26:39: Unused import
[2024-06-14T00:16:24.565Z] 
[2024-06-14T00:16:24.565Z] > Task :shell:spotbugsMain
[2024-06-14T00:16:37.447Z] > Task :clients:check
[2024-06-14T00:16:44.187Z] 
[2024-06-14T00:16:44.187Z] FAILURE: Build failed with an exception.
[2024-06-14T00:16:44.187Z] 
[2024-06-14T00:16:44.187Z] * What went wrong:
[2024-06-14T00:16:44.187Z] Execution failed for task ':core:compileTestScala'.
[2024-06-14T00:16:44.187Z] > Compilation failed
[2024-06-14T00:16:44.187Z] 
[2024-06-14T00:16:44.187Z] * Try:
[2024-06-14T00:16:44.187Z] > Run with --info option to get more log output.
[2024-06-14T00:16:44.187Z] 
[2024-06-14T00:16:44.187Z] Deprecated Gradle features were used in this build, making it incompatible with Gradle 9.0.
[2024-06-14T00:16:44.187Z] 
[2024-06-14T00:16:44.187Z] You can use '--warning-mode all' to show the individual deprecation warnings and determine if they come from your own scripts or plugins.
[2024-06-14T00:16:44.187Z] 
[2024-06-14T00:16:44.187Z] For more on this, please refer to https://docs.gradle.org/8.6/userguide/command_line_interface.html#sec:command_line_warnings in the Gradle documentation.
[2024-06-14T00:16:44.187Z] 
[2024-06-14T00:16:44.187Z] BUILD FAILED in 9m 6s
[2024-06-14T00:16:44.187Z] 267 actionable tasks: 214 executed, 53 up-to-date
[2024-06-14T00:16:44.187Z] 
[2024-06-14T00:16:44.187Z] Publishing build scan...
[2024-06-14T00:16:44.187Z] https://ge.apache.org/s/twrzp7dy7rmu4
[2024-06-14T00:16:44.187Z] 
[2024-06-14T00:16:44.187Z] 
[2024-06-14T00:16:44.187Z] See the profiling report at: file:///home/jenkins/jenkins-agent/workspace/Kafka_kafka_3.7/build/reports/profile/profile-2024-06-14-00-07-41.html
[2024-06-14T00:16:44.187Z] A fine-grained performance profile is available: use the --scan option.
[Pipeline] }
[Pipeline] // withEnv
[Pipeline] }
[Pipeline] // withEnv
[Pipeline] }
[Pipeline] // withEnv
[Pipeline] }
[Pipeline] // node
[Pipeline] }
[Pipeline] // timestamps
[Pipeline] }
[Pipeline] // timeout
[Pipeline] }
[Pipeline] // stage
[Pipeline] }
Failed in branch JDK 21 and Scala 2.13
[2024-06-14T00:16:56.415Z] 
[2024-06-14T00:16:56.415Z] > Task :core:compileTestScala
[2024-06-14T00:16:56.415Z] 10 errors found
[2024-06-14T00:16:56.415Z] 
[2024-06-14T00:16:56.415Z] > Task :core:compileTestScala FAILED
[2024-06-14T00:17:27.374Z] > Task :core:spotbugsMain
[2024-06-14T00:18:30.197Z] 
[2024-06-14T00:18:30.197Z] FAILURE: Build failed with an exception.
[2024-06-14T00:18:30.197Z] 
[2024-06-14T00:18:30.197Z] * What went wrong:
[2024-06-14T00:18:30.197Z] Execution failed for task ':core:compileTestScala'.
[2024-06-14T00:18:30.197Z] > Compilation failed
[2024-06-14T00:18:30.197Z] 
[2024-06-14T00:18:30.197Z] * Try:
[2024-06-14T00:18:30.197Z] > Run with --info option to get more log output.
[2024-06-14T00:18:30.197Z] 
[2024-06-14T00:18:30.197Z] Deprecated Gradle features were used in this build, making it incompatible with Gradle 9.0.
[2024-06-14T00:18:30.197Z] 
[2024-06-14T00:18:30.197Z] You can use '--warning-mode all' to show the individual deprecation warnings and determine if they come from your own scripts or plugins.
[2024-06-14T00:18:30.197Z] 
[2024-06-14T00:18:30.197Z] For more on this, please refer to https://docs.gradle.org/8.6/userguide/command_line_interface.html#sec:command_line_warnings in the Gradle documentation.
[2024-06-14T00:18:30.197Z] 
[2024-06-14T00:18:30.197Z] BUILD FAILED in 11m 53s
[2024-06-14T00:18:30.197Z] 267 actionable tasks: 214 executed, 53 up-to-date
[2024-06-14T00:18:30.197Z] 
[2024-06-14T00:18:30.197Z] Publishing build scan...
[2024-06-14T00:18:30.197Z] https://ge.apache.org/s/5luspy7e7h7uy
[2024-06-14T00:18:30.197Z] 
[2024-06-14T00:18:30.197Z] 
[2024-06-14T00:18:30.197Z] See the profiling report at: file:///home/jenkins/workspace/Kafka_kafka_3.7/build/reports/profile/profile-2024-06-14-00-06-57.html
[2024-06-14T00:18:30.197Z] A fine-grained performance profile is available: use the --scan option.
[Pipeline] }
[Pipeline] // withEnv
[Pipeline] }
[Pipeline] // withEnv
[Pipeline] }
[Pipeline] // withEnv
[Pipeline] }
[Pipeline] // node
[Pipeline] }
[Pipeline] // timestamps
[Pipeline] }
[Pipeline] // timeout
[Pipeline] }
[Pipeline] // stage
[Pipeline] }
Failed in branch JDK 17 and Scala 2.13
[Pipeline] // parallel
[Pipeline] }
[Pipeline] // stage
[Pipeline] stage
[Pipeline] { (Declarative: Post Actions)
[Pipeline] script
[Pipeline] {
[Pipeline] node
Still waiting to schedule task
‘EC2 (ec2-Jenkins Ephemeral Node User-CLI) - Jenkins Ephemeral Node - ubuntu label (i-03c9f3ab14456442b)’ is offline
‘builds41’ is offline
‘builds42’ is offline
‘builds43’ is offline
‘builds45’ is offline
‘builds50’ doesn’t have label ‘ubuntu’
‘builds56’ doesn’t have label ‘ubuntu’
‘jenkins-osu-power9-1’ doesn’t have label ‘ubuntu’
‘jenkins-osu-power9-2’ doesn’t have label ‘ubuntu’
‘jenkins-s390x-6’ doesn’t have label ‘ubuntu’
‘lucene-solr-2’ doesn’t have label ‘ubuntu’
‘openwhisk1’ doesn’t have label ‘ubuntu’
‘plc4x2’ doesn’t have label ‘ubuntu’
Running on builds48 in /home/jenkins/workspace/Kafka_kafka_3.7
[Pipeline] {
[Pipeline] step

Build failed in Jenkins: Kafka » Kafka Branch Builder » 3.7 #178

Posted by Apache Jenkins Server <je...@builds.apache.org>.
See <https://ci-builds.apache.org/job/Kafka/job/kafka/job/3.7/178/display/redirect>

Changes:


------------------------------------------
[...truncated 2919 lines...]
[2024-06-13T22:08:13.874Z] Note: /home/jenkins/workspace/Kafka_kafka_3.7/core/src/main/java/kafka/log/remote/RemoteLogManager.java uses unchecked or unsafe operations.
[2024-06-13T22:08:13.874Z] Note: Recompile with -Xlint:unchecked for details.
[2024-06-13T22:08:13.874Z] 1 warning.
[2024-06-13T22:08:13.874Z] 
[2024-06-13T22:08:13.874Z] > Task :core:classes
[2024-06-13T22:08:13.874Z] > Task :core:compileTestJava NO-SOURCE
[2024-06-13T22:08:13.874Z] > Task :core:checkstyleMain
[2024-06-13T22:08:13.874Z] > Task :shell:compileJava
[2024-06-13T22:08:13.874Z] > Task :shell:classes
[2024-06-13T22:08:13.874Z] > Task :shell:checkstyleMain
[2024-06-13T22:08:13.874Z] 
[2024-06-13T22:08:13.874Z] > Task :core:compileTestScala
[2024-06-13T22:08:13.874Z] [Error] /home/jenkins/workspace/Kafka_kafka_3.7/core/src/test/scala/integration/kafka/admin/AdminFenceProducersIntegrationTest.scala:25:37: object transaction is not a member of package org.apache.kafka.coordinator
[2024-06-13T22:08:13.874Z] [Error] /home/jenkins/workspace/Kafka_kafka_3.7/core/src/test/scala/integration/kafka/admin/AdminFenceProducersIntegrationTest.scala:26:8: object ServerLogConfigs is not a member of package org.apache.kafka.server.config
[2024-06-13T22:08:13.874Z] [Error] /home/jenkins/workspace/Kafka_kafka_3.7/core/src/test/scala/integration/kafka/admin/AdminFenceProducersIntegrationTest.scala:60:15: not found: value ServerLogConfigs
[2024-06-13T22:08:13.874Z] [Error] /home/jenkins/workspace/Kafka_kafka_3.7/core/src/test/scala/integration/kafka/admin/AdminFenceProducersIntegrationTest.scala:62:15: not found: value TransactionLogConfigs
[2024-06-13T22:08:13.874Z] [Error] /home/jenkins/workspace/Kafka_kafka_3.7/core/src/test/scala/integration/kafka/admin/AdminFenceProducersIntegrationTest.scala:63:15: not found: value TransactionLogConfigs
[2024-06-13T22:08:13.874Z] [Error] /home/jenkins/workspace/Kafka_kafka_3.7/core/src/test/scala/integration/kafka/admin/AdminFenceProducersIntegrationTest.scala:64:15: not found: value TransactionLogConfigs
[2024-06-13T22:08:13.874Z] [Error] /home/jenkins/workspace/Kafka_kafka_3.7/core/src/test/scala/integration/kafka/admin/AdminFenceProducersIntegrationTest.scala:65:15: not found: value TransactionStateManagerConfigs
[2024-06-13T22:08:13.874Z] [Error] /home/jenkins/workspace/Kafka_kafka_3.7/core/src/test/scala/integration/kafka/admin/AdminFenceProducersIntegrationTest.scala:25:50: Unused import
[2024-06-13T22:08:13.874Z] [Error] /home/jenkins/workspace/Kafka_kafka_3.7/core/src/test/scala/integration/kafka/admin/AdminFenceProducersIntegrationTest.scala:25:73: Unused import
[2024-06-13T22:08:13.874Z] [Error] /home/jenkins/workspace/Kafka_kafka_3.7/core/src/test/scala/integration/kafka/admin/AdminFenceProducersIntegrationTest.scala:26:39: Unused import
[2024-06-13T22:08:19.602Z] 
[2024-06-13T22:08:19.602Z] > Task :shell:spotbugsMain
[2024-06-13T22:08:31.202Z] > Task :clients:check
[2024-06-13T22:08:43.630Z] > Task :clients:testClasses
[2024-06-13T22:08:43.630Z] > Task :clients:spotbugsTest SKIPPED
[2024-06-13T22:08:45.341Z] > Task :connect:mirror-client:compileTestJava
[2024-06-13T22:08:45.341Z] > Task :connect:mirror-client:testClasses
[2024-06-13T22:08:45.341Z] > Task :storage:storage-api:compileTestJava
[2024-06-13T22:08:45.341Z] > Task :storage:storage-api:testClasses
[2024-06-13T22:08:45.341Z] > Task :connect:mirror-client:spotbugsTest SKIPPED
[2024-06-13T22:08:45.341Z] > Task :storage:storage-api:spotbugsTest SKIPPED
[2024-06-13T22:08:45.341Z] > Task :log4j-appender:compileTestJava
[2024-06-13T22:08:45.341Z] > Task :log4j-appender:testClasses
[2024-06-13T22:08:45.341Z] > Task :log4j-appender:spotbugsTest SKIPPED
[2024-06-13T22:08:45.341Z] > Task :streams:examples:compileTestJava
[2024-06-13T22:08:45.341Z] > Task :streams:examples:testClasses
[2024-06-13T22:08:45.341Z] > Task :streams:examples:spotbugsTest SKIPPED
[2024-06-13T22:08:45.341Z] > Task :connect:basic-auth-extension:compileTestJava
[2024-06-13T22:08:45.341Z] > Task :connect:basic-auth-extension:testClasses
[2024-06-13T22:08:45.341Z] > Task :connect:basic-auth-extension:spotbugsTest SKIPPED
[2024-06-13T22:08:46.625Z] > Task :server:compileTestJava
[2024-06-13T22:08:46.625Z] > Task :server:testClasses
[2024-06-13T22:08:46.625Z] > Task :server:spotbugsTest SKIPPED
[2024-06-13T22:08:46.625Z] > Task :connect:mirror-client:checkstyleTest
[2024-06-13T22:08:46.625Z] > Task :connect:mirror-client:check
[2024-06-13T22:08:46.625Z] > Task :connect:json:compileTestJava
[2024-06-13T22:08:46.625Z] > Task :connect:json:testClasses
[2024-06-13T22:08:46.625Z] > Task :connect:json:spotbugsTest SKIPPED
[2024-06-13T22:08:46.625Z] > Task :storage:storage-api:checkstyleTest
[2024-06-13T22:08:46.625Z] > Task :storage:storage-api:check
[2024-06-13T22:08:46.625Z] > Task :log4j-appender:checkstyleTest
[2024-06-13T22:08:46.625Z] > Task :log4j-appender:check
[2024-06-13T22:08:47.990Z] > Task :streams:examples:checkstyleTest
[2024-06-13T22:08:47.990Z] > Task :streams:examples:check
[2024-06-13T22:08:49.354Z] > Task :connect:basic-auth-extension:checkstyleTest
[2024-06-13T22:08:49.354Z] > Task :connect:basic-auth-extension:check
[2024-06-13T22:08:49.354Z] > Task :connect:transforms:compileTestJava
[2024-06-13T22:08:49.354Z] > Task :connect:transforms:testClasses
[2024-06-13T22:08:49.354Z] > Task :connect:transforms:spotbugsTest SKIPPED
[2024-06-13T22:08:49.354Z] > Task :trogdor:compileTestJava
[2024-06-13T22:08:49.354Z] > Task :trogdor:testClasses
[2024-06-13T22:08:50.875Z] > Task :trogdor:spotbugsTest SKIPPED
[2024-06-13T22:08:50.875Z] > Task :connect:api:compileTestJava
[2024-06-13T22:08:50.875Z] > Task :connect:api:testClasses
[2024-06-13T22:08:50.875Z] > Task :connect:api:spotbugsTest SKIPPED
[2024-06-13T22:08:50.875Z] > Task :connect:json:checkstyleTest
[2024-06-13T22:08:50.875Z] > Task :connect:json:check
[2024-06-13T22:08:51.570Z] 
[2024-06-13T22:08:51.570Z] > Task :core:compileTestScala
[2024-06-13T22:08:51.570Z] 10 errors found
[2024-06-13T22:08:51.570Z] 
[2024-06-13T22:08:51.570Z] > Task :core:compileTestScala FAILED
[2024-06-13T22:08:52.227Z] > Task :streams:test-utils:compileTestJava
[2024-06-13T22:08:52.227Z] > Task :streams:test-utils:testClasses
[2024-06-13T22:08:52.227Z] > Task :server:checkstyleTest
[2024-06-13T22:08:52.227Z] > Task :server:check
[2024-06-13T22:08:52.227Z] > Task :streams:test-utils:spotbugsTest SKIPPED
[2024-06-13T22:08:53.751Z] > Task :server-common:compileTestJava
[2024-06-13T22:08:53.751Z] > Task :server-common:testClasses
[2024-06-13T22:08:53.751Z] > Task :server-common:spotbugsTest SKIPPED
[2024-06-13T22:08:58.161Z] > Task :trogdor:checkstyleTest
[2024-06-13T22:08:58.161Z] > Task :trogdor:check
[2024-06-13T22:08:58.161Z] > Task :connect:transforms:checkstyleTest
[2024-06-13T22:08:58.161Z] > Task :connect:transforms:check
[2024-06-13T22:08:59.514Z] > Task :streams:test-utils:checkstyleTest
[2024-06-13T22:08:59.514Z] > Task :streams:test-utils:check
[2024-06-13T22:08:59.514Z] > Task :connect:api:checkstyleTest
[2024-06-13T22:08:59.514Z] > Task :connect:api:check
[2024-06-13T22:09:01.040Z] > Task :raft:compileTestJava
[2024-06-13T22:09:01.040Z] > Task :raft:testClasses
[2024-06-13T22:09:02.561Z] > Task :raft:spotbugsTest SKIPPED
[2024-06-13T22:09:04.082Z] > Task :server-common:checkstyleTest
[2024-06-13T22:09:04.082Z] > Task :server-common:check
[2024-06-13T22:09:05.601Z] > Task :streams:streams-scala:classes
[2024-06-13T22:09:05.601Z] > Task :streams:streams-scala:checkstyleMain NO-SOURCE
[2024-06-13T22:09:10.339Z] > Task :clients:checkstyleTest
[2024-06-13T22:09:11.553Z] > Task :clients:spotbugsMain
[2024-06-13T22:09:16.144Z] > Task :group-coordinator:compileTestJava
[2024-06-13T22:09:16.144Z] > Task :group-coordinator:testClasses
[2024-06-13T22:09:16.144Z] > Task :group-coordinator:spotbugsTest SKIPPED
[2024-06-13T22:09:17.666Z] > Task :raft:checkstyleTest
[2024-06-13T22:09:17.666Z] > Task :raft:check
[2024-06-13T22:09:23.278Z] > Task :metadata:compileTestJava
[2024-06-13T22:09:23.278Z] > Task :metadata:testClasses
[2024-06-13T22:09:23.278Z] > Task :metadata:spotbugsTest SKIPPED
[2024-06-13T22:09:23.865Z] > Task :core:spotbugsMain
[2024-06-13T22:09:37.030Z] > Task :streams:streams-scala:spotbugsMain
[2024-06-13T22:09:37.030Z] > Task :group-coordinator:checkstyleTest
[2024-06-13T22:09:37.030Z] > Task :group-coordinator:check
[2024-06-13T22:09:43.057Z] > Task :metadata:checkstyleTest
[2024-06-13T22:09:43.057Z] > Task :metadata:check
[2024-06-13T22:10:20.996Z] 
[2024-06-13T22:10:20.996Z] FAILURE: Build failed with an exception.
[2024-06-13T22:10:20.996Z] 
[2024-06-13T22:10:20.996Z] * What went wrong:
[2024-06-13T22:10:20.996Z] Execution failed for task ':core:compileTestScala'.
[2024-06-13T22:10:20.996Z] > Compilation failed
[2024-06-13T22:10:20.996Z] 
[2024-06-13T22:10:20.996Z] * Try:
[2024-06-13T22:10:20.996Z] > Run with --info option to get more log output.
[2024-06-13T22:10:20.996Z] 
[2024-06-13T22:10:20.996Z] Deprecated Gradle features were used in this build, making it incompatible with Gradle 9.0.
[2024-06-13T22:10:20.996Z] 
[2024-06-13T22:10:20.996Z] You can use '--warning-mode all' to show the individual deprecation warnings and determine if they come from your own scripts or plugins.
[2024-06-13T22:10:20.996Z] 
[2024-06-13T22:10:20.996Z] For more on this, please refer to https://docs.gradle.org/8.6/userguide/command_line_interface.html#sec:command_line_warnings in the Gradle documentation.
[2024-06-13T22:10:20.996Z] 
[2024-06-13T22:10:20.996Z] BUILD FAILED in 8m 37s
[2024-06-13T22:10:20.996Z] 267 actionable tasks: 214 executed, 53 up-to-date
[2024-06-13T22:10:20.996Z] 
[2024-06-13T22:10:20.996Z] Publishing build scan...
[2024-06-13T22:10:20.996Z] https://ge.apache.org/s/wgppzt2tbqvbi
[2024-06-13T22:10:20.996Z] 
[2024-06-13T22:10:20.996Z] 
[2024-06-13T22:10:20.996Z] See the profiling report at: file:///home/jenkins/workspace/Kafka_kafka_3.7/build/reports/profile/profile-2024-06-13-22-02-01.html
[2024-06-13T22:10:20.996Z] A fine-grained performance profile is available: use the --scan option.
[Pipeline] }
[Pipeline] // withEnv
[Pipeline] }
[Pipeline] // withEnv
[Pipeline] }
[Pipeline] // withEnv
[Pipeline] }
[Pipeline] // node
[Pipeline] }
[Pipeline] // timestamps
[Pipeline] }
[Pipeline] // timeout
[Pipeline] }
[Pipeline] // stage
[Pipeline] }
Failed in branch JDK 11 and Scala 2.13
[2024-06-13T22:10:44.218Z] 
[2024-06-13T22:10:44.218Z] > Task :core:compileScala
[2024-06-13T22:10:44.218Z] [Warn] /home/jenkins/.gradle/workers/warning:[options] bootstrap class path not set in conjunction with -source 8
[2024-06-13T22:10:44.218Z] /home/jenkins/jenkins-agent/workspace/Kafka_kafka_3.7/core/src/main/java/kafka/log/remote/RemoteLogManager.java:236:  [removal] AccessController in java.security has been deprecated and marked for removal
[2024-06-13T22:10:44.218Z] [Warn] /home/jenkins/jenkins-agent/workspace/Kafka_kafka_3.7/core/src/main/java/kafka/log/remote/RemoteLogManager.java:258:  [removal] AccessController in java.security has been deprecated and marked for removal
[2024-06-13T22:10:44.218Z] 
[2024-06-13T22:10:44.218Z] > Task :core:classes
[2024-06-13T22:10:44.218Z] > Task :core:compileTestJava NO-SOURCE
[2024-06-13T22:10:44.218Z] > Task :core:checkstyleMain
[2024-06-13T22:10:45.581Z] > Task :shell:compileJava
[2024-06-13T22:10:45.581Z] > Task :shell:classes
[2024-06-13T22:10:45.581Z] > Task :shell:checkstyleMain
[2024-06-13T22:10:48.268Z] 
[2024-06-13T22:10:48.268Z] > Task :core:compileTestScala
[2024-06-13T22:10:48.268Z] [Error] /home/jenkins/jenkins-agent/workspace/Kafka_kafka_3.7/core/src/test/scala/integration/kafka/admin/AdminFenceProducersIntegrationTest.scala:25:37: object transaction is not a member of package org.apache.kafka.coordinator
[2024-06-13T22:10:48.268Z] [Error] /home/jenkins/jenkins-agent/workspace/Kafka_kafka_3.7/core/src/test/scala/integration/kafka/admin/AdminFenceProducersIntegrationTest.scala:26:8: object ServerLogConfigs is not a member of package org.apache.kafka.server.config
[2024-06-13T22:10:49.932Z] [Error] /home/jenkins/jenkins-agent/workspace/Kafka_kafka_3.7/core/src/test/scala/integration/kafka/admin/AdminFenceProducersIntegrationTest.scala:60:15: not found: value ServerLogConfigs
[2024-06-13T22:10:49.932Z] [Error] /home/jenkins/jenkins-agent/workspace/Kafka_kafka_3.7/core/src/test/scala/integration/kafka/admin/AdminFenceProducersIntegrationTest.scala:62:15: not found: value TransactionLogConfigs
[2024-06-13T22:10:49.932Z] [Error] /home/jenkins/jenkins-agent/workspace/Kafka_kafka_3.7/core/src/test/scala/integration/kafka/admin/AdminFenceProducersIntegrationTest.scala:63:15: not found: value TransactionLogConfigs
[2024-06-13T22:10:49.932Z] [Error] /home/jenkins/jenkins-agent/workspace/Kafka_kafka_3.7/core/src/test/scala/integration/kafka/admin/AdminFenceProducersIntegrationTest.scala:64:15: not found: value TransactionLogConfigs
[2024-06-13T22:10:49.932Z] [Error] /home/jenkins/jenkins-agent/workspace/Kafka_kafka_3.7/core/src/test/scala/integration/kafka/admin/AdminFenceProducersIntegrationTest.scala:65:15: not found: value TransactionStateManagerConfigs
[2024-06-13T22:10:49.932Z] [Error] /home/jenkins/jenkins-agent/workspace/Kafka_kafka_3.7/core/src/test/scala/integration/kafka/admin/AdminFenceProducersIntegrationTest.scala:25:50: Unused import
[2024-06-13T22:10:49.932Z] [Error] /home/jenkins/jenkins-agent/workspace/Kafka_kafka_3.7/core/src/test/scala/integration/kafka/admin/AdminFenceProducersIntegrationTest.scala:25:73: Unused import
[2024-06-13T22:10:49.932Z] [Error] /home/jenkins/jenkins-agent/workspace/Kafka_kafka_3.7/core/src/test/scala/integration/kafka/admin/AdminFenceProducersIntegrationTest.scala:26:39: Unused import
[2024-06-13T22:10:56.828Z] 
[2024-06-13T22:10:56.828Z] > Task :shell:spotbugsMain
[2024-06-13T22:11:12.630Z] > Task :clients:check
[2024-06-13T22:11:28.027Z] 
[2024-06-13T22:11:28.027Z] > Task :core:compileTestScala FAILED
[2024-06-13T22:11:28.027Z] 10 errors found
[2024-06-13T22:11:57.592Z] 
[2024-06-13T22:11:57.592Z] > Task :core:spotbugsMain
[2024-06-13T22:12:48.521Z] 
[2024-06-13T22:12:48.521Z] FAILURE: Build failed with an exception.
[2024-06-13T22:12:48.521Z] 
[2024-06-13T22:12:48.521Z] * What went wrong:
[2024-06-13T22:12:48.521Z] Execution failed for task ':core:compileTestScala'.
[2024-06-13T22:12:48.521Z] > Compilation failed
[2024-06-13T22:12:48.521Z] 
[2024-06-13T22:12:48.521Z] * Try:
[2024-06-13T22:12:48.521Z] > Run with --info option to get more log output.
[2024-06-13T22:12:48.521Z] 
[2024-06-13T22:12:48.521Z] Deprecated Gradle features were used in this build, making it incompatible with Gradle 9.0.
[2024-06-13T22:12:48.521Z] 
[2024-06-13T22:12:48.521Z] You can use '--warning-mode all' to show the individual deprecation warnings and determine if they come from your own scripts or plugins.
[2024-06-13T22:12:48.521Z] 
[2024-06-13T22:12:48.521Z] For more on this, please refer to https://docs.gradle.org/8.6/userguide/command_line_interface.html#sec:command_line_warnings in the Gradle documentation.
[2024-06-13T22:12:48.521Z] 
[2024-06-13T22:12:48.521Z] BUILD FAILED in 10m 2s
[2024-06-13T22:12:48.521Z] 267 actionable tasks: 214 executed, 53 up-to-date
[2024-06-13T22:12:50.190Z] 
[2024-06-13T22:12:50.190Z] Publishing build scan...
[2024-06-13T22:12:50.190Z] https://ge.apache.org/s/jsrh3ftzcapq4
[2024-06-13T22:12:50.190Z] 
[2024-06-13T22:12:50.190Z] 
[2024-06-13T22:12:50.190Z] See the profiling report at: file:///home/jenkins/jenkins-agent/workspace/Kafka_kafka_3.7/build/reports/profile/profile-2024-06-13-22-03-48.html
[2024-06-13T22:12:50.190Z] A fine-grained performance profile is available: use the --scan option.
[Pipeline] }
[Pipeline] // withEnv
[Pipeline] }
[Pipeline] // withEnv
[Pipeline] }
[Pipeline] // withEnv
[Pipeline] }
[Pipeline] // node
[Pipeline] }
[Pipeline] // timestamps
[Pipeline] }
[Pipeline] // timeout
[Pipeline] }
[Pipeline] // stage
[Pipeline] }
Failed in branch JDK 17 and Scala 2.13
[Pipeline] // parallel
[Pipeline] }
[Pipeline] // stage
[Pipeline] stage
[Pipeline] { (Declarative: Post Actions)
[Pipeline] script
[Pipeline] {
[Pipeline] node
Still waiting to schedule task
‘EC2 (ec2-Jenkins Ephemeral Node User-CLI) - Jenkins Ephemeral Node - ubuntu label (i-03c9f3ab14456442b)’ is offline
‘builds41’ is offline
‘builds42’ is offline
‘builds45’ is offline
‘builds50’ doesn’t have label ‘ubuntu’
‘builds56’ doesn’t have label ‘ubuntu’
‘jenkins-s390x-1’ doesn’t have label ‘ubuntu’
‘lucene-solr-2’ doesn’t have label ‘ubuntu’
‘openwhisk1’ doesn’t have label ‘ubuntu’
‘plc4x2’ doesn’t have label ‘ubuntu’
Running on builds48 in /home/jenkins/workspace/Kafka_kafka_3.7
[Pipeline] {
[Pipeline] step