You are viewing a plain text version of this content. The canonical link for it is here.
Posted to yarn-dev@hadoop.apache.org by Apache Jenkins Server <je...@builds.apache.org> on 2015/03/04 22:10:51 UTC
Failed: YARN-3267 PreCommit Build #6842
Jira: https://issues.apache.org/jira/browse/YARN-3267
Build: https://builds.apache.org/job/PreCommit-YARN-Build/6842/
###################################################################################
########################## LAST 60 LINES OF THE CONSOLE ###########################
[...truncated 3951 lines...]
{color:red}-1 overall{color}. Here are the results of testing the latest attachment
http://issues.apache.org/jira/secure/attachment/12702573/YARN_3267_V1.patch
against trunk revision 03cc229.
{color:green}+1 @author{color}. The patch does not contain any @author tags.
{color:green}+1 tests included{color}. The patch appears to include 5 new or modified test files.
{color:green}+1 javac{color}. The applied patch does not increase the total number of javac compiler warnings.
{color:green}+1 javadoc{color}. There were no new javadoc warning messages.
{color:green}+1 eclipse:eclipse{color}. The patch built with eclipse:eclipse.
{color:green}+1 findbugs{color}. The patch does not introduce any new Findbugs (version 2.0.3) warnings.
{color:green}+1 release audit{color}. The applied patch does not increase the total number of release audit warnings.
{color:red}-1 core tests{color}. The patch failed these unit tests in hadoop-mapreduce-project/hadoop-mapreduce-client/hadoop-mapreduce-client-app hadoop-mapreduce-project/hadoop-mapreduce-client/hadoop-mapreduce-client-jobclient hadoop-yarn-project/hadoop-yarn/hadoop-yarn-applications/hadoop-yarn-applications-distributedshell hadoop-yarn-project/hadoop-yarn/hadoop-yarn-server/hadoop-yarn-server-applicationhistoryservice:
org.apache.hadoop.yarn.server.timeline.TestLeveldbTimelineStore
Test results: https://builds.apache.org/job/PreCommit-YARN-Build/6842//testReport/
Console output: https://builds.apache.org/job/PreCommit-YARN-Build/6842//console
This message is automatically generated.
======================================================================
======================================================================
Adding comment to Jira.
======================================================================
======================================================================
Comment added.
ce9c0ec35daff49233e56845494e15b607b7e462 logged out
======================================================================
======================================================================
Finished build.
======================================================================
======================================================================
Build step 'Execute shell' marked build as failure
Archiving artifacts
Sending artifact delta relative to PreCommit-YARN-Build #6830
Archived 30 artifacts
Archive block size is 32768
Received 45 blocks and 7651000 bytes
Compression is 16.2%
Took 1.6 sec
[description-setter] Could not determine description.
Recording test results
Email was triggered for: Failure
Sending email for trigger: Failure
###################################################################################
############################## FAILED TESTS (if any) ##############################
2 tests failed.
FAILED: org.apache.hadoop.yarn.server.timeline.TestLeveldbTimelineStore.testDeleteEntities
Error Message:
expected:<5> but was:<6>
Stack Trace:
java.lang.AssertionError: expected:<5> but was:<6>
at org.junit.Assert.fail(Assert.java:88)
at org.junit.Assert.failNotEquals(Assert.java:743)
at org.junit.Assert.assertEquals(Assert.java:118)
at org.junit.Assert.assertEquals(Assert.java:555)
at org.junit.Assert.assertEquals(Assert.java:542)
at org.apache.hadoop.yarn.server.timeline.TestLeveldbTimelineStore.testDeleteEntities(TestLeveldbTimelineStore.java:204)
FAILED: org.apache.hadoop.yarn.server.timeline.TestLeveldbTimelineStore.testGetEntityTypes
Error Message:
expected:<6> but was:<7>
Stack Trace:
java.lang.AssertionError: expected:<6> but was:<7>
at org.junit.Assert.fail(Assert.java:88)
at org.junit.Assert.failNotEquals(Assert.java:743)
at org.junit.Assert.assertEquals(Assert.java:118)
at org.junit.Assert.assertEquals(Assert.java:555)
at org.junit.Assert.assertEquals(Assert.java:542)
at org.apache.hadoop.yarn.server.timeline.TestLeveldbTimelineStore.testGetEntityTypes(TestLeveldbTimelineStore.java:167)