You are viewing a plain text version of this content. The canonical link for it is here.
Posted to builds@beam.apache.org by Apache Jenkins Server <je...@builds.apache.org> on 2022/12/09 05:03:41 UTC
Build failed in Jenkins: beam_PreCommit_PythonDocker_Cron #3875
See <https://ci-beam.apache.org/job/beam_PreCommit_PythonDocker_Cron/3875/display/redirect?page=changes>
Changes:
[Kenneth Knowles] Turn rawtype checking back on for core Java SDK
[Kenneth Knowles] Eliminate null errors from JdbcIO
[noreply] docs(fix): Filter.whereFieldName(s?) ->
[hiandyzhang] ElasticsearchIO: Lower log level in flushBatch to avoid noisy log
------------------------------------------
[...truncated 15.17 KB...]
:buildSrc:compileJava (Thread[Execution worker Thread 7,5,main]) completed. Took 0.045 secs.
Resolve mutations for :buildSrc:compileGroovy (Thread[Execution worker Thread 6,5,main]) started.
Resolve mutations for :buildSrc:compileGroovy (Thread[Execution worker Thread 6,5,main]) completed. Took 0.001 secs.
:buildSrc:compileGroovy (Thread[Execution worker,5,main]) started.
> Task :buildSrc:compileGroovy FROM-CACHE
Build cache key for task ':buildSrc:compileGroovy' is 918d37e0ace5885738a60012e12e64b7
Task ':buildSrc:compileGroovy' is not up-to-date because:
No history is available.
Loaded cache entry for task ':buildSrc:compileGroovy' with cache key 918d37e0ace5885738a60012e12e64b7
:buildSrc:compileGroovy (Thread[Execution worker,5,main]) completed. Took 0.186 secs.
Resolve mutations for :buildSrc:pluginDescriptors (Thread[included builds,5,main]) started.
Resolve mutations for :buildSrc:pluginDescriptors (Thread[included builds,5,main]) completed. Took 0.0 secs.
:buildSrc:pluginDescriptors (Thread[Execution worker Thread 4,5,main]) started.
> Task :buildSrc:pluginDescriptors
Caching disabled for task ':buildSrc:pluginDescriptors' because:
Not worth caching
Task ':buildSrc:pluginDescriptors' is not up-to-date because:
No history is available.
:buildSrc:pluginDescriptors (Thread[Execution worker Thread 4,5,main]) completed. Took 0.024 secs.
Resolve mutations for :buildSrc:processResources (Thread[Execution worker Thread 3,5,main]) started.
Resolve mutations for :buildSrc:processResources (Thread[Execution worker Thread 3,5,main]) completed. Took 0.0 secs.
:buildSrc:processResources (Thread[included builds,5,main]) started.
> Task :buildSrc:processResources
Caching disabled for task ':buildSrc:processResources' because:
Not worth caching
Task ':buildSrc:processResources' is not up-to-date because:
No history is available.
file or directory '<https://ci-beam.apache.org/job/beam_PreCommit_PythonDocker_Cron/ws/src/buildSrc/src/main/resources',> not found
:buildSrc:processResources (Thread[included builds,5,main]) completed. Took 0.035 secs.
Resolve mutations for :buildSrc:classes (Thread[Execution worker Thread 4,5,main]) started.
Resolve mutations for :buildSrc:classes (Thread[Execution worker Thread 4,5,main]) completed. Took 0.0 secs.
:buildSrc:classes (Thread[Execution worker Thread 3,5,main]) started.
> Task :buildSrc:classes
Skipping task ':buildSrc:classes' as it has no actions.
:buildSrc:classes (Thread[Execution worker Thread 3,5,main]) completed. Took 0.0 secs.
Resolve mutations for :buildSrc:jar (Thread[included builds,5,main]) started.
Resolve mutations for :buildSrc:jar (Thread[included builds,5,main]) completed. Took 0.0 secs.
:buildSrc:jar (Thread[Execution worker Thread 2,5,main]) started.
> Task :buildSrc:jar
Caching disabled for task ':buildSrc:jar' because:
Not worth caching
Task ':buildSrc:jar' is not up-to-date because:
No history is available.
file or directory '<https://ci-beam.apache.org/job/beam_PreCommit_PythonDocker_Cron/ws/src/buildSrc/build/classes/java/main',> not found
:buildSrc:jar (Thread[Execution worker Thread 2,5,main]) completed. Took 0.163 secs.
Resolve mutations for :buildSrc:assemble (Thread[Execution worker Thread 7,5,main]) started.
Resolve mutations for :buildSrc:assemble (Thread[Execution worker Thread 7,5,main]) completed. Took 0.0 secs.
:buildSrc:assemble (Thread[Execution worker Thread 3,5,main]) started.
> Task :buildSrc:assemble
Skipping task ':buildSrc:assemble' as it has no actions.
:buildSrc:assemble (Thread[Execution worker Thread 3,5,main]) completed. Took 0.0 secs.
Resolve mutations for :buildSrc:spotlessGroovy (Thread[included builds,5,main]) started.
Resolve mutations for :buildSrc:spotlessGroovy (Thread[included builds,5,main]) completed. Took 0.0 secs.
:buildSrc:spotlessGroovy (Thread[Execution worker Thread 2,5,main]) started.
> Task :buildSrc:spotlessGroovy FROM-CACHE
file or directory '<https://ci-beam.apache.org/job/beam_PreCommit_PythonDocker_Cron/ws/src/buildSrc/src/test/groovy',> not found
file or directory '<https://ci-beam.apache.org/job/beam_PreCommit_PythonDocker_Cron/ws/src/buildSrc/src/test/groovy',> not found
Build cache key for task ':buildSrc:spotlessGroovy' is 5823cfe3840142d0a4596946780c3f91
Task ':buildSrc:spotlessGroovy' is not up-to-date because:
No history is available.
Loaded cache entry for task ':buildSrc:spotlessGroovy' with cache key 5823cfe3840142d0a4596946780c3f91
:buildSrc:spotlessGroovy (Thread[Execution worker Thread 2,5,main]) completed. Took 0.358 secs.
Resolve mutations for :buildSrc:spotlessGroovyCheck (Thread[Execution worker,5,main]) started.
Resolve mutations for :buildSrc:spotlessGroovyCheck (Thread[Execution worker,5,main]) completed. Took 0.0 secs.
:buildSrc:spotlessGroovyCheck (Thread[included builds,5,main]) started.
> Task :buildSrc:spotlessGroovyCheck UP-TO-DATE
Caching disabled for task ':buildSrc:spotlessGroovyCheck' because:
Caching has not been enabled for the task
Task ':buildSrc:spotlessGroovyCheck' is not up-to-date because:
Task has not declared any outputs despite executing actions.
:buildSrc:spotlessGroovyCheck (Thread[included builds,5,main]) completed. Took 0.004 secs.
Resolve mutations for :buildSrc:spotlessGroovyGradle (Thread[Execution worker Thread 4,5,main]) started.
Resolve mutations for :buildSrc:spotlessGroovyGradle (Thread[Execution worker Thread 4,5,main]) completed. Took 0.0 secs.
:buildSrc:spotlessGroovyGradle (Thread[Execution worker Thread 2,5,main]) started.
> Task :buildSrc:spotlessGroovyGradle FROM-CACHE
Build cache key for task ':buildSrc:spotlessGroovyGradle' is c435f3641f18d05db3698258304e45bc
Task ':buildSrc:spotlessGroovyGradle' is not up-to-date because:
No history is available.
Loaded cache entry for task ':buildSrc:spotlessGroovyGradle' with cache key c435f3641f18d05db3698258304e45bc
:buildSrc:spotlessGroovyGradle (Thread[Execution worker Thread 2,5,main]) completed. Took 0.014 secs.
Resolve mutations for :buildSrc:spotlessGroovyGradleCheck (Thread[Execution worker Thread 5,5,main]) started.
Resolve mutations for :buildSrc:spotlessGroovyGradleCheck (Thread[Execution worker Thread 5,5,main]) completed. Took 0.0 secs.
:buildSrc:spotlessGroovyGradleCheck (Thread[Execution worker Thread 4,5,main]) started.
> Task :buildSrc:spotlessGroovyGradleCheck UP-TO-DATE
Caching disabled for task ':buildSrc:spotlessGroovyGradleCheck' because:
Caching has not been enabled for the task
Task ':buildSrc:spotlessGroovyGradleCheck' is not up-to-date because:
Task has not declared any outputs despite executing actions.
:buildSrc:spotlessGroovyGradleCheck (Thread[Execution worker Thread 4,5,main]) completed. Took 0.003 secs.
Resolve mutations for :buildSrc:spotlessCheck (Thread[Execution worker Thread 2,5,main]) started.
Resolve mutations for :buildSrc:spotlessCheck (Thread[Execution worker Thread 2,5,main]) completed. Took 0.0 secs.
:buildSrc:spotlessCheck (Thread[Execution worker Thread 5,5,main]) started.
> Task :buildSrc:spotlessCheck UP-TO-DATE
Skipping task ':buildSrc:spotlessCheck' as it has no actions.
:buildSrc:spotlessCheck (Thread[Execution worker Thread 5,5,main]) completed. Took 0.0 secs.
Resolve mutations for :buildSrc:pluginUnderTestMetadata (Thread[Execution worker Thread 4,5,main]) started.
Resolve mutations for :buildSrc:pluginUnderTestMetadata (Thread[Execution worker Thread 4,5,main]) completed. Took 0.0 secs.
:buildSrc:pluginUnderTestMetadata (Thread[Execution worker Thread 2,5,main]) started.
> Task :buildSrc:pluginUnderTestMetadata
Caching disabled for task ':buildSrc:pluginUnderTestMetadata' because:
Not worth caching
Task ':buildSrc:pluginUnderTestMetadata' is not up-to-date because:
No history is available.
:buildSrc:pluginUnderTestMetadata (Thread[Execution worker Thread 2,5,main]) completed. Took 0.277 secs.
Resolve mutations for :buildSrc:compileTestJava (Thread[Execution worker Thread 3,5,main]) started.
Resolve mutations for :buildSrc:compileTestJava (Thread[Execution worker Thread 3,5,main]) completed. Took 0.001 secs.
:buildSrc:compileTestJava (Thread[Execution worker Thread 7,5,main]) started.
> Task :buildSrc:compileTestJava NO-SOURCE
Skipping task ':buildSrc:compileTestJava' as it has no source files and no previous output files.
:buildSrc:compileTestJava (Thread[Execution worker Thread 7,5,main]) completed. Took 0.001 secs.
Resolve mutations for :buildSrc:compileTestGroovy (Thread[included builds,5,main]) started.
Resolve mutations for :buildSrc:compileTestGroovy (Thread[included builds,5,main]) completed. Took 0.001 secs.
:buildSrc:compileTestGroovy (Thread[Execution worker,5,main]) started.
> Task :buildSrc:compileTestGroovy NO-SOURCE
Skipping task ':buildSrc:compileTestGroovy' as it has no source files and no previous output files.
:buildSrc:compileTestGroovy (Thread[Execution worker,5,main]) completed. Took 0.001 secs.
Resolve mutations for :buildSrc:processTestResources (Thread[Execution worker Thread 3,5,main]) started.
Resolve mutations for :buildSrc:processTestResources (Thread[Execution worker Thread 3,5,main]) completed. Took 0.0 secs.
:buildSrc:processTestResources (Thread[included builds,5,main]) started.
> Task :buildSrc:processTestResources NO-SOURCE
Skipping task ':buildSrc:processTestResources' as it has no source files and no previous output files.
:buildSrc:processTestResources (Thread[included builds,5,main]) completed. Took 0.002 secs.
Resolve mutations for :buildSrc:testClasses (Thread[Execution worker Thread 7,5,main]) started.
Resolve mutations for :buildSrc:testClasses (Thread[Execution worker Thread 7,5,main]) completed. Took 0.0 secs.
:buildSrc:testClasses (Thread[Execution worker Thread 6,5,main]) started.
> Task :buildSrc:testClasses UP-TO-DATE
Skipping task ':buildSrc:testClasses' as it has no actions.
:buildSrc:testClasses (Thread[Execution worker Thread 6,5,main]) completed. Took 0.0 secs.
Resolve mutations for :buildSrc:test (Thread[Execution worker Thread 3,5,main]) started.
Resolve mutations for :buildSrc:test (Thread[Execution worker Thread 3,5,main]) completed. Took 0.0 secs.
:buildSrc:test (Thread[Execution worker Thread 7,5,main]) started.
> Task :buildSrc:test NO-SOURCE
Skipping task ':buildSrc:test' as it has no source files and no previous output files.
:buildSrc:test (Thread[Execution worker Thread 7,5,main]) completed. Took 0.001 secs.
Resolve mutations for :buildSrc:validatePlugins (Thread[Execution worker,5,main]) started.
Resolve mutations for :buildSrc:validatePlugins (Thread[Execution worker,5,main]) completed. Took 0.0 secs.
:buildSrc:validatePlugins (Thread[Execution worker Thread 3,5,main]) started.
producer locations for task group 0 (Thread[Execution worker Thread 6,5,main]) started.
producer locations for task group 0 (Thread[Execution worker Thread 6,5,main]) completed. Took 0.0 secs.
> Task :buildSrc:validatePlugins FROM-CACHE
Build cache key for task ':buildSrc:validatePlugins' is 65c7924d48af5789466189d62f313f0c
Task ':buildSrc:validatePlugins' is not up-to-date because:
No history is available.
Loaded cache entry for task ':buildSrc:validatePlugins' with cache key 65c7924d48af5789466189d62f313f0c
:buildSrc:validatePlugins (Thread[Execution worker Thread 3,5,main]) completed. Took 0.01 secs.
Resolve mutations for :buildSrc:check (Thread[Execution worker Thread 7,5,main]) started.
Resolve mutations for :buildSrc:check (Thread[Execution worker Thread 7,5,main]) completed. Took 0.0 secs.
:buildSrc:check (Thread[Execution worker,5,main]) started.
> Task :buildSrc:check UP-TO-DATE
Skipping task ':buildSrc:check' as it has no actions.
:buildSrc:check (Thread[Execution worker,5,main]) completed. Took 0.0 secs.
Resolve mutations for :buildSrc:build (Thread[included builds,5,main]) started.
Resolve mutations for :buildSrc:build (Thread[included builds,5,main]) completed. Took 0.0 secs.
:buildSrc:build (Thread[Execution worker Thread 7,5,main]) started.
> Task :buildSrc:build
Skipping task ':buildSrc:build' as it has no actions.
:buildSrc:build (Thread[Execution worker Thread 7,5,main]) completed. Took 0.0 secs.
Project name matched ':'
> Configure project :
Evaluating root project 'beam' using build file '<https://ci-beam.apache.org/job/beam_PreCommit_PythonDocker_Cron/ws/src/build.gradle.kts'.>
Build cache key for Kotlin DSL plugin accessors for classpath '6b01e48386b57f627e514534070d2ed9' is 78a14b2c578b3b2ae2df0f5f3b138133
Skipping Kotlin DSL plugin accessors for classpath '6b01e48386b57f627e514534070d2ed9' as it is up-to-date.
Build cache key for Kotlin DSL script compilation (Project/TopLevel/stage1) is 81915b4deb145b93e4937be6e0484174
Skipping Kotlin DSL script compilation (Project/TopLevel/stage1) as it is up-to-date.
Offline dependencies root configured at 'offline-repository'
Build cache key for Kotlin DSL accessors for root project 'beam' is b8f41141128e4853154489000631ad76
Skipping Kotlin DSL accessors for root project 'beam' as it is up-to-date.
Build cache key for Kotlin DSL script compilation (Project/TopLevel/stage2) is 4922f9619dd2f2f3b55970fffc62a734
Skipping Kotlin DSL script compilation (Project/TopLevel/stage2) as it is up-to-date.
Task name matched 'pythonDockerBuildPreCommit'
Selected primary task ':pythonDockerBuildPreCommit' from project :
> Configure project :sdks:python:container:py39
Evaluating project ':sdks:python:container:py39' using build file '<https://ci-beam.apache.org/job/beam_PreCommit_PythonDocker_Cron/ws/src/sdks/python/container/py39/build.gradle'.>
Offline dependencies root configured at 'offline-repository'
> Configure project :sdks:python:container:py38
Evaluating project ':sdks:python:container:py38' using build file '<https://ci-beam.apache.org/job/beam_PreCommit_PythonDocker_Cron/ws/src/sdks/python/container/py38/build.gradle'.>
Offline dependencies root configured at 'offline-repository'
> Configure project :sdks:python:container:py37
Evaluating project ':sdks:python:container:py37' using build file '<https://ci-beam.apache.org/job/beam_PreCommit_PythonDocker_Cron/ws/src/sdks/python/container/py37/build.gradle'.>
Offline dependencies root configured at 'offline-repository'
> Configure project :sdks:python:container:py310
Evaluating project ':sdks:python:container:py310' using build file '<https://ci-beam.apache.org/job/beam_PreCommit_PythonDocker_Cron/ws/src/sdks/python/container/py310/build.gradle'.>
Offline dependencies root configured at 'offline-repository'
> Configure project :sdks
Evaluating project ':sdks' using build file '<https://ci-beam.apache.org/job/beam_PreCommit_PythonDocker_Cron/ws/src/sdks/build.gradle'.>
> Configure project :sdks:python
Evaluating project ':sdks:python' using build file '<https://ci-beam.apache.org/job/beam_PreCommit_PythonDocker_Cron/ws/src/sdks/python/build.gradle'.>
Offline dependencies root configured at 'offline-repository'
> Configure project :sdks:python:container
Evaluating project ':sdks:python:container' using build file '<https://ci-beam.apache.org/job/beam_PreCommit_PythonDocker_Cron/ws/src/sdks/python/container/build.gradle'.>
Offline dependencies root configured at 'offline-repository'
> Configure project :release:go-licenses:py
Evaluating project ':release:go-licenses:py' using build file '<https://ci-beam.apache.org/job/beam_PreCommit_PythonDocker_Cron/ws/src/release/go-licenses/py/build.gradle'.>
Offline dependencies root configured at 'offline-repository'
Starting process 'command 'sh''. Working directory: <https://ci-beam.apache.org/job/beam_PreCommit_PythonDocker_Cron/ws/src/sdks/python/container> Command: sh -c <https://ci-beam.apache.org/job/beam_PreCommit_PythonDocker_Cron/ws/src/sdks/go/prepare_go_version.sh> --version go1.19.3
Successfully started process 'command 'sh''
System Go installation: /snap/bin/go is go version go1.16.15 linux/amd64; Preparing to use /home/jenkins/go/bin/go1.19.3
go install golang.org/dl/go1.19.3@latest: no matching versions for query "latest"
FAILURE: Build failed with an exception.
* What went wrong:
Could not determine the dependencies of task ':sdks:python:container:goBuild'.
> Could not create task ':sdks:python:container:goPrepare'.
> Process 'command 'sh'' finished with non-zero exit value 1
* Try:
> Run with --stacktrace option to get the stack trace.
> Run with --debug option to get more log output.
* Get more help at https://help.gradle.org
BUILD FAILED in 1m 10s
10 actionable tasks: 4 executed, 4 from cache, 2 up-to-date
Publishing build scan...
https://gradle.com/s/47tg4hqxwmica
Build step 'Invoke Gradle script' changed build result to FAILURE
Build step 'Invoke Gradle script' marked build as failure
---------------------------------------------------------------------
To unsubscribe, e-mail: builds-unsubscribe@beam.apache.org
For additional commands, e-mail: builds-help@beam.apache.org
Jenkins build is back to normal : beam_PreCommit_PythonDocker_Cron #3876
Posted by Apache Jenkins Server <je...@builds.apache.org>.
See <https://ci-beam.apache.org/job/beam_PreCommit_PythonDocker_Cron/3876/display/redirect>
---------------------------------------------------------------------
To unsubscribe, e-mail: builds-unsubscribe@beam.apache.org
For additional commands, e-mail: builds-help@beam.apache.org