You are viewing a plain text version of this content. The canonical link for it is here.
Posted to builds@cassandra.apache.org by Apache Jenkins Server <je...@builds.apache.org> on 2023/03/30 04:34:29 UTC
Build complete: Cassandra-trunk #1510 [FAILURE] 549bf38a073e9b467b1f95223ed0c05f2496c40a
-------------------------------------------------------------------------------
Build Cassandra-trunk #1510 Failure
URL: https://ci-cassandra.apache.org/job/Cassandra-trunk/1510/
-------------------------------------------------------------------------------
Changes:
[Brandon Williams] Remove asf.yaml from non-trunk branches
-------------------------------------------------------------------------------
Failed Tests:
10 tests failed.
FAILED: dtest-upgrade.upgrade_tests.cql_tests.cls.test_delete_row
FAILED: dtest-upgrade.upgrade_tests.cql_tests.cls.test_cas_and_list_index
FAILED: dtest.replace_address_test.TestReplaceAddress.test_fail_without_replace
FAILED: dtest.bootstrap_test.TestBootstrap.test_resumable_bootstrap
FAILED: dtest.replace_address_test.TestReplaceAddress.test_fail_when_seed
FAILED: org.apache.cassandra.distributed.test.ByteBuddyExamplesTest.countTest-.jdk1.8
FAILED: org.apache.cassandra.distributed.test.repair.ForceRepairTest.force
FAILED: org.apache.cassandra.tools.TopPartitionsTest.testStartAndStopScheduledSampling-cdc.jdk1.8
FAILED: org.apache.cassandra.db.RepairedDataTombstonesTest.readTestPartitionTombstones-cdc.jdk11
FAILED: org.apache.cassandra.utils.bytecomparable.ByteSourceComparisonTest.testPatitionerDefinedOrder
-------------------------------------------------------------------------------
For complete test report and logs see https://nightlies.apache.org/cassandra/Cassandra-trunk/1510/