You are viewing a plain text version of this content. The canonical link for it is here.
Posted to notifications@cxf.apache.org by Apache Jenkins Server <je...@builds.apache.org> on 2026/10/23 13:47:35 UTC

Build failed in Jenkins: CXF » CXF-4.1.x-fixes-JDK17-deploy #1157

See <https://ci-builds.apache.org/job/CXF/job/CXF-4.1.x-fixes-JDK17-deploy/1157/display/redirect>

Changes:


------------------------------------------
[...truncated 22.69 KiB...]
No mail will be sent out, as 'CXF » CXF-4.1.x-fixes-JDK17-deploy » Apache CXF Distributed Tracing Integration System Tests #1157' does not have a result yet. Please make sure you set a proper result in case of pipeline/build scripts.
No mail will be sent out, as 'CXF » CXF-4.1.x-fixes-JDK17-deploy » Apache CXF STS Core #1157' does not have a result yet. Please make sure you set a proper result in case of pipeline/build scripts.
No mail will be sent out, as 'CXF » CXF-4.1.x-fixes-JDK17-deploy » Apache CXF Integration #1157' does not have a result yet. Please make sure you set a proper result in case of pipeline/build scripts.
No mail will be sent out, as 'CXF » CXF-4.1.x-fixes-JDK17-deploy » JAX-RS Demo Using Distributed Tracing with Micrometer Observation #1157' does not have a result yet. Please make sure you set a proper result in case of pipeline/build scripts.
No mail will be sent out, as 'CXF » CXF-4.1.x-fixes-JDK17-deploy » JavaScript Client Demo using Document/Literal Style #1157' does not have a result yet. Please make sure you set a proper result in case of pipeline/build scripts.
No mail will be sent out, as 'CXF » CXF-4.1.x-fixes-JDK17-deploy » Apache CXF RS SSO SAML #1157' does not have a result yet. Please make sure you set a proper result in case of pipeline/build scripts.
No mail will be sent out, as 'CXF » CXF-4.1.x-fixes-JDK17-deploy » Apache CXF SSE Integration System Tests for Jetty #1157' does not have a result yet. Please make sure you set a proper result in case of pipeline/build scripts.
No mail will be sent out, as 'CXF » CXF-4.1.x-fixes-JDK17-deploy » Apache CXF CDI Integration System Tests - Weld with producers #1157' does not have a result yet. Please make sure you set a proper result in case of pipeline/build scripts.
No mail will be sent out, as 'CXF » CXF-4.1.x-fixes-JDK17-deploy » Apache CXF JOSE Security parent #1157' does not have a result yet. Please make sure you set a proper result in case of pipeline/build scripts.
No mail will be sent out, as 'CXF » CXF-4.1.x-fixes-JDK17-deploy » Apache CXF RS XML Security #1157' does not have a result yet. Please make sure you set a proper result in case of pipeline/build scripts.
No mail will be sent out, as 'CXF » CXF-4.1.x-fixes-JDK17-deploy » JAX-WS Dispatch/Provider Demo #1157' does not have a result yet. Please make sure you set a proper result in case of pipeline/build scripts.
No mail will be sent out, as 'CXF » CXF-4.1.x-fixes-JDK17-deploy » Apache CXF WSN API #1157' does not have a result yet. Please make sure you set a proper result in case of pipeline/build scripts.
No mail will be sent out, as 'CXF » CXF-4.1.x-fixes-JDK17-deploy » Apache CXF Runtime XML Binding #1157' does not have a result yet. Please make sure you set a proper result in case of pipeline/build scripts.
No mail will be sent out, as 'CXF » CXF-4.1.x-fixes-JDK17-deploy » Apache CXF Runtime Management #1157' does not have a result yet. Please make sure you set a proper result in case of pipeline/build scripts.
No mail will be sent out, as 'CXF » CXF-4.1.x-fixes-JDK17-deploy » Apache CXF Command Line Tools WADLTo JAXRS Frontend #1157' does not have a result yet. Please make sure you set a proper result in case of pipeline/build scripts.
No mail will be sent out, as 'CXF » CXF-4.1.x-fixes-JDK17-deploy » Apache CXF SSE Integration System Tests for Tomcat #1157' does not have a result yet. Please make sure you set a proper result in case of pipeline/build scripts.
No mail will be sent out, as 'CXF » CXF-4.1.x-fixes-JDK17-deploy » Spring HTTP Servlet demo with groovy support #1157' does not have a result yet. Please make sure you set a proper result in case of pipeline/build scripts.
No mail will be sent out, as 'CXF » CXF-4.1.x-fixes-JDK17-deploy » Sample of JAX-* Service Using an Aegis Client #1157' does not have a result yet. Please make sure you set a proper result in case of pipeline/build scripts.
No mail will be sent out, as 'CXF » CXF-4.1.x-fixes-JDK17-deploy » JAX-RS Demo Using Distributed Tracing with OpenTracing API and Jaeger #1157' does not have a result yet. Please make sure you set a proper result in case of pipeline/build scripts.
No mail will be sent out, as 'CXF » CXF-4.1.x-fixes-JDK17-deploy » Eureka Registry for CXF SpringBoot demos #1157' does not have a result yet. Please make sure you set a proper result in case of pipeline/build scripts.
No mail will be sent out, as 'CXF » CXF-4.1.x-fixes-JDK17-deploy » Apache CXF Spring Boot Autoconfigure #1157' does not have a result yet. Please make sure you set a proper result in case of pipeline/build scripts.
No mail will be sent out, as 'CXF » CXF-4.1.x-fixes-JDK17-deploy » JAX-RS Basic Demo #1157' does not have a result yet. Please make sure you set a proper result in case of pipeline/build scripts.
No mail will be sent out, as 'CXF » CXF-4.1.x-fixes-JDK17-deploy » Apache CXF Command Line Tools WADLTo #1157' does not have a result yet. Please make sure you set a proper result in case of pipeline/build scripts.
No mail will be sent out, as 'CXF » CXF-4.1.x-fixes-JDK17-deploy » JAX-RS Demo Using Distributed Tracing with OpenZipkin Brave #1157' does not have a result yet. Please make sure you set a proper result in case of pipeline/build scripts.
No mail will be sent out, as 'CXF » CXF-4.1.x-fixes-JDK17-deploy » Apache CXF MicroProfile Tracing integration Sys Tests #1157' does not have a result yet. Please make sure you set a proper result in case of pipeline/build scripts.
No mail will be sent out, as 'CXF » CXF-4.1.x-fixes-JDK17-deploy » Hello World Client Demo using JavaScript #1157' does not have a result yet. Please make sure you set a proper result in case of pipeline/build scripts.
No mail will be sent out, as 'CXF » CXF-4.1.x-fixes-JDK17-deploy » Apache CXF JAX-RS Servlet Container Initializer #1157' does not have a result yet. Please make sure you set a proper result in case of pipeline/build scripts.
No mail will be sent out, as 'CXF » CXF-4.1.x-fixes-JDK17-deploy » Apache CXF WS-Transfer System Tests #1157' does not have a result yet. Please make sure you set a proper result in case of pipeline/build scripts.
No mail will be sent out, as 'CXF » CXF-4.1.x-fixes-JDK17-deploy » JAX-RS Basic Oidc Demo #1157' does not have a result yet. Please make sure you set a proper result in case of pipeline/build scripts.
No mail will be sent out, as 'CXF » CXF-4.1.x-fixes-JDK17-deploy » Apache CXF Runtime WS Addressing #1157' does not have a result yet. Please make sure you set a proper result in case of pipeline/build scripts.
No mail will be sent out, as 'CXF » CXF-4.1.x-fixes-JDK17-deploy » Apache CXF Command Line Tools WSDLTo #1157' does not have a result yet. Please make sure you set a proper result in case of pipeline/build scripts.
No mail will be sent out, as 'CXF » CXF-4.1.x-fixes-JDK17-deploy » JAX-RS Spring Security Demo #1157' does not have a result yet. Please make sure you set a proper result in case of pipeline/build scripts.
No mail will be sent out, as 'CXF » CXF-4.1.x-fixes-JDK17-deploy » Apache CXF BOM #1157' does not have a result yet. Please make sure you set a proper result in case of pipeline/build scripts.
No mail will be sent out, as 'CXF » CXF-4.1.x-fixes-JDK17-deploy » Apache CXF Command Line Tools WSDL to JavaScript Front End #1157' does not have a result yet. Please make sure you set a proper result in case of pipeline/build scripts.
No mail will be sent out, as 'CXF » CXF-4.1.x-fixes-JDK17-deploy » JAX-RS Basic Demo #1157' does not have a result yet. Please make sure you set a proper result in case of pipeline/build scripts.
No mail will be sent out, as 'CXF » CXF-4.1.x-fixes-JDK17-deploy » CXF WS-Security UT Demo #1157' does not have a result yet. Please make sure you set a proper result in case of pipeline/build scripts.
No mail will be sent out, as 'CXF » CXF-4.1.x-fixes-JDK17-deploy » WS-SecurityPolicy UT Demo #1157' does not have a result yet. Please make sure you set a proper result in case of pipeline/build scripts.
No mail will be sent out, as 'CXF » CXF-4.1.x-fixes-JDK17-deploy » Apache CXF Runtime Local Transport #1157' does not have a result yet. Please make sure you set a proper result in case of pipeline/build scripts.
No mail will be sent out, as 'CXF » CXF-4.1.x-fixes-JDK17-deploy » Spring Boot CXF Web Services Sample #1157' does not have a result yet. Please make sure you set a proper result in case of pipeline/build scripts.
No mail will be sent out, as 'CXF » CXF-4.1.x-fixes-JDK17-deploy » CXF sample using WRAPPED Style in XML Binding (pure XML over HTTP) #1157' does not have a result yet. Please make sure you set a proper result in case of pipeline/build scripts.
No mail will be sent out, as 'CXF » CXF-4.1.x-fixes-JDK17-deploy » CXF Sample of Stream GZIP Interceptor #1157' does not have a result yet. Please make sure you set a proper result in case of pipeline/build scripts.
No mail will be sent out, as 'CXF » CXF-4.1.x-fixes-JDK17-deploy » Java First demo service using the JAXWSFactoryBeans #1157' does not have a result yet. Please make sure you set a proper result in case of pipeline/build scripts.
No mail will be sent out, as 'CXF » CXF-4.1.x-fixes-JDK17-deploy » Hello world javascript demo #1157' does not have a result yet. Please make sure you set a proper result in case of pipeline/build scripts.
No mail will be sent out, as 'CXF » CXF-4.1.x-fixes-JDK17-deploy » Apache CXF Runtime JAX-RS Frontend #1157' does not have a result yet. Please make sure you set a proper result in case of pipeline/build scripts.
No mail will be sent out, as 'CXF » CXF-4.1.x-fixes-JDK17-deploy » Apache CXF JAX-RS Extensions: Project Reactor #1157' does not have a result yet. Please make sure you set a proper result in case of pipeline/build scripts.
No mail will be sent out, as 'CXF » CXF-4.1.x-fixes-JDK17-deploy » Apache CXF JAX-RS Service Description OpenAPI v3 #1157' does not have a result yet. Please make sure you set a proper result in case of pipeline/build scripts.
No mail will be sent out, as 'CXF » CXF-4.1.x-fixes-JDK17-deploy » WS-Eventing Demo #1157' does not have a result yet. Please make sure you set a proper result in case of pipeline/build scripts.
No mail will be sent out, as 'CXF » CXF-4.1.x-fixes-JDK17-deploy » Apache CXF JAX-RS Extensions: Search #1157' does not have a result yet. Please make sure you set a proper result in case of pipeline/build scripts.
No mail will be sent out, as 'CXF » CXF-4.1.x-fixes-JDK17-deploy » Apache CXF JAX-RS Service Description #1157' does not have a result yet. Please make sure you set a proper result in case of pipeline/build scripts.
No mail will be sent out, as 'CXF » CXF-4.1.x-fixes-JDK17-deploy » Apache CXF Runtime Bindings #1157' does not have a result yet. Please make sure you set a proper result in case of pipeline/build scripts.
No mail will be sent out, as 'CXF » CXF-4.1.x-fixes-JDK17-deploy » Apache CXF MicroProfile JAX-RS integration Sys Tests #1157' does not have a result yet. Please make sure you set a proper result in case of pipeline/build scripts.
No mail will be sent out, as 'CXF » CXF-4.1.x-fixes-JDK17-deploy » JAX-WS GraalVM Demo #1157' does not have a result yet. Please make sure you set a proper result in case of pipeline/build scripts.
No mail will be sent out, as 'CXF » CXF-4.1.x-fixes-JDK17-deploy » JMS Transport Publish/Subscribe Demo using Document-Literal Style #1157' does not have a result yet. Please make sure you set a proper result in case of pipeline/build scripts.
No mail will be sent out, as 'CXF » CXF-4.1.x-fixes-JDK17-deploy » Bank sample using JAX-WS API's to talk via CORBA/IIOP #1157' does not have a result yet. Please make sure you set a proper result in case of pipeline/build scripts.
No mail will be sent out, as 'CXF » CXF-4.1.x-fixes-JDK17-deploy » JAX-RS Open API 3.0 Demo #1157' does not have a result yet. Please make sure you set a proper result in case of pipeline/build scripts.
No mail will be sent out, as 'CXF » CXF-4.1.x-fixes-JDK17-deploy » Apache CXF Spring Boot Starter JAX-RS #1157' does not have a result yet. Please make sure you set a proper result in case of pipeline/build scripts.
No mail will be sent out, as 'CXF » CXF-4.1.x-fixes-JDK17-deploy » Apache CXF Java2WADL Maven2 Plugin #1157' does not have a result yet. Please make sure you set a proper result in case of pipeline/build scripts.
No mail will be sent out, as 'CXF » CXF-4.1.x-fixes-JDK17-deploy » Apache CXF Container Integration Test Grizzly #1157' does not have a result yet. Please make sure you set a proper result in case of pipeline/build scripts.
No mail will be sent out, as 'CXF » CXF-4.1.x-fixes-JDK17-deploy » Apache CXF Runtime CORBA Binding #1157' does not have a result yet. Please make sure you set a proper result in case of pipeline/build scripts.
No mail will be sent out, as 'CXF » CXF-4.1.x-fixes-JDK17-deploy » Apache CXF Runtime Http-Signature #1157' does not have a result yet. Please make sure you set a proper result in case of pipeline/build scripts.
No mail will be sent out, as 'CXF » CXF-4.1.x-fixes-JDK17-deploy » Generated JavaScript Sample using JAX-WS and JSR-181 #1157' does not have a result yet. Please make sure you set a proper result in case of pipeline/build scripts.
No mail will be sent out, as 'CXF » CXF-4.1.x-fixes-JDK17-deploy » JAX-WS GraalVM Demo (capture generated classes) #1157' does not have a result yet. Please make sure you set a proper result in case of pipeline/build scripts.
No mail will be sent out, as 'CXF » CXF-4.1.x-fixes-JDK17-deploy » Apache CXF Maven Archetypes #1157' does not have a result yet. Please make sure you set a proper result in case of pipeline/build scripts.
No mail will be sent out, as 'CXF » CXF-4.1.x-fixes-JDK17-deploy » Apache CXF MicroProfile Async Sys Tests #1157' does not have a result yet. Please make sure you set a proper result in case of pipeline/build scripts.
No mail will be sent out, as 'CXF » CXF-4.1.x-fixes-JDK17-deploy » Apache CXF Runtime SOAP Binding #1157' does not have a result yet. Please make sure you set a proper result in case of pipeline/build scripts.
No mail will be sent out, as 'CXF » CXF-4.1.x-fixes-JDK17-deploy » Apache CXF WSN service #1157' does not have a result yet. Please make sure you set a proper result in case of pipeline/build scripts.
No mail will be sent out, as 'CXF » CXF-4.1.x-fixes-JDK17-deploy » Apache CXF JAX-RS Service Description Microprofile OpenAPI #1157' does not have a result yet. Please make sure you set a proper result in case of pipeline/build scripts.
No mail will be sent out, as 'CXF » CXF-4.1.x-fixes-JDK17-deploy » Apache CXF STS service #1157' does not have a result yet. Please make sure you set a proper result in case of pipeline/build scripts.
No mail will be sent out, as 'CXF » CXF-4.1.x-fixes-JDK17-deploy » Apache CXF Runtime OpenId Connect #1157' does not have a result yet. Please make sure you set a proper result in case of pipeline/build scripts.
No mail will be sent out, as 'CXF » CXF-4.1.x-fixes-JDK17-deploy » Apache CXF MicroProfile TCKs #1157' does not have a result yet. Please make sure you set a proper result in case of pipeline/build scripts.
No mail will be sent out, as 'CXF » CXF-4.1.x-fixes-JDK17-deploy » Apache CXF Runtime WS Transfer #1157' does not have a result yet. Please make sure you set a proper result in case of pipeline/build scripts.
No mail will be sent out, as 'CXF » CXF-4.1.x-fixes-JDK17-deploy » Apache CXF JAX-RS Extensions: Reactive Streams #1157' does not have a result yet. Please make sure you set a proper result in case of pipeline/build scripts.
No mail will be sent out, as 'CXF » CXF-4.1.x-fixes-JDK17-deploy » Apache CXF Uncategorized System Tests #1157' does not have a result yet. Please make sure you set a proper result in case of pipeline/build scripts.
No mail will be sent out, as 'CXF » CXF-4.1.x-fixes-JDK17-deploy » Apache CXF Runtime Core for WSDL #1157' does not have a result yet. Please make sure you set a proper result in case of pipeline/build scripts.
No mail will be sent out, as 'CXF » CXF-4.1.x-fixes-JDK17-deploy » Apache CXF XKMS Service #1157' does not have a result yet. Please make sure you set a proper result in case of pipeline/build scripts.
No mail will be sent out, as 'CXF » CXF-4.1.x-fixes-JDK17-deploy » Apache CXF Command Line Tools Common #1157' does not have a result yet. Please make sure you set a proper result in case of pipeline/build scripts.
No mail will be sent out, as 'CXF » CXF-4.1.x-fixes-JDK17-deploy » Apache CXF Command Line Tools WSDLTo Core #1157' does not have a result yet. Please make sure you set a proper result in case of pipeline/build scripts.
No mail will be sent out, as 'CXF » CXF-4.1.x-fixes-JDK17-deploy » Apache CXF Services #1157' does not have a result yet. Please make sure you set a proper result in case of pipeline/build scripts.
No mail will be sent out, as 'CXF » CXF-4.1.x-fixes-JDK17-deploy » Apache CXF JAX-WS System Tests #1157' does not have a result yet. Please make sure you set a proper result in case of pipeline/build scripts.
No mail will be sent out, as 'CXF » CXF-4.1.x-fixes-JDK17-deploy » Apache CXF Command Line Tools WSDLTo JAXWS Frontend #1157' does not have a result yet. Please make sure you set a proper result in case of pipeline/build scripts.
No mail will be sent out, as 'CXF » CXF-4.1.x-fixes-JDK17-deploy » Apache CXF Samples #1157' does not have a result yet. Please make sure you set a proper result in case of pipeline/build scripts.
No mail will be sent out, as 'CXF » CXF-4.1.x-fixes-JDK17-deploy » Spring HTTP Servlet demo with ruby support #1157' does not have a result yet. Please make sure you set a proper result in case of pipeline/build scripts.
No mail will be sent out, as 'CXF » CXF-4.1.x-fixes-JDK17-deploy » Apache CXF JAX-RS Service Description Swagger UI integration #1157' does not have a result yet. Please make sure you set a proper result in case of pipeline/build scripts.
No mail will be sent out, as 'CXF » CXF-4.1.x-fixes-JDK17-deploy » Apache CXF Runtime Clustering #1157' does not have a result yet. Please make sure you set a proper result in case of pipeline/build scripts.
No mail will be sent out, as 'CXF » CXF-4.1.x-fixes-JDK17-deploy » Apache CXF CDI Integration System Tests - OWB with producers #1157' does not have a result yet. Please make sure you set a proper result in case of pipeline/build scripts.
No mail will be sent out, as 'CXF » CXF-4.1.x-fixes-JDK17-deploy » Apache CXF Archetype - Simple JAX-RS webapp #1157' does not have a result yet. Please make sure you set a proper result in case of pipeline/build scripts.
No mail will be sent out, as 'CXF » CXF-4.1.x-fixes-JDK17-deploy » Apache CXF Databinding System Tests #1157' does not have a result yet. Please make sure you set a proper result in case of pipeline/build scripts.
No mail will be sent out, as 'CXF » CXF-4.1.x-fixes-JDK17-deploy » CXF sample using the Aegis Binding without any webservice #1157' does not have a result yet. Please make sure you set a proper result in case of pipeline/build scripts.
No mail will be sent out, as 'CXF » CXF-4.1.x-fixes-JDK17-deploy » Apache CXF Advanced Logging Feature #1157' does not have a result yet. Please make sure you set a proper result in case of pipeline/build scripts.
No mail will be sent out, as 'CXF » CXF-4.1.x-fixes-JDK17-deploy » Apache CXF CDI Integration System Tests - Weld with no apps #1157' does not have a result yet. Please make sure you set a proper result in case of pipeline/build scripts.
No mail will be sent out, as 'CXF » CXF-4.1.x-fixes-JDK17-deploy » JAX-RS Big Query Demo #1157' does not have a result yet. Please make sure you set a proper result in case of pipeline/build scripts.
No mail will be sent out, as 'CXF » CXF-4.1.x-fixes-JDK17-deploy » JAX-RS Demo Using Distributed Tracing with OpenTelemetry #1157' does not have a result yet. Please make sure you set a proper result in case of pipeline/build scripts.
No mail will be sent out, as 'CXF » CXF-4.1.x-fixes-JDK17-deploy » Apache CXF Runtime WS Policy #1157' does not have a result yet. Please make sure you set a proper result in case of pipeline/build scripts.
No mail will be sent out, as 'CXF » CXF-4.1.x-fixes-JDK17-deploy » JAX-RS Open API 3.0 Demo #1157' does not have a result yet. Please make sure you set a proper result in case of pipeline/build scripts.
No mail will be sent out, as 'CXF » CXF-4.1.x-fixes-JDK17-deploy » Apache CXF Kerberos Integration System Tests #1157' does not have a result yet. Please make sure you set a proper result in case of pipeline/build scripts.
No mail will be sent out, as 'CXF » CXF-4.1.x-fixes-JDK17-deploy » Apache CXF STS advanced systests #1157' does not have a result yet. Please make sure you set a proper result in case of pipeline/build scripts.
No mail will be sent out, as 'CXF » CXF-4.1.x-fixes-JDK17-deploy » Apache CXF Servlet Container Initializer Integration System Tests #1157' does not have a result yet. Please make sure you set a proper result in case of pipeline/build scripts.
No mail will be sent out, as 'CXF » CXF-4.1.x-fixes-JDK17-deploy » Apache CXF WS-Discovery API #1157' does not have a result yet. Please make sure you set a proper result in case of pipeline/build scripts.
No mail will be sent out, as 'CXF » CXF-4.1.x-fixes-JDK17-deploy » Apache CXF JAX-RS System Advanced Security Tests #1157' does not have a result yet. Please make sure you set a proper result in case of pipeline/build scripts.
No mail will be sent out, as 'CXF » CXF-4.1.x-fixes-JDK17-deploy » JAX-RS Swagger2 Spring Demo #1157' does not have a result yet. Please make sure you set a proper result in case of pipeline/build scripts.
No mail will be sent out, as 'CXF » CXF-4.1.x-fixes-JDK17-deploy » Spring HTTP Sample #1157' does not have a result yet. Please make sure you set a proper result in case of pipeline/build scripts.
No mail will be sent out, as 'CXF » CXF-4.1.x-fixes-JDK17-deploy » Apache CXF Throttling Feature #1157' does not have a result yet. Please make sure you set a proper result in case of pipeline/build scripts.
No mail will be sent out, as 'CXF » CXF-4.1.x-fixes-JDK17-deploy » WS-Policy Demo #1157' does not have a result yet. Please make sure you set a proper result in case of pipeline/build scripts.
No mail will be sent out, as 'CXF » CXF-4.1.x-fixes-JDK17-deploy » Apache CXF Features Runtime #1157' does not have a result yet. Please make sure you set a proper result in case of pipeline/build scripts.
No mail will be sent out, as 'CXF » CXF-4.1.x-fixes-JDK17-deploy » Spring Boot CXF Second Web Services #1157' does not have a result yet. Please make sure you set a proper result in case of pipeline/build scripts.
No mail will be sent out, as 'CXF » CXF-4.1.x-fixes-JDK17-deploy » Apache CXF Distributed Tracing using OpenTelemetry #1157' does not have a result yet. Please make sure you set a proper result in case of pipeline/build scripts.
No mail will be sent out, as 'CXF » CXF-4.1.x-fixes-JDK17-deploy » Apache CXF System Tests #1157' does not have a result yet. Please make sure you set a proper result in case of pipeline/build scripts.
No mail will be sent out, as 'CXF » CXF-4.1.x-fixes-JDK17-deploy » Apache CXF Benchmark SOAP/HTTP/Doc/Lit #1157' does not have a result yet. Please make sure you set a proper result in case of pipeline/build scripts.
No mail will be sent out, as 'CXF » CXF-4.1.x-fixes-JDK17-deploy » Apache CXF Rest Security Runtime #1157' does not have a result yet. Please make sure you set a proper result in case of pipeline/build scripts.
No mail will be sent out, as 'CXF » CXF-4.1.x-fixes-JDK17-deploy » CXF sample using a callback object #1157' does not have a result yet. Please make sure you set a proper result in case of pipeline/build scripts.
No mail will be sent out, as 'CXF » CXF-4.1.x-fixes-JDK17-deploy » Apache CXF Runtime HTTP Undertow Transport #1157' does not have a result yet. Please make sure you set a proper result in case of pipeline/build scripts.
No mail will be sent out, as 'CXF » CXF-4.1.x-fixes-JDK17-deploy » Apache CXF Runtime JOSE JAX-RS #1157' does not have a result yet. Please make sure you set a proper result in case of pipeline/build scripts.
No mail will be sent out, as 'CXF » CXF-4.1.x-fixes-JDK17-deploy » JAX-RS WebSocket WebApp Demo #1157' does not have a result yet. Please make sure you set a proper result in case of pipeline/build scripts.
No mail will be sent out, as 'CXF » CXF-4.1.x-fixes-JDK17-deploy » JAX-RS Demo Using Distributed Tracing with OpenTelemetry API, Apache Camel and Jaeger #1157' does not have a result yet. Please make sure you set a proper result in case of pipeline/build scripts.
No mail will be sent out, as 'CXF » CXF-4.1.x-fixes-JDK17-deploy » WSDL first demo using Document/Literal Style #1157' does not have a result yet. Please make sure you set a proper result in case of pipeline/build scripts.
No mail will be sent out, as 'CXF » CXF-4.1.x-fixes-JDK17-deploy » Apache CXF CDI Integration System Tests - Weld #1157' does not have a result yet. Please make sure you set a proper result in case of pipeline/build scripts.
No mail will be sent out, as 'CXF » CXF-4.1.x-fixes-JDK17-deploy » JMS Transport Queue Demo using Document-Literal Style #1157' does not have a result yet. Please make sure you set a proper result in case of pipeline/build scripts.
No mail will be sent out, as 'CXF » CXF-4.1.x-fixes-JDK17-deploy » Apache CXF Java2WS Maven2 Plugin #1157' does not have a result yet. Please make sure you set a proper result in case of pipeline/build scripts.
No mail will be sent out, as 'CXF » CXF-4.1.x-fixes-JDK17-deploy » WSDL first demo using the jms transport and jmsConfigFeature #1157' does not have a result yet. Please make sure you set a proper result in case of pipeline/build scripts.
No mail will be sent out, as 'CXF » CXF-4.1.x-fixes-JDK17-deploy » Apache CXF XKMS #1157' does not have a result yet. Please make sure you set a proper result in case of pipeline/build scripts.
No mail will be sent out, as 'CXF » CXF-4.1.x-fixes-JDK17-deploy » Apache CXF STS basic systests #1157' does not have a result yet. Please make sure you set a proper result in case of pipeline/build scripts.
No mail will be sent out, as 'CXF » CXF-4.1.x-fixes-JDK17-deploy » Apache CXF WS-Security System Tests #1157' does not have a result yet. Please make sure you set a proper result in case of pipeline/build scripts.
No mail will be sent out, as 'CXF » CXF-4.1.x-fixes-JDK17-deploy » Apache CXF WADL2Java Code Generation Maven2 Plugin #1157' does not have a result yet. Please make sure you set a proper result in case of pipeline/build scripts.
No mail will be sent out, as 'CXF » CXF-4.1.x-fixes-JDK17-deploy » Apache CXF Runtime HTTP Netty Client Transport #1157' does not have a result yet. Please make sure you set a proper result in case of pipeline/build scripts.
No mail will be sent out, as 'CXF » CXF-4.1.x-fixes-JDK17-deploy » Apache CXF Runtime JavaScript Client Generator Tests #1157' does not have a result yet. Please make sure you set a proper result in case of pipeline/build scripts.
No mail will be sent out, as 'CXF » CXF-4.1.x-fixes-JDK17-deploy » JAX-WS Asynchronous Demo using Document/Literal Style #1157' does not have a result yet. Please make sure you set a proper result in case of pipeline/build scripts.
No mail will be sent out, as 'CXF » CXF-4.1.x-fixes-JDK17-deploy » Apache CXF WS-* Specifications System Tests #1157' does not have a result yet. Please make sure you set a proper result in case of pipeline/build scripts.
No mail will be sent out, as 'CXF » CXF-4.1.x-fixes-JDK17-deploy » Apache CXF Runtime Simple Frontend #1157' does not have a result yet. Please make sure you set a proper result in case of pipeline/build scripts.
No mail will be sent out, as 'CXF » CXF-4.1.x-fixes-JDK17-deploy » Apache CXF Spring Boot Integration #1157' does not have a result yet. Please make sure you set a proper result in case of pipeline/build scripts.
No mail will be sent out, as 'CXF » CXF-4.1.x-fixes-JDK17-deploy » Apache CXF Runtime JavaScript Client Generator #1157' does not have a result yet. Please make sure you set a proper result in case of pipeline/build scripts.
No mail will be sent out, as 'CXF » CXF-4.1.x-fixes-JDK17-deploy » JAX-RS SSE/CDI Demo (Jetty 9) #1157' does not have a result yet. Please make sure you set a proper result in case of pipeline/build scripts.
No mail will be sent out, as 'CXF » CXF-4.1.x-fixes-JDK17-deploy » Java First demo using JMS #1157' does not have a result yet. Please make sure you set a proper result in case of pipeline/build scripts.
No mail will be sent out, as 'CXF » CXF-4.1.x-fixes-JDK17-deploy » Apache CXF Runtime JAXB DataBinding #1157' does not have a result yet. Please make sure you set a proper result in case of pipeline/build scripts.
No mail will be sent out, as 'CXF » CXF-4.1.x-fixes-JDK17-deploy » Apache CXF WS-Security Interop System Tests #1157' does not have a result yet. Please make sure you set a proper result in case of pipeline/build scripts.
No mail will be sent out, as 'CXF » CXF-4.1.x-fixes-JDK17-deploy » Apache CXF XKMS Common #1157' does not have a result yet. Please make sure you set a proper result in case of pipeline/build scripts.
No mail will be sent out, as 'CXF » CXF-4.1.x-fixes-JDK17-deploy » Apache CXF Runtime JAX-WS Frontend #1157' does not have a result yet. Please make sure you set a proper result in case of pipeline/build scripts.
No mail will be sent out, as 'CXF » CXF-4.1.x-fixes-JDK17-deploy » Apache CXF Runtime JOSE Core #1157' does not have a result yet. Please make sure you set a proper result in case of pipeline/build scripts.
No mail will be sent out, as 'CXF » CXF-4.1.x-fixes-JDK17-deploy » Apache CXF SSE Integration System Tests #1157' does not have a result yet. Please make sure you set a proper result in case of pipeline/build scripts.
No mail will be sent out, as 'CXF » CXF-4.1.x-fixes-JDK17-deploy » Apache CXF System Tests for Maven Plugins #1157' does not have a result yet. Please make sure you set a proper result in case of pipeline/build scripts.
No mail will be sent out, as 'CXF » CXF-4.1.x-fixes-JDK17-deploy » Apache CXF JAX-RS System Tests #1157' does not have a result yet. Please make sure you set a proper result in case of pipeline/build scripts.
No mail will be sent out, as 'CXF » CXF-4.1.x-fixes-JDK17-deploy » Apache CXF Runtime #1157' does not have a result yet. Please make sure you set a proper result in case of pipeline/build scripts.
No mail will be sent out, as 'CXF » CXF-4.1.x-fixes-JDK17-deploy » JAX-WS GraalVM Demo (capture generated classes) #1157' does not have a result yet. Please make sure you set a proper result in case of pipeline/build scripts.
No mail will be sent out, as 'CXF » CXF-4.1.x-fixes-JDK17-deploy » Apache CXF Runtime WebSocket Transport #1157' does not have a result yet. Please make sure you set a proper result in case of pipeline/build scripts.
No mail will be sent out, as 'CXF » CXF-4.1.x-fixes-JDK17-deploy » Apache CXF CDI Integration System Tests - OWB with multiple apps #1157' does not have a result yet. Please make sure you set a proper result in case of pipeline/build scripts.
No mail will be sent out, as 'CXF » CXF-4.1.x-fixes-JDK17-deploy » Apache CXF WSN Core #1157' does not have a result yet. Please make sure you set a proper result in case of pipeline/build scripts.
No mail will be sent out, as 'CXF » CXF-4.1.x-fixes-JDK17-deploy » Apache CXF CDI Integration System Tests - OWB with no apps #1157' does not have a result yet. Please make sure you set a proper result in case of pipeline/build scripts.
No mail will be sent out, as 'CXF » CXF-4.1.x-fixes-JDK17-deploy » Apache CXF XKMS Client #1157' does not have a result yet. Please make sure you set a proper result in case of pipeline/build scripts.
No mail will be sent out, as 'CXF » CXF-4.1.x-fixes-JDK17-deploy » Apache CXF Transport System Tests JMS #1157' does not have a result yet. Please make sure you set a proper result in case of pipeline/build scripts.
No mail will be sent out, as 'CXF » CXF-4.1.x-fixes-JDK17-deploy » Apache CXF Command Line Tools CORBA #1157' does not have a result yet. Please make sure you set a proper result in case of pipeline/build scripts.
No mail will be sent out, as 'CXF » CXF-4.1.x-fixes-JDK17-deploy » JAX-RS Basic Demo With HTTP/2 communications #1157' does not have a result yet. Please make sure you set a proper result in case of pipeline/build scripts.
No mail will be sent out, as 'CXF » CXF-4.1.x-fixes-JDK17-deploy » Apache CXF WS-RM Specifications System Tests #1157' does not have a result yet. Please make sure you set a proper result in case of pipeline/build scripts.
No mail will be sent out, as 'CXF » CXF-4.1.x-fixes-JDK17-deploy » Apache CXF Runtime HTTP Async Transport #1157' does not have a result yet. Please make sure you set a proper result in case of pipeline/build scripts.
No mail will be sent out, as 'CXF » CXF-4.1.x-fixes-JDK17-deploy » Apache CXF MicroProfile No-CDI/Config Sys Tests #1157' does not have a result yet. Please make sure you set a proper result in case of pipeline/build scripts.
No mail will be sent out, as 'CXF » CXF-4.1.x-fixes-JDK17-deploy » CXF WS-SecurityPolicy Signature Encryption Demo #1157' does not have a result yet. Please make sure you set a proper result in case of pipeline/build scripts.
No mail will be sent out, as 'CXF » CXF-4.1.x-fixes-JDK17-deploy » Apache CXF System Tests - MicroProfile Rest Client TCK on Weld #1157' does not have a result yet. Please make sure you set a proper result in case of pipeline/build scripts.
No mail will be sent out, as 'CXF » CXF-4.1.x-fixes-JDK17-deploy » Apache CXF WSN OSGi #1157' does not have a result yet. Please make sure you set a proper result in case of pipeline/build scripts.
No mail will be sent out, as 'CXF » CXF-4.1.x-fixes-JDK17-deploy » WS-Addressing Demo #1157' does not have a result yet. Please make sure you set a proper result in case of pipeline/build scripts.
No mail will be sent out, as 'CXF » CXF-4.1.x-fixes-JDK17-deploy » Apache CXF SSE Integration System Tests base classes #1157' does not have a result yet. Please make sure you set a proper result in case of pipeline/build scripts.
No mail will be sent out, as 'CXF » CXF-4.1.x-fixes-JDK17-deploy » Apache CXF Runtime JavaScript Client Generator Projects #1157' does not have a result yet. Please make sure you set a proper result in case of pipeline/build scripts.
No mail will be sent out, as 'CXF » CXF-4.1.x-fixes-JDK17-deploy » JAX-RS SSE Demo (Jetty 9) #1157' does not have a result yet. Please make sure you set a proper result in case of pipeline/build scripts.
No mail will be sent out, as 'CXF » CXF-4.1.x-fixes-JDK17-deploy » Apache CXF Transports Runtime #1157' does not have a result yet. Please make sure you set a proper result in case of pipeline/build scripts.
No mail will be sent out, as 'CXF » CXF-4.1.x-fixes-JDK17-deploy » Apache CXF Runtime Security functionality #1157' does not have a result yet. Please make sure you set a proper result in case of pipeline/build scripts.
No mail will be sent out, as 'CXF » CXF-4.1.x-fixes-JDK17-deploy » Apache CXF STS test OSGi deployment #1157' does not have a result yet. Please make sure you set a proper result in case of pipeline/build scripts.
No mail will be sent out, as 'CXF » CXF-4.1.x-fixes-JDK17-deploy » JAX-RS Content Negotiation Demo #1157' does not have a result yet. Please make sure you set a proper result in case of pipeline/build scripts.
No mail will be sent out, as 'CXF » CXF-4.1.x-fixes-JDK17-deploy » Apache CXF WS-Discovery #1157' does not have a result yet. Please make sure you set a proper result in case of pipeline/build scripts.
No mail will be sent out, as 'CXF » CXF-4.1.x-fixes-JDK17-deploy » Apache CXF Distributed Tracing using OpenZipkin Brave #1157' does not have a result yet. Please make sure you set a proper result in case of pipeline/build scripts.
No mail will be sent out, as 'CXF » CXF-4.1.x-fixes-JDK17-deploy » Apache CXF Manifest Jar #1157' does not have a result yet. Please make sure you set a proper result in case of pipeline/build scripts.
No mail will be sent out, as 'CXF » CXF-4.1.x-fixes-JDK17-deploy » JAX-RS OData #1157' does not have a result yet. Please make sure you set a proper result in case of pipeline/build scripts.
No mail will be sent out, as 'CXF » CXF-4.1.x-fixes-JDK17-deploy » Apache CXF Runtime OAuth 2.0 #1157' does not have a result yet. Please make sure you set a proper result in case of pipeline/build scripts.
No mail will be sent out, as 'CXF » CXF-4.1.x-fixes-JDK17-deploy » Test for generating code from wsdl in repo #1157' does not have a result yet. Please make sure you set a proper result in case of pipeline/build scripts.
No mail will be sent out, as 'CXF » CXF-4.1.x-fixes-JDK17-deploy » Apache CXF Web Services Runtime #1157' does not have a result yet. Please make sure you set a proper result in case of pipeline/build scripts.
No mail will be sent out, as 'CXF » CXF-4.1.x-fixes-JDK17-deploy » Apache CXF Runtime OAuth 2.0 SAML #1157' does not have a result yet. Please make sure you set a proper result in case of pipeline/build scripts.
No mail will be sent out, as 'CXF » CXF-4.1.x-fixes-JDK17-deploy » Apache CXF Runtime HTTP Jetty Transport #1157' does not have a result yet. Please make sure you set a proper result in case of pipeline/build scripts.
No mail will be sent out, as 'CXF » CXF-4.1.x-fixes-JDK17-deploy » Test for writing wsdl to repo #1157' does not have a result yet. Please make sure you set a proper result in case of pipeline/build scripts.
No mail will be sent out, as 'CXF » CXF-4.1.x-fixes-JDK17-deploy » Apache CXF Command Line Tools #1157' does not have a result yet. Please make sure you set a proper result in case of pipeline/build scripts.
No mail will be sent out, as 'CXF » CXF-4.1.x-fixes-JDK17-deploy » Bank sample using JAX-WS API's to talk via CORBA/IIOP #1157' does not have a result yet. Please make sure you set a proper result in case of pipeline/build scripts.
No mail will be sent out, as 'CXF » CXF-4.1.x-fixes-JDK17-deploy » Sample using SOAP Headers #1157' does not have a result yet. Please make sure you set a proper result in case of pipeline/build scripts.
No mail will be sent out, as 'CXF » CXF-4.1.x-fixes-JDK17-deploy » Apache CXF Parent #1157' does not have a result yet. Please make sure you set a proper result in case of pipeline/build scripts.
No mail will be sent out, as 'CXF » CXF-4.1.x-fixes-JDK17-deploy » Apache CXF Maven Plugins #1157' does not have a result yet. Please make sure you set a proper result in case of pipeline/build scripts.
No mail will be sent out, as 'CXF » CXF-4.1.x-fixes-JDK17-deploy » Apache CXF Archetype - Simple JAX-WS Java First #1157' does not have a result yet. Please make sure you set a proper result in case of pipeline/build scripts.
No mail will be sent out, as 'CXF » CXF-4.1.x-fixes-JDK17-deploy » JAX-RS WebSocket Demo #1157' does not have a result yet. Please make sure you set a proper result in case of pipeline/build scripts.
No mail will be sent out, as 'CXF » CXF-4.1.x-fixes-JDK17-deploy » JAX-RS Basic Demo With HTTP/2 communications #1157' does not have a result yet. Please make sure you set a proper result in case of pipeline/build scripts.
No mail will be sent out, as 'CXF » CXF-4.1.x-fixes-JDK17-deploy » JAX-RS Basic With HTTPS communications #1157' does not have a result yet. Please make sure you set a proper result in case of pipeline/build scripts.
No mail will be sent out, as 'CXF » CXF-4.1.x-fixes-JDK17-deploy » Java First demo using JAX-WS APIs #1157' does not have a result yet. Please make sure you set a proper result in case of pipeline/build scripts.
No mail will be sent out, as 'CXF » CXF-4.1.x-fixes-JDK17-deploy » JAX-RS SSE Client Demo (Tomcat 8) #1157' does not have a result yet. Please make sure you set a proper result in case of pipeline/build scripts.
No mail will be sent out, as 'CXF » CXF-4.1.x-fixes-JDK17-deploy » JAX-WS Handler Demo #1157' does not have a result yet. Please make sure you set a proper result in case of pipeline/build scripts.
No mail will be sent out, as 'CXF » CXF-4.1.x-fixes-JDK17-deploy » Spring Boot CXF Web Services Transaction Sample #1157' does not have a result yet. Please make sure you set a proper result in case of pipeline/build scripts.
No mail will be sent out, as 'CXF » CXF-4.1.x-fixes-JDK17-deploy » Apache CXF Netty Transport System Tests #1157' does not have a result yet. Please make sure you set a proper result in case of pipeline/build scripts.
No mail will be sent out, as 'CXF » CXF-4.1.x-fixes-JDK17-deploy » Apache CXF Command Line Tools JavaTo WS #1157' does not have a result yet. Please make sure you set a proper result in case of pipeline/build scripts.
No mail will be sent out, as 'CXF » CXF-4.1.x-fixes-JDK17-deploy » Apache CXF Runtime HTTP Netty Server Transport #1157' does not have a result yet. Please make sure you set a proper result in case of pipeline/build scripts.
No mail will be sent out, as 'CXF » CXF-4.1.x-fixes-JDK17-deploy » Apache CXF LDAP Integration System Tests #1157' does not have a result yet. Please make sure you set a proper result in case of pipeline/build scripts.
No mail will be sent out, as 'CXF » CXF-4.1.x-fixes-JDK17-deploy » JAX-RS Basic Demo With HTTP/2 communications #1157' does not have a result yet. Please make sure you set a proper result in case of pipeline/build scripts.
No mail will be sent out, as 'CXF » CXF-4.1.x-fixes-JDK17-deploy » SOAP/JMS Transport Specification Demo using Document-Literal Style #1157' does not have a result yet. Please make sure you set a proper result in case of pipeline/build scripts.
No mail will be sent out, as 'CXF » CXF-4.1.x-fixes-JDK17-deploy » Apache CXF Distributed Tracing using OpenTracing #1157' does not have a result yet. Please make sure you set a proper result in case of pipeline/build scripts.
No mail will be sent out, as 'CXF » CXF-4.1.x-fixes-JDK17-deploy » Colocated Demo using Document/Literal Style #1157' does not have a result yet. Please make sure you set a proper result in case of pipeline/build scripts.
No mail will be sent out, as 'CXF » CXF-4.1.x-fixes-JDK17-deploy » Apache CXF Runtime HTTP Transport #1157' does not have a result yet. Please make sure you set a proper result in case of pipeline/build scripts.
No mail will be sent out, as 'CXF » CXF-4.1.x-fixes-JDK17-deploy » Apache CXF Observability using Micrometer Observation #1157' does not have a result yet. Please make sure you set a proper result in case of pipeline/build scripts.
No mail will be sent out, as 'CXF » CXF-4.1.x-fixes-JDK17-deploy » Apache CXF JAX-RS Service Description OpenAPI/Swagger Common #1157' does not have a result yet. Please make sure you set a proper result in case of pipeline/build scripts.
No mail will be sent out, as 'CXF » CXF-4.1.x-fixes-JDK17-deploy » Apache CXF SSE Integration System Tests for Undertow #1157' does not have a result yet. Please make sure you set a proper result in case of pipeline/build scripts.
ERROR: Failed to parse POMs
java.io.IOException: java.lang.reflect.InvocationTargetException
	at PluginClassLoader for maven-plugin//hudson.maven.Maven3Builder.call(Maven3Builder.java:178)
	at PluginClassLoader for maven-plugin//hudson.maven.Maven3Builder.call(Maven3Builder.java:71)
	at hudson.remoting.UserRequest.perform(UserRequest.java:225)
	at hudson.remoting.UserRequest.perform(UserRequest.java:50)
	at hudson.remoting.Request$2.run(Request.java:391)
	at hudson.remoting.InterceptingExecutorService.lambda$wrap$0(InterceptingExecutorService.java:81)
	at java.base/java.util.concurrent.FutureTask.run(FutureTask.java:264)
	at java.base/java.util.concurrent.ThreadPoolExecutor.runWorker(ThreadPoolExecutor.java:1136)
	at java.base/java.util.concurrent.ThreadPoolExecutor$Worker.run(ThreadPoolExecutor.java:635)
	at java.base/java.lang.Thread.run(Thread.java:840)
	Suppressed: hudson.remoting.Channel$CallSiteStackTrace: Remote call to Channel to Maven [/home/jenkins/tools/java/latest17/bin/java, -da, -dsa, -Xmx1024M, -cp, /home/jenkins/maven35-agent.jar:/home/jenkins/tools/maven/latest3/boot/plexus-classworlds-2.12.1.jar:/home/jenkins/tools/maven/latest3/conf/logging, jenkins.maven3.agent.Maven35Main, /home/jenkins/tools/maven/latest3, /home/jenkins/agent.jar, /home/jenkins/maven35-interceptor.jar, /home/jenkins/maven3-interceptor-commons.jar, 34775]
		at hudson.remoting.Channel.attachCallSiteStackTrace(Channel.java:1923)
		at hudson.remoting.UserRequest$ExceptionResponse.retrieve(UserRequest.java:384)
		at hudson.remoting.Channel.call(Channel.java:1112)
		at PluginClassLoader for maven-plugin//hudson.maven.ProcessCache$MavenProcess.call(ProcessCache.java:161)
		at PluginClassLoader for maven-plugin//hudson.maven.MavenModuleSetBuild$MavenModuleSetBuildExecution.doRun(MavenModuleSetBuild.java:877)
		at hudson.model.AbstractBuild$AbstractBuildExecution.run(AbstractBuild.java:527)
		at hudson.model.Run.execute(Run.java:1833)
		at PluginClassLoader for maven-plugin//hudson.maven.MavenModuleSetBuild.run(MavenModuleSetBuild.java:543)
		at hudson.model.ResourceController.execute(ResourceController.java:101)
		at hudson.model.Executor.run(Executor.java:446)
Caused by: java.lang.reflect.InvocationTargetException
	at java.base/jdk.internal.reflect.NativeMethodAccessorImpl.invoke0(Native Method)
	at java.base/jdk.internal.reflect.NativeMethodAccessorImpl.invoke(NativeMethodAccessorImpl.java:77)
	at java.base/jdk.internal.reflect.DelegatingMethodAccessorImpl.invoke(DelegatingMethodAccessorImpl.java:43)
	at java.base/java.lang.reflect.Method.invoke(Method.java:569)
	at PluginClassLoader for maven-plugin//hudson.maven.Maven3Builder.call(Maven3Builder.java:140)
	... 9 more
Caused by: java.lang.Exception: java.lang.reflect.InvocationTargetException
	at jenkins.maven3.agent.Maven35Main.launch(Maven35Main.java:182)
	... 14 more
Caused by: java.lang.reflect.InvocationTargetException
	at java.base/jdk.internal.reflect.NativeMethodAccessorImpl.invoke0(Native Method)
	at java.base/jdk.internal.reflect.NativeMethodAccessorImpl.invoke(NativeMethodAccessorImpl.java:77)
	at java.base/jdk.internal.reflect.DelegatingMethodAccessorImpl.invoke(DelegatingMethodAccessorImpl.java:43)
	at java.base/java.lang.reflect.Method.invoke(Method.java:569)
	at org.codehaus.plexus.classworlds.launcher.Launcher.launchEnhanced(Launcher.java:255)
	at org.codehaus.plexus.classworlds.launcher.Launcher.launch(Launcher.java:201)
	at jenkins.maven3.agent.Maven35Main.launch(Maven35Main.java:179)
	... 14 more
Caused by: java.lang.UnsupportedOperationException
	at org.eclipse.sisu.wire.EntryListAdapter$ValueListIterator.add(EntryListAdapter.java:185)
	at java.base/java.util.AbstractSequentialList.add(AbstractSequentialList.java:146)
	at java.base/java.util.AbstractList.add(AbstractList.java:111)
	at java.base/java.util.AbstractCollection.addAll(AbstractCollection.java:336)
	at org.jvnet.hudson.maven3.launcher.Maven35Launcher.main(Maven35Launcher.java:127)
	... 21 more
channel stopped

Jenkins build is back to normal : CXF » CXF-4.1.x-fixes-JDK17-deploy #1161

Posted by Apache Jenkins Server <je...@builds.apache.org>.
See <https://ci-builds.apache.org/job/CXF/job/CXF-4.1.x-fixes-JDK17-deploy/1161/display/redirect>


Build failed in Jenkins: CXF » CXF-4.1.x-fixes-JDK17-deploy #1160

Posted by Apache Jenkins Server <je...@builds.apache.org>.
See <https://ci-builds.apache.org/job/CXF/job/CXF-4.1.x-fixes-JDK17-deploy/1160/display/redirect>

Changes:


------------------------------------------
[...truncated 22.82 KiB...]
No mail will be sent out, as 'CXF » CXF-4.1.x-fixes-JDK17-deploy » Apache CXF Distributed Tracing Integration System Tests #1160' does not have a result yet. Please make sure you set a proper result in case of pipeline/build scripts.
No mail will be sent out, as 'CXF » CXF-4.1.x-fixes-JDK17-deploy » Apache CXF STS Core #1160' does not have a result yet. Please make sure you set a proper result in case of pipeline/build scripts.
No mail will be sent out, as 'CXF » CXF-4.1.x-fixes-JDK17-deploy » Apache CXF Integration #1160' does not have a result yet. Please make sure you set a proper result in case of pipeline/build scripts.
No mail will be sent out, as 'CXF » CXF-4.1.x-fixes-JDK17-deploy » JAX-RS Demo Using Distributed Tracing with Micrometer Observation #1160' does not have a result yet. Please make sure you set a proper result in case of pipeline/build scripts.
No mail will be sent out, as 'CXF » CXF-4.1.x-fixes-JDK17-deploy » JavaScript Client Demo using Document/Literal Style #1160' does not have a result yet. Please make sure you set a proper result in case of pipeline/build scripts.
No mail will be sent out, as 'CXF » CXF-4.1.x-fixes-JDK17-deploy » Apache CXF RS SSO SAML #1160' does not have a result yet. Please make sure you set a proper result in case of pipeline/build scripts.
No mail will be sent out, as 'CXF » CXF-4.1.x-fixes-JDK17-deploy » Apache CXF SSE Integration System Tests for Jetty #1160' does not have a result yet. Please make sure you set a proper result in case of pipeline/build scripts.
No mail will be sent out, as 'CXF » CXF-4.1.x-fixes-JDK17-deploy » Apache CXF CDI Integration System Tests - Weld with producers #1160' does not have a result yet. Please make sure you set a proper result in case of pipeline/build scripts.
No mail will be sent out, as 'CXF » CXF-4.1.x-fixes-JDK17-deploy » Apache CXF JOSE Security parent #1160' does not have a result yet. Please make sure you set a proper result in case of pipeline/build scripts.
No mail will be sent out, as 'CXF » CXF-4.1.x-fixes-JDK17-deploy » Apache CXF RS XML Security #1160' does not have a result yet. Please make sure you set a proper result in case of pipeline/build scripts.
No mail will be sent out, as 'CXF » CXF-4.1.x-fixes-JDK17-deploy » JAX-WS Dispatch/Provider Demo #1160' does not have a result yet. Please make sure you set a proper result in case of pipeline/build scripts.
No mail will be sent out, as 'CXF » CXF-4.1.x-fixes-JDK17-deploy » Apache CXF WSN API #1160' does not have a result yet. Please make sure you set a proper result in case of pipeline/build scripts.
No mail will be sent out, as 'CXF » CXF-4.1.x-fixes-JDK17-deploy » Apache CXF Runtime XML Binding #1160' does not have a result yet. Please make sure you set a proper result in case of pipeline/build scripts.
No mail will be sent out, as 'CXF » CXF-4.1.x-fixes-JDK17-deploy » Apache CXF Runtime Management #1160' does not have a result yet. Please make sure you set a proper result in case of pipeline/build scripts.
No mail will be sent out, as 'CXF » CXF-4.1.x-fixes-JDK17-deploy » Apache CXF Command Line Tools WADLTo JAXRS Frontend #1160' does not have a result yet. Please make sure you set a proper result in case of pipeline/build scripts.
No mail will be sent out, as 'CXF » CXF-4.1.x-fixes-JDK17-deploy » Apache CXF SSE Integration System Tests for Tomcat #1160' does not have a result yet. Please make sure you set a proper result in case of pipeline/build scripts.
No mail will be sent out, as 'CXF » CXF-4.1.x-fixes-JDK17-deploy » Spring HTTP Servlet demo with groovy support #1160' does not have a result yet. Please make sure you set a proper result in case of pipeline/build scripts.
No mail will be sent out, as 'CXF » CXF-4.1.x-fixes-JDK17-deploy » Sample of JAX-* Service Using an Aegis Client #1160' does not have a result yet. Please make sure you set a proper result in case of pipeline/build scripts.
No mail will be sent out, as 'CXF » CXF-4.1.x-fixes-JDK17-deploy » JAX-RS Demo Using Distributed Tracing with OpenTracing API and Jaeger #1160' does not have a result yet. Please make sure you set a proper result in case of pipeline/build scripts.
No mail will be sent out, as 'CXF » CXF-4.1.x-fixes-JDK17-deploy » Eureka Registry for CXF SpringBoot demos #1160' does not have a result yet. Please make sure you set a proper result in case of pipeline/build scripts.
No mail will be sent out, as 'CXF » CXF-4.1.x-fixes-JDK17-deploy » Apache CXF Spring Boot Autoconfigure #1160' does not have a result yet. Please make sure you set a proper result in case of pipeline/build scripts.
No mail will be sent out, as 'CXF » CXF-4.1.x-fixes-JDK17-deploy » JAX-RS Basic Demo #1160' does not have a result yet. Please make sure you set a proper result in case of pipeline/build scripts.
No mail will be sent out, as 'CXF » CXF-4.1.x-fixes-JDK17-deploy » Apache CXF Command Line Tools WADLTo #1160' does not have a result yet. Please make sure you set a proper result in case of pipeline/build scripts.
No mail will be sent out, as 'CXF » CXF-4.1.x-fixes-JDK17-deploy » JAX-RS Demo Using Distributed Tracing with OpenZipkin Brave #1160' does not have a result yet. Please make sure you set a proper result in case of pipeline/build scripts.
No mail will be sent out, as 'CXF » CXF-4.1.x-fixes-JDK17-deploy » Apache CXF MicroProfile Tracing integration Sys Tests #1160' does not have a result yet. Please make sure you set a proper result in case of pipeline/build scripts.
No mail will be sent out, as 'CXF » CXF-4.1.x-fixes-JDK17-deploy » Hello World Client Demo using JavaScript #1160' does not have a result yet. Please make sure you set a proper result in case of pipeline/build scripts.
No mail will be sent out, as 'CXF » CXF-4.1.x-fixes-JDK17-deploy » Apache CXF JAX-RS Servlet Container Initializer #1160' does not have a result yet. Please make sure you set a proper result in case of pipeline/build scripts.
No mail will be sent out, as 'CXF » CXF-4.1.x-fixes-JDK17-deploy » Apache CXF WS-Transfer System Tests #1160' does not have a result yet. Please make sure you set a proper result in case of pipeline/build scripts.
No mail will be sent out, as 'CXF » CXF-4.1.x-fixes-JDK17-deploy » JAX-RS Basic Oidc Demo #1160' does not have a result yet. Please make sure you set a proper result in case of pipeline/build scripts.
No mail will be sent out, as 'CXF » CXF-4.1.x-fixes-JDK17-deploy » Apache CXF Runtime WS Addressing #1160' does not have a result yet. Please make sure you set a proper result in case of pipeline/build scripts.
No mail will be sent out, as 'CXF » CXF-4.1.x-fixes-JDK17-deploy » Apache CXF Command Line Tools WSDLTo #1160' does not have a result yet. Please make sure you set a proper result in case of pipeline/build scripts.
No mail will be sent out, as 'CXF » CXF-4.1.x-fixes-JDK17-deploy » JAX-RS Spring Security Demo #1160' does not have a result yet. Please make sure you set a proper result in case of pipeline/build scripts.
No mail will be sent out, as 'CXF » CXF-4.1.x-fixes-JDK17-deploy » Apache CXF BOM #1160' does not have a result yet. Please make sure you set a proper result in case of pipeline/build scripts.
No mail will be sent out, as 'CXF » CXF-4.1.x-fixes-JDK17-deploy » Apache CXF Command Line Tools WSDL to JavaScript Front End #1160' does not have a result yet. Please make sure you set a proper result in case of pipeline/build scripts.
No mail will be sent out, as 'CXF » CXF-4.1.x-fixes-JDK17-deploy » JAX-RS Basic Demo #1160' does not have a result yet. Please make sure you set a proper result in case of pipeline/build scripts.
No mail will be sent out, as 'CXF » CXF-4.1.x-fixes-JDK17-deploy » CXF WS-Security UT Demo #1160' does not have a result yet. Please make sure you set a proper result in case of pipeline/build scripts.
No mail will be sent out, as 'CXF » CXF-4.1.x-fixes-JDK17-deploy » WS-SecurityPolicy UT Demo #1160' does not have a result yet. Please make sure you set a proper result in case of pipeline/build scripts.
No mail will be sent out, as 'CXF » CXF-4.1.x-fixes-JDK17-deploy » Apache CXF Runtime Local Transport #1160' does not have a result yet. Please make sure you set a proper result in case of pipeline/build scripts.
No mail will be sent out, as 'CXF » CXF-4.1.x-fixes-JDK17-deploy » Spring Boot CXF Web Services Sample #1160' does not have a result yet. Please make sure you set a proper result in case of pipeline/build scripts.
No mail will be sent out, as 'CXF » CXF-4.1.x-fixes-JDK17-deploy » CXF sample using WRAPPED Style in XML Binding (pure XML over HTTP) #1160' does not have a result yet. Please make sure you set a proper result in case of pipeline/build scripts.
No mail will be sent out, as 'CXF » CXF-4.1.x-fixes-JDK17-deploy » CXF Sample of Stream GZIP Interceptor #1160' does not have a result yet. Please make sure you set a proper result in case of pipeline/build scripts.
No mail will be sent out, as 'CXF » CXF-4.1.x-fixes-JDK17-deploy » Java First demo service using the JAXWSFactoryBeans #1160' does not have a result yet. Please make sure you set a proper result in case of pipeline/build scripts.
No mail will be sent out, as 'CXF » CXF-4.1.x-fixes-JDK17-deploy » Hello world javascript demo #1160' does not have a result yet. Please make sure you set a proper result in case of pipeline/build scripts.
No mail will be sent out, as 'CXF » CXF-4.1.x-fixes-JDK17-deploy » Apache CXF Runtime JAX-RS Frontend #1160' does not have a result yet. Please make sure you set a proper result in case of pipeline/build scripts.
No mail will be sent out, as 'CXF » CXF-4.1.x-fixes-JDK17-deploy » Apache CXF JAX-RS Extensions: Project Reactor #1160' does not have a result yet. Please make sure you set a proper result in case of pipeline/build scripts.
No mail will be sent out, as 'CXF » CXF-4.1.x-fixes-JDK17-deploy » Apache CXF JAX-RS Service Description OpenAPI v3 #1160' does not have a result yet. Please make sure you set a proper result in case of pipeline/build scripts.
No mail will be sent out, as 'CXF » CXF-4.1.x-fixes-JDK17-deploy » WS-Eventing Demo #1160' does not have a result yet. Please make sure you set a proper result in case of pipeline/build scripts.
No mail will be sent out, as 'CXF » CXF-4.1.x-fixes-JDK17-deploy » Apache CXF JAX-RS Extensions: Search #1160' does not have a result yet. Please make sure you set a proper result in case of pipeline/build scripts.
No mail will be sent out, as 'CXF » CXF-4.1.x-fixes-JDK17-deploy » Apache CXF JAX-RS Service Description #1160' does not have a result yet. Please make sure you set a proper result in case of pipeline/build scripts.
No mail will be sent out, as 'CXF » CXF-4.1.x-fixes-JDK17-deploy » Apache CXF Runtime Bindings #1160' does not have a result yet. Please make sure you set a proper result in case of pipeline/build scripts.
No mail will be sent out, as 'CXF » CXF-4.1.x-fixes-JDK17-deploy » Apache CXF MicroProfile JAX-RS integration Sys Tests #1160' does not have a result yet. Please make sure you set a proper result in case of pipeline/build scripts.
No mail will be sent out, as 'CXF » CXF-4.1.x-fixes-JDK17-deploy » JAX-WS GraalVM Demo #1160' does not have a result yet. Please make sure you set a proper result in case of pipeline/build scripts.
No mail will be sent out, as 'CXF » CXF-4.1.x-fixes-JDK17-deploy » JMS Transport Publish/Subscribe Demo using Document-Literal Style #1160' does not have a result yet. Please make sure you set a proper result in case of pipeline/build scripts.
No mail will be sent out, as 'CXF » CXF-4.1.x-fixes-JDK17-deploy » Bank sample using JAX-WS API's to talk via CORBA/IIOP #1160' does not have a result yet. Please make sure you set a proper result in case of pipeline/build scripts.
No mail will be sent out, as 'CXF » CXF-4.1.x-fixes-JDK17-deploy » JAX-RS Open API 3.0 Demo #1160' does not have a result yet. Please make sure you set a proper result in case of pipeline/build scripts.
No mail will be sent out, as 'CXF » CXF-4.1.x-fixes-JDK17-deploy » Apache CXF Spring Boot Starter JAX-RS #1160' does not have a result yet. Please make sure you set a proper result in case of pipeline/build scripts.
No mail will be sent out, as 'CXF » CXF-4.1.x-fixes-JDK17-deploy » Apache CXF Java2WADL Maven2 Plugin #1160' does not have a result yet. Please make sure you set a proper result in case of pipeline/build scripts.
No mail will be sent out, as 'CXF » CXF-4.1.x-fixes-JDK17-deploy » Apache CXF Container Integration Test Grizzly #1160' does not have a result yet. Please make sure you set a proper result in case of pipeline/build scripts.
No mail will be sent out, as 'CXF » CXF-4.1.x-fixes-JDK17-deploy » Apache CXF Runtime CORBA Binding #1160' does not have a result yet. Please make sure you set a proper result in case of pipeline/build scripts.
No mail will be sent out, as 'CXF » CXF-4.1.x-fixes-JDK17-deploy » Apache CXF Runtime Http-Signature #1160' does not have a result yet. Please make sure you set a proper result in case of pipeline/build scripts.
No mail will be sent out, as 'CXF » CXF-4.1.x-fixes-JDK17-deploy » Generated JavaScript Sample using JAX-WS and JSR-181 #1160' does not have a result yet. Please make sure you set a proper result in case of pipeline/build scripts.
No mail will be sent out, as 'CXF » CXF-4.1.x-fixes-JDK17-deploy » JAX-WS GraalVM Demo (capture generated classes) #1160' does not have a result yet. Please make sure you set a proper result in case of pipeline/build scripts.
No mail will be sent out, as 'CXF » CXF-4.1.x-fixes-JDK17-deploy » Apache CXF Maven Archetypes #1160' does not have a result yet. Please make sure you set a proper result in case of pipeline/build scripts.
No mail will be sent out, as 'CXF » CXF-4.1.x-fixes-JDK17-deploy » Apache CXF MicroProfile Async Sys Tests #1160' does not have a result yet. Please make sure you set a proper result in case of pipeline/build scripts.
No mail will be sent out, as 'CXF » CXF-4.1.x-fixes-JDK17-deploy » Apache CXF Runtime SOAP Binding #1160' does not have a result yet. Please make sure you set a proper result in case of pipeline/build scripts.
No mail will be sent out, as 'CXF » CXF-4.1.x-fixes-JDK17-deploy » Apache CXF WSN service #1160' does not have a result yet. Please make sure you set a proper result in case of pipeline/build scripts.
No mail will be sent out, as 'CXF » CXF-4.1.x-fixes-JDK17-deploy » Apache CXF JAX-RS Service Description Microprofile OpenAPI #1160' does not have a result yet. Please make sure you set a proper result in case of pipeline/build scripts.
No mail will be sent out, as 'CXF » CXF-4.1.x-fixes-JDK17-deploy » Apache CXF STS service #1160' does not have a result yet. Please make sure you set a proper result in case of pipeline/build scripts.
No mail will be sent out, as 'CXF » CXF-4.1.x-fixes-JDK17-deploy » Apache CXF Runtime OpenId Connect #1160' does not have a result yet. Please make sure you set a proper result in case of pipeline/build scripts.
No mail will be sent out, as 'CXF » CXF-4.1.x-fixes-JDK17-deploy » Apache CXF MicroProfile TCKs #1160' does not have a result yet. Please make sure you set a proper result in case of pipeline/build scripts.
No mail will be sent out, as 'CXF » CXF-4.1.x-fixes-JDK17-deploy » Apache CXF Runtime WS Transfer #1160' does not have a result yet. Please make sure you set a proper result in case of pipeline/build scripts.
No mail will be sent out, as 'CXF » CXF-4.1.x-fixes-JDK17-deploy » Apache CXF JAX-RS Extensions: Reactive Streams #1160' does not have a result yet. Please make sure you set a proper result in case of pipeline/build scripts.
No mail will be sent out, as 'CXF » CXF-4.1.x-fixes-JDK17-deploy » Apache CXF Uncategorized System Tests #1160' does not have a result yet. Please make sure you set a proper result in case of pipeline/build scripts.
No mail will be sent out, as 'CXF » CXF-4.1.x-fixes-JDK17-deploy » Apache CXF Runtime Core for WSDL #1160' does not have a result yet. Please make sure you set a proper result in case of pipeline/build scripts.
No mail will be sent out, as 'CXF » CXF-4.1.x-fixes-JDK17-deploy » Apache CXF XKMS Service #1160' does not have a result yet. Please make sure you set a proper result in case of pipeline/build scripts.
No mail will be sent out, as 'CXF » CXF-4.1.x-fixes-JDK17-deploy » Apache CXF Command Line Tools Common #1160' does not have a result yet. Please make sure you set a proper result in case of pipeline/build scripts.
No mail will be sent out, as 'CXF » CXF-4.1.x-fixes-JDK17-deploy » Apache CXF Command Line Tools WSDLTo Core #1160' does not have a result yet. Please make sure you set a proper result in case of pipeline/build scripts.
No mail will be sent out, as 'CXF » CXF-4.1.x-fixes-JDK17-deploy » Apache CXF Services #1160' does not have a result yet. Please make sure you set a proper result in case of pipeline/build scripts.
No mail will be sent out, as 'CXF » CXF-4.1.x-fixes-JDK17-deploy » Apache CXF JAX-WS System Tests #1160' does not have a result yet. Please make sure you set a proper result in case of pipeline/build scripts.
No mail will be sent out, as 'CXF » CXF-4.1.x-fixes-JDK17-deploy » Apache CXF Command Line Tools WSDLTo JAXWS Frontend #1160' does not have a result yet. Please make sure you set a proper result in case of pipeline/build scripts.
No mail will be sent out, as 'CXF » CXF-4.1.x-fixes-JDK17-deploy » Apache CXF Samples #1160' does not have a result yet. Please make sure you set a proper result in case of pipeline/build scripts.
No mail will be sent out, as 'CXF » CXF-4.1.x-fixes-JDK17-deploy » Spring HTTP Servlet demo with ruby support #1160' does not have a result yet. Please make sure you set a proper result in case of pipeline/build scripts.
No mail will be sent out, as 'CXF » CXF-4.1.x-fixes-JDK17-deploy » Apache CXF JAX-RS Service Description Swagger UI integration #1160' does not have a result yet. Please make sure you set a proper result in case of pipeline/build scripts.
No mail will be sent out, as 'CXF » CXF-4.1.x-fixes-JDK17-deploy » Apache CXF Runtime Clustering #1160' does not have a result yet. Please make sure you set a proper result in case of pipeline/build scripts.
No mail will be sent out, as 'CXF » CXF-4.1.x-fixes-JDK17-deploy » Apache CXF CDI Integration System Tests - OWB with producers #1160' does not have a result yet. Please make sure you set a proper result in case of pipeline/build scripts.
No mail will be sent out, as 'CXF » CXF-4.1.x-fixes-JDK17-deploy » Apache CXF Archetype - Simple JAX-RS webapp #1160' does not have a result yet. Please make sure you set a proper result in case of pipeline/build scripts.
No mail will be sent out, as 'CXF » CXF-4.1.x-fixes-JDK17-deploy » Apache CXF Databinding System Tests #1160' does not have a result yet. Please make sure you set a proper result in case of pipeline/build scripts.
No mail will be sent out, as 'CXF » CXF-4.1.x-fixes-JDK17-deploy » CXF sample using the Aegis Binding without any webservice #1160' does not have a result yet. Please make sure you set a proper result in case of pipeline/build scripts.
No mail will be sent out, as 'CXF » CXF-4.1.x-fixes-JDK17-deploy » Apache CXF Advanced Logging Feature #1160' does not have a result yet. Please make sure you set a proper result in case of pipeline/build scripts.
No mail will be sent out, as 'CXF » CXF-4.1.x-fixes-JDK17-deploy » Apache CXF CDI Integration System Tests - Weld with no apps #1160' does not have a result yet. Please make sure you set a proper result in case of pipeline/build scripts.
No mail will be sent out, as 'CXF » CXF-4.1.x-fixes-JDK17-deploy » JAX-RS Big Query Demo #1160' does not have a result yet. Please make sure you set a proper result in case of pipeline/build scripts.
No mail will be sent out, as 'CXF » CXF-4.1.x-fixes-JDK17-deploy » JAX-RS Demo Using Distributed Tracing with OpenTelemetry #1160' does not have a result yet. Please make sure you set a proper result in case of pipeline/build scripts.
No mail will be sent out, as 'CXF » CXF-4.1.x-fixes-JDK17-deploy » Apache CXF Runtime WS Policy #1160' does not have a result yet. Please make sure you set a proper result in case of pipeline/build scripts.
No mail will be sent out, as 'CXF » CXF-4.1.x-fixes-JDK17-deploy » JAX-RS Open API 3.0 Demo #1160' does not have a result yet. Please make sure you set a proper result in case of pipeline/build scripts.
No mail will be sent out, as 'CXF » CXF-4.1.x-fixes-JDK17-deploy » Apache CXF Kerberos Integration System Tests #1160' does not have a result yet. Please make sure you set a proper result in case of pipeline/build scripts.
No mail will be sent out, as 'CXF » CXF-4.1.x-fixes-JDK17-deploy » Apache CXF STS advanced systests #1160' does not have a result yet. Please make sure you set a proper result in case of pipeline/build scripts.
No mail will be sent out, as 'CXF » CXF-4.1.x-fixes-JDK17-deploy » Apache CXF Servlet Container Initializer Integration System Tests #1160' does not have a result yet. Please make sure you set a proper result in case of pipeline/build scripts.
No mail will be sent out, as 'CXF » CXF-4.1.x-fixes-JDK17-deploy » Apache CXF WS-Discovery API #1160' does not have a result yet. Please make sure you set a proper result in case of pipeline/build scripts.
No mail will be sent out, as 'CXF » CXF-4.1.x-fixes-JDK17-deploy » Apache CXF JAX-RS System Advanced Security Tests #1160' does not have a result yet. Please make sure you set a proper result in case of pipeline/build scripts.
No mail will be sent out, as 'CXF » CXF-4.1.x-fixes-JDK17-deploy » JAX-RS Swagger2 Spring Demo #1160' does not have a result yet. Please make sure you set a proper result in case of pipeline/build scripts.
No mail will be sent out, as 'CXF » CXF-4.1.x-fixes-JDK17-deploy » Spring HTTP Sample #1160' does not have a result yet. Please make sure you set a proper result in case of pipeline/build scripts.
No mail will be sent out, as 'CXF » CXF-4.1.x-fixes-JDK17-deploy » Apache CXF Throttling Feature #1160' does not have a result yet. Please make sure you set a proper result in case of pipeline/build scripts.
No mail will be sent out, as 'CXF » CXF-4.1.x-fixes-JDK17-deploy » WS-Policy Demo #1160' does not have a result yet. Please make sure you set a proper result in case of pipeline/build scripts.
No mail will be sent out, as 'CXF » CXF-4.1.x-fixes-JDK17-deploy » Apache CXF Features Runtime #1160' does not have a result yet. Please make sure you set a proper result in case of pipeline/build scripts.
No mail will be sent out, as 'CXF » CXF-4.1.x-fixes-JDK17-deploy » Spring Boot CXF Second Web Services #1160' does not have a result yet. Please make sure you set a proper result in case of pipeline/build scripts.
No mail will be sent out, as 'CXF » CXF-4.1.x-fixes-JDK17-deploy » Apache CXF Distributed Tracing using OpenTelemetry #1160' does not have a result yet. Please make sure you set a proper result in case of pipeline/build scripts.
No mail will be sent out, as 'CXF » CXF-4.1.x-fixes-JDK17-deploy » Apache CXF System Tests #1160' does not have a result yet. Please make sure you set a proper result in case of pipeline/build scripts.
No mail will be sent out, as 'CXF » CXF-4.1.x-fixes-JDK17-deploy » Apache CXF Benchmark SOAP/HTTP/Doc/Lit #1160' does not have a result yet. Please make sure you set a proper result in case of pipeline/build scripts.
No mail will be sent out, as 'CXF » CXF-4.1.x-fixes-JDK17-deploy » Apache CXF Rest Security Runtime #1160' does not have a result yet. Please make sure you set a proper result in case of pipeline/build scripts.
No mail will be sent out, as 'CXF » CXF-4.1.x-fixes-JDK17-deploy » CXF sample using a callback object #1160' does not have a result yet. Please make sure you set a proper result in case of pipeline/build scripts.
No mail will be sent out, as 'CXF » CXF-4.1.x-fixes-JDK17-deploy » Apache CXF Runtime HTTP Undertow Transport #1160' does not have a result yet. Please make sure you set a proper result in case of pipeline/build scripts.
No mail will be sent out, as 'CXF » CXF-4.1.x-fixes-JDK17-deploy » Apache CXF Runtime JOSE JAX-RS #1160' does not have a result yet. Please make sure you set a proper result in case of pipeline/build scripts.
No mail will be sent out, as 'CXF » CXF-4.1.x-fixes-JDK17-deploy » JAX-RS WebSocket WebApp Demo #1160' does not have a result yet. Please make sure you set a proper result in case of pipeline/build scripts.
No mail will be sent out, as 'CXF » CXF-4.1.x-fixes-JDK17-deploy » JAX-RS Demo Using Distributed Tracing with OpenTelemetry API, Apache Camel and Jaeger #1160' does not have a result yet. Please make sure you set a proper result in case of pipeline/build scripts.
No mail will be sent out, as 'CXF » CXF-4.1.x-fixes-JDK17-deploy » WSDL first demo using Document/Literal Style #1160' does not have a result yet. Please make sure you set a proper result in case of pipeline/build scripts.
No mail will be sent out, as 'CXF » CXF-4.1.x-fixes-JDK17-deploy » Apache CXF CDI Integration System Tests - Weld #1160' does not have a result yet. Please make sure you set a proper result in case of pipeline/build scripts.
No mail will be sent out, as 'CXF » CXF-4.1.x-fixes-JDK17-deploy » JMS Transport Queue Demo using Document-Literal Style #1160' does not have a result yet. Please make sure you set a proper result in case of pipeline/build scripts.
No mail will be sent out, as 'CXF » CXF-4.1.x-fixes-JDK17-deploy » Apache CXF Java2WS Maven2 Plugin #1160' does not have a result yet. Please make sure you set a proper result in case of pipeline/build scripts.
No mail will be sent out, as 'CXF » CXF-4.1.x-fixes-JDK17-deploy » WSDL first demo using the jms transport and jmsConfigFeature #1160' does not have a result yet. Please make sure you set a proper result in case of pipeline/build scripts.
No mail will be sent out, as 'CXF » CXF-4.1.x-fixes-JDK17-deploy » Apache CXF XKMS #1160' does not have a result yet. Please make sure you set a proper result in case of pipeline/build scripts.
No mail will be sent out, as 'CXF » CXF-4.1.x-fixes-JDK17-deploy » Apache CXF STS basic systests #1160' does not have a result yet. Please make sure you set a proper result in case of pipeline/build scripts.
No mail will be sent out, as 'CXF » CXF-4.1.x-fixes-JDK17-deploy » Apache CXF WS-Security System Tests #1160' does not have a result yet. Please make sure you set a proper result in case of pipeline/build scripts.
No mail will be sent out, as 'CXF » CXF-4.1.x-fixes-JDK17-deploy » Apache CXF WADL2Java Code Generation Maven2 Plugin #1160' does not have a result yet. Please make sure you set a proper result in case of pipeline/build scripts.
No mail will be sent out, as 'CXF » CXF-4.1.x-fixes-JDK17-deploy » Apache CXF Runtime HTTP Netty Client Transport #1160' does not have a result yet. Please make sure you set a proper result in case of pipeline/build scripts.
No mail will be sent out, as 'CXF » CXF-4.1.x-fixes-JDK17-deploy » Apache CXF Runtime JavaScript Client Generator Tests #1160' does not have a result yet. Please make sure you set a proper result in case of pipeline/build scripts.
No mail will be sent out, as 'CXF » CXF-4.1.x-fixes-JDK17-deploy » JAX-WS Asynchronous Demo using Document/Literal Style #1160' does not have a result yet. Please make sure you set a proper result in case of pipeline/build scripts.
No mail will be sent out, as 'CXF » CXF-4.1.x-fixes-JDK17-deploy » Apache CXF WS-* Specifications System Tests #1160' does not have a result yet. Please make sure you set a proper result in case of pipeline/build scripts.
No mail will be sent out, as 'CXF » CXF-4.1.x-fixes-JDK17-deploy » Apache CXF Runtime Simple Frontend #1160' does not have a result yet. Please make sure you set a proper result in case of pipeline/build scripts.
No mail will be sent out, as 'CXF » CXF-4.1.x-fixes-JDK17-deploy » Apache CXF Spring Boot Integration #1160' does not have a result yet. Please make sure you set a proper result in case of pipeline/build scripts.
No mail will be sent out, as 'CXF » CXF-4.1.x-fixes-JDK17-deploy » Apache CXF Runtime JavaScript Client Generator #1160' does not have a result yet. Please make sure you set a proper result in case of pipeline/build scripts.
No mail will be sent out, as 'CXF » CXF-4.1.x-fixes-JDK17-deploy » JAX-RS SSE/CDI Demo (Jetty 9) #1160' does not have a result yet. Please make sure you set a proper result in case of pipeline/build scripts.
No mail will be sent out, as 'CXF » CXF-4.1.x-fixes-JDK17-deploy » Java First demo using JMS #1160' does not have a result yet. Please make sure you set a proper result in case of pipeline/build scripts.
No mail will be sent out, as 'CXF » CXF-4.1.x-fixes-JDK17-deploy » Apache CXF Runtime JAXB DataBinding #1160' does not have a result yet. Please make sure you set a proper result in case of pipeline/build scripts.
No mail will be sent out, as 'CXF » CXF-4.1.x-fixes-JDK17-deploy » Apache CXF WS-Security Interop System Tests #1160' does not have a result yet. Please make sure you set a proper result in case of pipeline/build scripts.
No mail will be sent out, as 'CXF » CXF-4.1.x-fixes-JDK17-deploy » Apache CXF XKMS Common #1160' does not have a result yet. Please make sure you set a proper result in case of pipeline/build scripts.
No mail will be sent out, as 'CXF » CXF-4.1.x-fixes-JDK17-deploy » Apache CXF Runtime JAX-WS Frontend #1160' does not have a result yet. Please make sure you set a proper result in case of pipeline/build scripts.
No mail will be sent out, as 'CXF » CXF-4.1.x-fixes-JDK17-deploy » Apache CXF Runtime JOSE Core #1160' does not have a result yet. Please make sure you set a proper result in case of pipeline/build scripts.
No mail will be sent out, as 'CXF » CXF-4.1.x-fixes-JDK17-deploy » Apache CXF SSE Integration System Tests #1160' does not have a result yet. Please make sure you set a proper result in case of pipeline/build scripts.
No mail will be sent out, as 'CXF » CXF-4.1.x-fixes-JDK17-deploy » Apache CXF System Tests for Maven Plugins #1160' does not have a result yet. Please make sure you set a proper result in case of pipeline/build scripts.
No mail will be sent out, as 'CXF » CXF-4.1.x-fixes-JDK17-deploy » Apache CXF JAX-RS System Tests #1160' does not have a result yet. Please make sure you set a proper result in case of pipeline/build scripts.
No mail will be sent out, as 'CXF » CXF-4.1.x-fixes-JDK17-deploy » Apache CXF Runtime #1160' does not have a result yet. Please make sure you set a proper result in case of pipeline/build scripts.
No mail will be sent out, as 'CXF » CXF-4.1.x-fixes-JDK17-deploy » JAX-WS GraalVM Demo (capture generated classes) #1160' does not have a result yet. Please make sure you set a proper result in case of pipeline/build scripts.
No mail will be sent out, as 'CXF » CXF-4.1.x-fixes-JDK17-deploy » Apache CXF Runtime WebSocket Transport #1160' does not have a result yet. Please make sure you set a proper result in case of pipeline/build scripts.
No mail will be sent out, as 'CXF » CXF-4.1.x-fixes-JDK17-deploy » Apache CXF CDI Integration System Tests - OWB with multiple apps #1160' does not have a result yet. Please make sure you set a proper result in case of pipeline/build scripts.
No mail will be sent out, as 'CXF » CXF-4.1.x-fixes-JDK17-deploy » Apache CXF WSN Core #1160' does not have a result yet. Please make sure you set a proper result in case of pipeline/build scripts.
No mail will be sent out, as 'CXF » CXF-4.1.x-fixes-JDK17-deploy » Apache CXF CDI Integration System Tests - OWB with no apps #1160' does not have a result yet. Please make sure you set a proper result in case of pipeline/build scripts.
No mail will be sent out, as 'CXF » CXF-4.1.x-fixes-JDK17-deploy » Apache CXF XKMS Client #1160' does not have a result yet. Please make sure you set a proper result in case of pipeline/build scripts.
No mail will be sent out, as 'CXF » CXF-4.1.x-fixes-JDK17-deploy » Apache CXF Transport System Tests JMS #1160' does not have a result yet. Please make sure you set a proper result in case of pipeline/build scripts.
No mail will be sent out, as 'CXF » CXF-4.1.x-fixes-JDK17-deploy » Apache CXF Command Line Tools CORBA #1160' does not have a result yet. Please make sure you set a proper result in case of pipeline/build scripts.
No mail will be sent out, as 'CXF » CXF-4.1.x-fixes-JDK17-deploy » JAX-RS Basic Demo With HTTP/2 communications #1160' does not have a result yet. Please make sure you set a proper result in case of pipeline/build scripts.
No mail will be sent out, as 'CXF » CXF-4.1.x-fixes-JDK17-deploy » Apache CXF WS-RM Specifications System Tests #1160' does not have a result yet. Please make sure you set a proper result in case of pipeline/build scripts.
No mail will be sent out, as 'CXF » CXF-4.1.x-fixes-JDK17-deploy » Apache CXF Runtime HTTP Async Transport #1160' does not have a result yet. Please make sure you set a proper result in case of pipeline/build scripts.
No mail will be sent out, as 'CXF » CXF-4.1.x-fixes-JDK17-deploy » Apache CXF MicroProfile No-CDI/Config Sys Tests #1160' does not have a result yet. Please make sure you set a proper result in case of pipeline/build scripts.
No mail will be sent out, as 'CXF » CXF-4.1.x-fixes-JDK17-deploy » CXF WS-SecurityPolicy Signature Encryption Demo #1160' does not have a result yet. Please make sure you set a proper result in case of pipeline/build scripts.
No mail will be sent out, as 'CXF » CXF-4.1.x-fixes-JDK17-deploy » Apache CXF System Tests - MicroProfile Rest Client TCK on Weld #1160' does not have a result yet. Please make sure you set a proper result in case of pipeline/build scripts.
No mail will be sent out, as 'CXF » CXF-4.1.x-fixes-JDK17-deploy » Apache CXF WSN OSGi #1160' does not have a result yet. Please make sure you set a proper result in case of pipeline/build scripts.
No mail will be sent out, as 'CXF » CXF-4.1.x-fixes-JDK17-deploy » WS-Addressing Demo #1160' does not have a result yet. Please make sure you set a proper result in case of pipeline/build scripts.
No mail will be sent out, as 'CXF » CXF-4.1.x-fixes-JDK17-deploy » Apache CXF SSE Integration System Tests base classes #1160' does not have a result yet. Please make sure you set a proper result in case of pipeline/build scripts.
No mail will be sent out, as 'CXF » CXF-4.1.x-fixes-JDK17-deploy » Apache CXF Runtime JavaScript Client Generator Projects #1160' does not have a result yet. Please make sure you set a proper result in case of pipeline/build scripts.
No mail will be sent out, as 'CXF » CXF-4.1.x-fixes-JDK17-deploy » JAX-RS SSE Demo (Jetty 9) #1160' does not have a result yet. Please make sure you set a proper result in case of pipeline/build scripts.
No mail will be sent out, as 'CXF » CXF-4.1.x-fixes-JDK17-deploy » Apache CXF Transports Runtime #1160' does not have a result yet. Please make sure you set a proper result in case of pipeline/build scripts.
No mail will be sent out, as 'CXF » CXF-4.1.x-fixes-JDK17-deploy » Apache CXF Runtime Security functionality #1160' does not have a result yet. Please make sure you set a proper result in case of pipeline/build scripts.
No mail will be sent out, as 'CXF » CXF-4.1.x-fixes-JDK17-deploy » Apache CXF STS test OSGi deployment #1160' does not have a result yet. Please make sure you set a proper result in case of pipeline/build scripts.
No mail will be sent out, as 'CXF » CXF-4.1.x-fixes-JDK17-deploy » JAX-RS Content Negotiation Demo #1160' does not have a result yet. Please make sure you set a proper result in case of pipeline/build scripts.
No mail will be sent out, as 'CXF » CXF-4.1.x-fixes-JDK17-deploy » Apache CXF WS-Discovery #1160' does not have a result yet. Please make sure you set a proper result in case of pipeline/build scripts.
No mail will be sent out, as 'CXF » CXF-4.1.x-fixes-JDK17-deploy » Apache CXF Distributed Tracing using OpenZipkin Brave #1160' does not have a result yet. Please make sure you set a proper result in case of pipeline/build scripts.
No mail will be sent out, as 'CXF » CXF-4.1.x-fixes-JDK17-deploy » Apache CXF Manifest Jar #1160' does not have a result yet. Please make sure you set a proper result in case of pipeline/build scripts.
No mail will be sent out, as 'CXF » CXF-4.1.x-fixes-JDK17-deploy » JAX-RS OData #1160' does not have a result yet. Please make sure you set a proper result in case of pipeline/build scripts.
No mail will be sent out, as 'CXF » CXF-4.1.x-fixes-JDK17-deploy » Apache CXF Runtime OAuth 2.0 #1160' does not have a result yet. Please make sure you set a proper result in case of pipeline/build scripts.
No mail will be sent out, as 'CXF » CXF-4.1.x-fixes-JDK17-deploy » Test for generating code from wsdl in repo #1160' does not have a result yet. Please make sure you set a proper result in case of pipeline/build scripts.
No mail will be sent out, as 'CXF » CXF-4.1.x-fixes-JDK17-deploy » Apache CXF Web Services Runtime #1160' does not have a result yet. Please make sure you set a proper result in case of pipeline/build scripts.
No mail will be sent out, as 'CXF » CXF-4.1.x-fixes-JDK17-deploy » Apache CXF Runtime OAuth 2.0 SAML #1160' does not have a result yet. Please make sure you set a proper result in case of pipeline/build scripts.
No mail will be sent out, as 'CXF » CXF-4.1.x-fixes-JDK17-deploy » Apache CXF Runtime HTTP Jetty Transport #1160' does not have a result yet. Please make sure you set a proper result in case of pipeline/build scripts.
No mail will be sent out, as 'CXF » CXF-4.1.x-fixes-JDK17-deploy » Test for writing wsdl to repo #1160' does not have a result yet. Please make sure you set a proper result in case of pipeline/build scripts.
No mail will be sent out, as 'CXF » CXF-4.1.x-fixes-JDK17-deploy » Apache CXF Command Line Tools #1160' does not have a result yet. Please make sure you set a proper result in case of pipeline/build scripts.
No mail will be sent out, as 'CXF » CXF-4.1.x-fixes-JDK17-deploy » Bank sample using JAX-WS API's to talk via CORBA/IIOP #1160' does not have a result yet. Please make sure you set a proper result in case of pipeline/build scripts.
No mail will be sent out, as 'CXF » CXF-4.1.x-fixes-JDK17-deploy » Sample using SOAP Headers #1160' does not have a result yet. Please make sure you set a proper result in case of pipeline/build scripts.
No mail will be sent out, as 'CXF » CXF-4.1.x-fixes-JDK17-deploy » Apache CXF Parent #1160' does not have a result yet. Please make sure you set a proper result in case of pipeline/build scripts.
No mail will be sent out, as 'CXF » CXF-4.1.x-fixes-JDK17-deploy » Apache CXF Maven Plugins #1160' does not have a result yet. Please make sure you set a proper result in case of pipeline/build scripts.
No mail will be sent out, as 'CXF » CXF-4.1.x-fixes-JDK17-deploy » Apache CXF Archetype - Simple JAX-WS Java First #1160' does not have a result yet. Please make sure you set a proper result in case of pipeline/build scripts.
No mail will be sent out, as 'CXF » CXF-4.1.x-fixes-JDK17-deploy » JAX-RS WebSocket Demo #1160' does not have a result yet. Please make sure you set a proper result in case of pipeline/build scripts.
No mail will be sent out, as 'CXF » CXF-4.1.x-fixes-JDK17-deploy » JAX-RS Basic Demo With HTTP/2 communications #1160' does not have a result yet. Please make sure you set a proper result in case of pipeline/build scripts.
No mail will be sent out, as 'CXF » CXF-4.1.x-fixes-JDK17-deploy » JAX-RS Basic With HTTPS communications #1160' does not have a result yet. Please make sure you set a proper result in case of pipeline/build scripts.
No mail will be sent out, as 'CXF » CXF-4.1.x-fixes-JDK17-deploy » Java First demo using JAX-WS APIs #1160' does not have a result yet. Please make sure you set a proper result in case of pipeline/build scripts.
No mail will be sent out, as 'CXF » CXF-4.1.x-fixes-JDK17-deploy » JAX-RS SSE Client Demo (Tomcat 8) #1160' does not have a result yet. Please make sure you set a proper result in case of pipeline/build scripts.
No mail will be sent out, as 'CXF » CXF-4.1.x-fixes-JDK17-deploy » JAX-WS Handler Demo #1160' does not have a result yet. Please make sure you set a proper result in case of pipeline/build scripts.
No mail will be sent out, as 'CXF » CXF-4.1.x-fixes-JDK17-deploy » Spring Boot CXF Web Services Transaction Sample #1160' does not have a result yet. Please make sure you set a proper result in case of pipeline/build scripts.
No mail will be sent out, as 'CXF » CXF-4.1.x-fixes-JDK17-deploy » Apache CXF Netty Transport System Tests #1160' does not have a result yet. Please make sure you set a proper result in case of pipeline/build scripts.
No mail will be sent out, as 'CXF » CXF-4.1.x-fixes-JDK17-deploy » Apache CXF Command Line Tools JavaTo WS #1160' does not have a result yet. Please make sure you set a proper result in case of pipeline/build scripts.
No mail will be sent out, as 'CXF » CXF-4.1.x-fixes-JDK17-deploy » Apache CXF Runtime HTTP Netty Server Transport #1160' does not have a result yet. Please make sure you set a proper result in case of pipeline/build scripts.
No mail will be sent out, as 'CXF » CXF-4.1.x-fixes-JDK17-deploy » Apache CXF LDAP Integration System Tests #1160' does not have a result yet. Please make sure you set a proper result in case of pipeline/build scripts.
No mail will be sent out, as 'CXF » CXF-4.1.x-fixes-JDK17-deploy » JAX-RS Basic Demo With HTTP/2 communications #1160' does not have a result yet. Please make sure you set a proper result in case of pipeline/build scripts.
No mail will be sent out, as 'CXF » CXF-4.1.x-fixes-JDK17-deploy » SOAP/JMS Transport Specification Demo using Document-Literal Style #1160' does not have a result yet. Please make sure you set a proper result in case of pipeline/build scripts.
No mail will be sent out, as 'CXF » CXF-4.1.x-fixes-JDK17-deploy » Apache CXF Distributed Tracing using OpenTracing #1160' does not have a result yet. Please make sure you set a proper result in case of pipeline/build scripts.
No mail will be sent out, as 'CXF » CXF-4.1.x-fixes-JDK17-deploy » Colocated Demo using Document/Literal Style #1160' does not have a result yet. Please make sure you set a proper result in case of pipeline/build scripts.
No mail will be sent out, as 'CXF » CXF-4.1.x-fixes-JDK17-deploy » Apache CXF Runtime HTTP Transport #1160' does not have a result yet. Please make sure you set a proper result in case of pipeline/build scripts.
No mail will be sent out, as 'CXF » CXF-4.1.x-fixes-JDK17-deploy » Apache CXF Observability using Micrometer Observation #1160' does not have a result yet. Please make sure you set a proper result in case of pipeline/build scripts.
No mail will be sent out, as 'CXF » CXF-4.1.x-fixes-JDK17-deploy » Apache CXF JAX-RS Service Description OpenAPI/Swagger Common #1160' does not have a result yet. Please make sure you set a proper result in case of pipeline/build scripts.
No mail will be sent out, as 'CXF » CXF-4.1.x-fixes-JDK17-deploy » Apache CXF SSE Integration System Tests for Undertow #1160' does not have a result yet. Please make sure you set a proper result in case of pipeline/build scripts.
ERROR: Failed to parse POMs
java.io.IOException: java.lang.reflect.InvocationTargetException
	at PluginClassLoader for maven-plugin//hudson.maven.Maven3Builder.call(Maven3Builder.java:178)
	at PluginClassLoader for maven-plugin//hudson.maven.Maven3Builder.call(Maven3Builder.java:71)
	at hudson.remoting.UserRequest.perform(UserRequest.java:225)
	at hudson.remoting.UserRequest.perform(UserRequest.java:50)
	at hudson.remoting.Request$2.run(Request.java:391)
	at hudson.remoting.InterceptingExecutorService.lambda$wrap$0(InterceptingExecutorService.java:81)
	at java.base/java.util.concurrent.FutureTask.run(FutureTask.java:264)
	at java.base/java.util.concurrent.ThreadPoolExecutor.runWorker(ThreadPoolExecutor.java:1136)
	at java.base/java.util.concurrent.ThreadPoolExecutor$Worker.run(ThreadPoolExecutor.java:635)
	at java.base/java.lang.Thread.run(Thread.java:840)
	Suppressed: hudson.remoting.Channel$CallSiteStackTrace: Remote call to Channel to Maven [/home/jenkins/tools/java/latest17/bin/java, -da, -dsa, -Xmx1024M, -cp, /home/jenkins/jenkins-agent/maven35-agent.jar:/home/jenkins/tools/maven/latest3/boot/plexus-classworlds-2.12.1.jar:/home/jenkins/tools/maven/latest3/conf/logging, jenkins.maven3.agent.Maven35Main, /home/jenkins/tools/maven/latest3, /home/jenkins/jenkins-agent/agent.jar, /home/jenkins/jenkins-agent/maven35-interceptor.jar, /home/jenkins/jenkins-agent/maven3-interceptor-commons.jar, 33571]
		at hudson.remoting.Channel.attachCallSiteStackTrace(Channel.java:1923)
		at hudson.remoting.UserRequest$ExceptionResponse.retrieve(UserRequest.java:384)
		at hudson.remoting.Channel.call(Channel.java:1112)
		at PluginClassLoader for maven-plugin//hudson.maven.ProcessCache$MavenProcess.call(ProcessCache.java:161)
		at PluginClassLoader for maven-plugin//hudson.maven.MavenModuleSetBuild$MavenModuleSetBuildExecution.doRun(MavenModuleSetBuild.java:877)
		at hudson.model.AbstractBuild$AbstractBuildExecution.run(AbstractBuild.java:527)
		at hudson.model.Run.execute(Run.java:1833)
		at PluginClassLoader for maven-plugin//hudson.maven.MavenModuleSetBuild.run(MavenModuleSetBuild.java:543)
		at hudson.model.ResourceController.execute(ResourceController.java:101)
		at hudson.model.Executor.run(Executor.java:446)
Caused by: java.lang.reflect.InvocationTargetException
	at java.base/jdk.internal.reflect.NativeMethodAccessorImpl.invoke0(Native Method)
	at java.base/jdk.internal.reflect.NativeMethodAccessorImpl.invoke(NativeMethodAccessorImpl.java:77)
	at java.base/jdk.internal.reflect.DelegatingMethodAccessorImpl.invoke(DelegatingMethodAccessorImpl.java:43)
	at java.base/java.lang.reflect.Method.invoke(Method.java:569)
	at PluginClassLoader for maven-plugin//hudson.maven.Maven3Builder.call(Maven3Builder.java:140)
	... 9 more
Caused by: java.lang.Exception: java.lang.reflect.InvocationTargetException
	at jenkins.maven3.agent.Maven35Main.launch(Maven35Main.java:182)
	... 14 more
Caused by: java.lang.reflect.InvocationTargetException
	at java.base/jdk.internal.reflect.NativeMethodAccessorImpl.invoke0(Native Method)
	at java.base/jdk.internal.reflect.NativeMethodAccessorImpl.invoke(NativeMethodAccessorImpl.java:77)
	at java.base/jdk.internal.reflect.DelegatingMethodAccessorImpl.invoke(DelegatingMethodAccessorImpl.java:43)
	at java.base/java.lang.reflect.Method.invoke(Method.java:569)
	at org.codehaus.plexus.classworlds.launcher.Launcher.launchEnhanced(Launcher.java:255)
	at org.codehaus.plexus.classworlds.launcher.Launcher.launch(Launcher.java:201)
	at jenkins.maven3.agent.Maven35Main.launch(Maven35Main.java:179)
	... 14 more
Caused by: java.lang.UnsupportedOperationException
	at org.eclipse.sisu.wire.EntryListAdapter$ValueListIterator.add(EntryListAdapter.java:185)
	at java.base/java.util.AbstractSequentialList.add(AbstractSequentialList.java:146)
	at java.base/java.util.AbstractList.add(AbstractList.java:111)
	at java.base/java.util.AbstractCollection.addAll(AbstractCollection.java:336)
	at org.jvnet.hudson.maven3.launcher.Maven35Launcher.main(Maven35Launcher.java:127)
	... 21 more
channel stopped

Build failed in Jenkins: CXF » CXF-4.1.x-fixes-JDK17-deploy #1159

Posted by Apache Jenkins Server <je...@builds.apache.org>.
See <https://ci-builds.apache.org/job/CXF/job/CXF-4.1.x-fixes-JDK17-deploy/1159/display/redirect?page=changes>

Changes:

[Colm O hEigeartaigh] Make JCacheReplayCache replay checks atomic (#3622)


------------------------------------------
[...truncated 22.71 KiB...]
No mail will be sent out, as 'CXF » CXF-4.1.x-fixes-JDK17-deploy » Apache CXF Distributed Tracing Integration System Tests #1159' does not have a result yet. Please make sure you set a proper result in case of pipeline/build scripts.
No mail will be sent out, as 'CXF » CXF-4.1.x-fixes-JDK17-deploy » Apache CXF STS Core #1159' does not have a result yet. Please make sure you set a proper result in case of pipeline/build scripts.
No mail will be sent out, as 'CXF » CXF-4.1.x-fixes-JDK17-deploy » Apache CXF Integration #1159' does not have a result yet. Please make sure you set a proper result in case of pipeline/build scripts.
No mail will be sent out, as 'CXF » CXF-4.1.x-fixes-JDK17-deploy » JAX-RS Demo Using Distributed Tracing with Micrometer Observation #1159' does not have a result yet. Please make sure you set a proper result in case of pipeline/build scripts.
No mail will be sent out, as 'CXF » CXF-4.1.x-fixes-JDK17-deploy » JavaScript Client Demo using Document/Literal Style #1159' does not have a result yet. Please make sure you set a proper result in case of pipeline/build scripts.
No mail will be sent out, as 'CXF » CXF-4.1.x-fixes-JDK17-deploy » Apache CXF RS SSO SAML #1159' does not have a result yet. Please make sure you set a proper result in case of pipeline/build scripts.
No mail will be sent out, as 'CXF » CXF-4.1.x-fixes-JDK17-deploy » Apache CXF SSE Integration System Tests for Jetty #1159' does not have a result yet. Please make sure you set a proper result in case of pipeline/build scripts.
No mail will be sent out, as 'CXF » CXF-4.1.x-fixes-JDK17-deploy » Apache CXF CDI Integration System Tests - Weld with producers #1159' does not have a result yet. Please make sure you set a proper result in case of pipeline/build scripts.
No mail will be sent out, as 'CXF » CXF-4.1.x-fixes-JDK17-deploy » Apache CXF JOSE Security parent #1159' does not have a result yet. Please make sure you set a proper result in case of pipeline/build scripts.
No mail will be sent out, as 'CXF » CXF-4.1.x-fixes-JDK17-deploy » Apache CXF RS XML Security #1159' does not have a result yet. Please make sure you set a proper result in case of pipeline/build scripts.
No mail will be sent out, as 'CXF » CXF-4.1.x-fixes-JDK17-deploy » JAX-WS Dispatch/Provider Demo #1159' does not have a result yet. Please make sure you set a proper result in case of pipeline/build scripts.
No mail will be sent out, as 'CXF » CXF-4.1.x-fixes-JDK17-deploy » Apache CXF WSN API #1159' does not have a result yet. Please make sure you set a proper result in case of pipeline/build scripts.
No mail will be sent out, as 'CXF » CXF-4.1.x-fixes-JDK17-deploy » Apache CXF Runtime XML Binding #1159' does not have a result yet. Please make sure you set a proper result in case of pipeline/build scripts.
No mail will be sent out, as 'CXF » CXF-4.1.x-fixes-JDK17-deploy » Apache CXF Runtime Management #1159' does not have a result yet. Please make sure you set a proper result in case of pipeline/build scripts.
No mail will be sent out, as 'CXF » CXF-4.1.x-fixes-JDK17-deploy » Apache CXF Command Line Tools WADLTo JAXRS Frontend #1159' does not have a result yet. Please make sure you set a proper result in case of pipeline/build scripts.
No mail will be sent out, as 'CXF » CXF-4.1.x-fixes-JDK17-deploy » Apache CXF SSE Integration System Tests for Tomcat #1159' does not have a result yet. Please make sure you set a proper result in case of pipeline/build scripts.
No mail will be sent out, as 'CXF » CXF-4.1.x-fixes-JDK17-deploy » Spring HTTP Servlet demo with groovy support #1159' does not have a result yet. Please make sure you set a proper result in case of pipeline/build scripts.
No mail will be sent out, as 'CXF » CXF-4.1.x-fixes-JDK17-deploy » Sample of JAX-* Service Using an Aegis Client #1159' does not have a result yet. Please make sure you set a proper result in case of pipeline/build scripts.
No mail will be sent out, as 'CXF » CXF-4.1.x-fixes-JDK17-deploy » JAX-RS Demo Using Distributed Tracing with OpenTracing API and Jaeger #1159' does not have a result yet. Please make sure you set a proper result in case of pipeline/build scripts.
No mail will be sent out, as 'CXF » CXF-4.1.x-fixes-JDK17-deploy » Eureka Registry for CXF SpringBoot demos #1159' does not have a result yet. Please make sure you set a proper result in case of pipeline/build scripts.
No mail will be sent out, as 'CXF » CXF-4.1.x-fixes-JDK17-deploy » Apache CXF Spring Boot Autoconfigure #1159' does not have a result yet. Please make sure you set a proper result in case of pipeline/build scripts.
No mail will be sent out, as 'CXF » CXF-4.1.x-fixes-JDK17-deploy » JAX-RS Basic Demo #1159' does not have a result yet. Please make sure you set a proper result in case of pipeline/build scripts.
No mail will be sent out, as 'CXF » CXF-4.1.x-fixes-JDK17-deploy » Apache CXF Command Line Tools WADLTo #1159' does not have a result yet. Please make sure you set a proper result in case of pipeline/build scripts.
No mail will be sent out, as 'CXF » CXF-4.1.x-fixes-JDK17-deploy » JAX-RS Demo Using Distributed Tracing with OpenZipkin Brave #1159' does not have a result yet. Please make sure you set a proper result in case of pipeline/build scripts.
No mail will be sent out, as 'CXF » CXF-4.1.x-fixes-JDK17-deploy » Apache CXF MicroProfile Tracing integration Sys Tests #1159' does not have a result yet. Please make sure you set a proper result in case of pipeline/build scripts.
No mail will be sent out, as 'CXF » CXF-4.1.x-fixes-JDK17-deploy » Hello World Client Demo using JavaScript #1159' does not have a result yet. Please make sure you set a proper result in case of pipeline/build scripts.
No mail will be sent out, as 'CXF » CXF-4.1.x-fixes-JDK17-deploy » Apache CXF JAX-RS Servlet Container Initializer #1159' does not have a result yet. Please make sure you set a proper result in case of pipeline/build scripts.
No mail will be sent out, as 'CXF » CXF-4.1.x-fixes-JDK17-deploy » Apache CXF WS-Transfer System Tests #1159' does not have a result yet. Please make sure you set a proper result in case of pipeline/build scripts.
No mail will be sent out, as 'CXF » CXF-4.1.x-fixes-JDK17-deploy » JAX-RS Basic Oidc Demo #1159' does not have a result yet. Please make sure you set a proper result in case of pipeline/build scripts.
No mail will be sent out, as 'CXF » CXF-4.1.x-fixes-JDK17-deploy » Apache CXF Runtime WS Addressing #1159' does not have a result yet. Please make sure you set a proper result in case of pipeline/build scripts.
No mail will be sent out, as 'CXF » CXF-4.1.x-fixes-JDK17-deploy » Apache CXF Command Line Tools WSDLTo #1159' does not have a result yet. Please make sure you set a proper result in case of pipeline/build scripts.
No mail will be sent out, as 'CXF » CXF-4.1.x-fixes-JDK17-deploy » JAX-RS Spring Security Demo #1159' does not have a result yet. Please make sure you set a proper result in case of pipeline/build scripts.
No mail will be sent out, as 'CXF » CXF-4.1.x-fixes-JDK17-deploy » Apache CXF BOM #1159' does not have a result yet. Please make sure you set a proper result in case of pipeline/build scripts.
No mail will be sent out, as 'CXF » CXF-4.1.x-fixes-JDK17-deploy » Apache CXF Command Line Tools WSDL to JavaScript Front End #1159' does not have a result yet. Please make sure you set a proper result in case of pipeline/build scripts.
No mail will be sent out, as 'CXF » CXF-4.1.x-fixes-JDK17-deploy » JAX-RS Basic Demo #1159' does not have a result yet. Please make sure you set a proper result in case of pipeline/build scripts.
No mail will be sent out, as 'CXF » CXF-4.1.x-fixes-JDK17-deploy » CXF WS-Security UT Demo #1159' does not have a result yet. Please make sure you set a proper result in case of pipeline/build scripts.
No mail will be sent out, as 'CXF » CXF-4.1.x-fixes-JDK17-deploy » WS-SecurityPolicy UT Demo #1159' does not have a result yet. Please make sure you set a proper result in case of pipeline/build scripts.
No mail will be sent out, as 'CXF » CXF-4.1.x-fixes-JDK17-deploy » Apache CXF Runtime Local Transport #1159' does not have a result yet. Please make sure you set a proper result in case of pipeline/build scripts.
No mail will be sent out, as 'CXF » CXF-4.1.x-fixes-JDK17-deploy » Spring Boot CXF Web Services Sample #1159' does not have a result yet. Please make sure you set a proper result in case of pipeline/build scripts.
No mail will be sent out, as 'CXF » CXF-4.1.x-fixes-JDK17-deploy » CXF sample using WRAPPED Style in XML Binding (pure XML over HTTP) #1159' does not have a result yet. Please make sure you set a proper result in case of pipeline/build scripts.
No mail will be sent out, as 'CXF » CXF-4.1.x-fixes-JDK17-deploy » CXF Sample of Stream GZIP Interceptor #1159' does not have a result yet. Please make sure you set a proper result in case of pipeline/build scripts.
No mail will be sent out, as 'CXF » CXF-4.1.x-fixes-JDK17-deploy » Java First demo service using the JAXWSFactoryBeans #1159' does not have a result yet. Please make sure you set a proper result in case of pipeline/build scripts.
No mail will be sent out, as 'CXF » CXF-4.1.x-fixes-JDK17-deploy » Hello world javascript demo #1159' does not have a result yet. Please make sure you set a proper result in case of pipeline/build scripts.
No mail will be sent out, as 'CXF » CXF-4.1.x-fixes-JDK17-deploy » Apache CXF Runtime JAX-RS Frontend #1159' does not have a result yet. Please make sure you set a proper result in case of pipeline/build scripts.
No mail will be sent out, as 'CXF » CXF-4.1.x-fixes-JDK17-deploy » Apache CXF JAX-RS Extensions: Project Reactor #1159' does not have a result yet. Please make sure you set a proper result in case of pipeline/build scripts.
No mail will be sent out, as 'CXF » CXF-4.1.x-fixes-JDK17-deploy » Apache CXF JAX-RS Service Description OpenAPI v3 #1159' does not have a result yet. Please make sure you set a proper result in case of pipeline/build scripts.
No mail will be sent out, as 'CXF » CXF-4.1.x-fixes-JDK17-deploy » WS-Eventing Demo #1159' does not have a result yet. Please make sure you set a proper result in case of pipeline/build scripts.
No mail will be sent out, as 'CXF » CXF-4.1.x-fixes-JDK17-deploy » Apache CXF JAX-RS Extensions: Search #1159' does not have a result yet. Please make sure you set a proper result in case of pipeline/build scripts.
No mail will be sent out, as 'CXF » CXF-4.1.x-fixes-JDK17-deploy » Apache CXF JAX-RS Service Description #1159' does not have a result yet. Please make sure you set a proper result in case of pipeline/build scripts.
No mail will be sent out, as 'CXF » CXF-4.1.x-fixes-JDK17-deploy » Apache CXF Runtime Bindings #1159' does not have a result yet. Please make sure you set a proper result in case of pipeline/build scripts.
No mail will be sent out, as 'CXF » CXF-4.1.x-fixes-JDK17-deploy » Apache CXF MicroProfile JAX-RS integration Sys Tests #1159' does not have a result yet. Please make sure you set a proper result in case of pipeline/build scripts.
No mail will be sent out, as 'CXF » CXF-4.1.x-fixes-JDK17-deploy » JAX-WS GraalVM Demo #1159' does not have a result yet. Please make sure you set a proper result in case of pipeline/build scripts.
No mail will be sent out, as 'CXF » CXF-4.1.x-fixes-JDK17-deploy » JMS Transport Publish/Subscribe Demo using Document-Literal Style #1159' does not have a result yet. Please make sure you set a proper result in case of pipeline/build scripts.
No mail will be sent out, as 'CXF » CXF-4.1.x-fixes-JDK17-deploy » Bank sample using JAX-WS API's to talk via CORBA/IIOP #1159' does not have a result yet. Please make sure you set a proper result in case of pipeline/build scripts.
No mail will be sent out, as 'CXF » CXF-4.1.x-fixes-JDK17-deploy » JAX-RS Open API 3.0 Demo #1159' does not have a result yet. Please make sure you set a proper result in case of pipeline/build scripts.
No mail will be sent out, as 'CXF » CXF-4.1.x-fixes-JDK17-deploy » Apache CXF Spring Boot Starter JAX-RS #1159' does not have a result yet. Please make sure you set a proper result in case of pipeline/build scripts.
No mail will be sent out, as 'CXF » CXF-4.1.x-fixes-JDK17-deploy » Apache CXF Java2WADL Maven2 Plugin #1159' does not have a result yet. Please make sure you set a proper result in case of pipeline/build scripts.
No mail will be sent out, as 'CXF » CXF-4.1.x-fixes-JDK17-deploy » Apache CXF Container Integration Test Grizzly #1159' does not have a result yet. Please make sure you set a proper result in case of pipeline/build scripts.
No mail will be sent out, as 'CXF » CXF-4.1.x-fixes-JDK17-deploy » Apache CXF Runtime CORBA Binding #1159' does not have a result yet. Please make sure you set a proper result in case of pipeline/build scripts.
No mail will be sent out, as 'CXF » CXF-4.1.x-fixes-JDK17-deploy » Apache CXF Runtime Http-Signature #1159' does not have a result yet. Please make sure you set a proper result in case of pipeline/build scripts.
No mail will be sent out, as 'CXF » CXF-4.1.x-fixes-JDK17-deploy » Generated JavaScript Sample using JAX-WS and JSR-181 #1159' does not have a result yet. Please make sure you set a proper result in case of pipeline/build scripts.
No mail will be sent out, as 'CXF » CXF-4.1.x-fixes-JDK17-deploy » JAX-WS GraalVM Demo (capture generated classes) #1159' does not have a result yet. Please make sure you set a proper result in case of pipeline/build scripts.
No mail will be sent out, as 'CXF » CXF-4.1.x-fixes-JDK17-deploy » Apache CXF Maven Archetypes #1159' does not have a result yet. Please make sure you set a proper result in case of pipeline/build scripts.
No mail will be sent out, as 'CXF » CXF-4.1.x-fixes-JDK17-deploy » Apache CXF MicroProfile Async Sys Tests #1159' does not have a result yet. Please make sure you set a proper result in case of pipeline/build scripts.
No mail will be sent out, as 'CXF » CXF-4.1.x-fixes-JDK17-deploy » Apache CXF Runtime SOAP Binding #1159' does not have a result yet. Please make sure you set a proper result in case of pipeline/build scripts.
No mail will be sent out, as 'CXF » CXF-4.1.x-fixes-JDK17-deploy » Apache CXF WSN service #1159' does not have a result yet. Please make sure you set a proper result in case of pipeline/build scripts.
No mail will be sent out, as 'CXF » CXF-4.1.x-fixes-JDK17-deploy » Apache CXF JAX-RS Service Description Microprofile OpenAPI #1159' does not have a result yet. Please make sure you set a proper result in case of pipeline/build scripts.
No mail will be sent out, as 'CXF » CXF-4.1.x-fixes-JDK17-deploy » Apache CXF STS service #1159' does not have a result yet. Please make sure you set a proper result in case of pipeline/build scripts.
No mail will be sent out, as 'CXF » CXF-4.1.x-fixes-JDK17-deploy » Apache CXF Runtime OpenId Connect #1159' does not have a result yet. Please make sure you set a proper result in case of pipeline/build scripts.
No mail will be sent out, as 'CXF » CXF-4.1.x-fixes-JDK17-deploy » Apache CXF MicroProfile TCKs #1159' does not have a result yet. Please make sure you set a proper result in case of pipeline/build scripts.
No mail will be sent out, as 'CXF » CXF-4.1.x-fixes-JDK17-deploy » Apache CXF Runtime WS Transfer #1159' does not have a result yet. Please make sure you set a proper result in case of pipeline/build scripts.
No mail will be sent out, as 'CXF » CXF-4.1.x-fixes-JDK17-deploy » Apache CXF JAX-RS Extensions: Reactive Streams #1159' does not have a result yet. Please make sure you set a proper result in case of pipeline/build scripts.
No mail will be sent out, as 'CXF » CXF-4.1.x-fixes-JDK17-deploy » Apache CXF Uncategorized System Tests #1159' does not have a result yet. Please make sure you set a proper result in case of pipeline/build scripts.
No mail will be sent out, as 'CXF » CXF-4.1.x-fixes-JDK17-deploy » Apache CXF Runtime Core for WSDL #1159' does not have a result yet. Please make sure you set a proper result in case of pipeline/build scripts.
No mail will be sent out, as 'CXF » CXF-4.1.x-fixes-JDK17-deploy » Apache CXF XKMS Service #1159' does not have a result yet. Please make sure you set a proper result in case of pipeline/build scripts.
No mail will be sent out, as 'CXF » CXF-4.1.x-fixes-JDK17-deploy » Apache CXF Command Line Tools Common #1159' does not have a result yet. Please make sure you set a proper result in case of pipeline/build scripts.
No mail will be sent out, as 'CXF » CXF-4.1.x-fixes-JDK17-deploy » Apache CXF Command Line Tools WSDLTo Core #1159' does not have a result yet. Please make sure you set a proper result in case of pipeline/build scripts.
No mail will be sent out, as 'CXF » CXF-4.1.x-fixes-JDK17-deploy » Apache CXF Services #1159' does not have a result yet. Please make sure you set a proper result in case of pipeline/build scripts.
No mail will be sent out, as 'CXF » CXF-4.1.x-fixes-JDK17-deploy » Apache CXF JAX-WS System Tests #1159' does not have a result yet. Please make sure you set a proper result in case of pipeline/build scripts.
No mail will be sent out, as 'CXF » CXF-4.1.x-fixes-JDK17-deploy » Apache CXF Command Line Tools WSDLTo JAXWS Frontend #1159' does not have a result yet. Please make sure you set a proper result in case of pipeline/build scripts.
No mail will be sent out, as 'CXF » CXF-4.1.x-fixes-JDK17-deploy » Apache CXF Samples #1159' does not have a result yet. Please make sure you set a proper result in case of pipeline/build scripts.
No mail will be sent out, as 'CXF » CXF-4.1.x-fixes-JDK17-deploy » Spring HTTP Servlet demo with ruby support #1159' does not have a result yet. Please make sure you set a proper result in case of pipeline/build scripts.
No mail will be sent out, as 'CXF » CXF-4.1.x-fixes-JDK17-deploy » Apache CXF JAX-RS Service Description Swagger UI integration #1159' does not have a result yet. Please make sure you set a proper result in case of pipeline/build scripts.
No mail will be sent out, as 'CXF » CXF-4.1.x-fixes-JDK17-deploy » Apache CXF Runtime Clustering #1159' does not have a result yet. Please make sure you set a proper result in case of pipeline/build scripts.
No mail will be sent out, as 'CXF » CXF-4.1.x-fixes-JDK17-deploy » Apache CXF CDI Integration System Tests - OWB with producers #1159' does not have a result yet. Please make sure you set a proper result in case of pipeline/build scripts.
No mail will be sent out, as 'CXF » CXF-4.1.x-fixes-JDK17-deploy » Apache CXF Archetype - Simple JAX-RS webapp #1159' does not have a result yet. Please make sure you set a proper result in case of pipeline/build scripts.
No mail will be sent out, as 'CXF » CXF-4.1.x-fixes-JDK17-deploy » Apache CXF Databinding System Tests #1159' does not have a result yet. Please make sure you set a proper result in case of pipeline/build scripts.
No mail will be sent out, as 'CXF » CXF-4.1.x-fixes-JDK17-deploy » CXF sample using the Aegis Binding without any webservice #1159' does not have a result yet. Please make sure you set a proper result in case of pipeline/build scripts.
No mail will be sent out, as 'CXF » CXF-4.1.x-fixes-JDK17-deploy » Apache CXF Advanced Logging Feature #1159' does not have a result yet. Please make sure you set a proper result in case of pipeline/build scripts.
No mail will be sent out, as 'CXF » CXF-4.1.x-fixes-JDK17-deploy » Apache CXF CDI Integration System Tests - Weld with no apps #1159' does not have a result yet. Please make sure you set a proper result in case of pipeline/build scripts.
No mail will be sent out, as 'CXF » CXF-4.1.x-fixes-JDK17-deploy » JAX-RS Big Query Demo #1159' does not have a result yet. Please make sure you set a proper result in case of pipeline/build scripts.
No mail will be sent out, as 'CXF » CXF-4.1.x-fixes-JDK17-deploy » JAX-RS Demo Using Distributed Tracing with OpenTelemetry #1159' does not have a result yet. Please make sure you set a proper result in case of pipeline/build scripts.
No mail will be sent out, as 'CXF » CXF-4.1.x-fixes-JDK17-deploy » Apache CXF Runtime WS Policy #1159' does not have a result yet. Please make sure you set a proper result in case of pipeline/build scripts.
No mail will be sent out, as 'CXF » CXF-4.1.x-fixes-JDK17-deploy » JAX-RS Open API 3.0 Demo #1159' does not have a result yet. Please make sure you set a proper result in case of pipeline/build scripts.
No mail will be sent out, as 'CXF » CXF-4.1.x-fixes-JDK17-deploy » Apache CXF Kerberos Integration System Tests #1159' does not have a result yet. Please make sure you set a proper result in case of pipeline/build scripts.
No mail will be sent out, as 'CXF » CXF-4.1.x-fixes-JDK17-deploy » Apache CXF STS advanced systests #1159' does not have a result yet. Please make sure you set a proper result in case of pipeline/build scripts.
No mail will be sent out, as 'CXF » CXF-4.1.x-fixes-JDK17-deploy » Apache CXF Servlet Container Initializer Integration System Tests #1159' does not have a result yet. Please make sure you set a proper result in case of pipeline/build scripts.
No mail will be sent out, as 'CXF » CXF-4.1.x-fixes-JDK17-deploy » Apache CXF WS-Discovery API #1159' does not have a result yet. Please make sure you set a proper result in case of pipeline/build scripts.
No mail will be sent out, as 'CXF » CXF-4.1.x-fixes-JDK17-deploy » Apache CXF JAX-RS System Advanced Security Tests #1159' does not have a result yet. Please make sure you set a proper result in case of pipeline/build scripts.
No mail will be sent out, as 'CXF » CXF-4.1.x-fixes-JDK17-deploy » JAX-RS Swagger2 Spring Demo #1159' does not have a result yet. Please make sure you set a proper result in case of pipeline/build scripts.
No mail will be sent out, as 'CXF » CXF-4.1.x-fixes-JDK17-deploy » Spring HTTP Sample #1159' does not have a result yet. Please make sure you set a proper result in case of pipeline/build scripts.
No mail will be sent out, as 'CXF » CXF-4.1.x-fixes-JDK17-deploy » Apache CXF Throttling Feature #1159' does not have a result yet. Please make sure you set a proper result in case of pipeline/build scripts.
No mail will be sent out, as 'CXF » CXF-4.1.x-fixes-JDK17-deploy » WS-Policy Demo #1159' does not have a result yet. Please make sure you set a proper result in case of pipeline/build scripts.
No mail will be sent out, as 'CXF » CXF-4.1.x-fixes-JDK17-deploy » Apache CXF Features Runtime #1159' does not have a result yet. Please make sure you set a proper result in case of pipeline/build scripts.
No mail will be sent out, as 'CXF » CXF-4.1.x-fixes-JDK17-deploy » Spring Boot CXF Second Web Services #1159' does not have a result yet. Please make sure you set a proper result in case of pipeline/build scripts.
No mail will be sent out, as 'CXF » CXF-4.1.x-fixes-JDK17-deploy » Apache CXF Distributed Tracing using OpenTelemetry #1159' does not have a result yet. Please make sure you set a proper result in case of pipeline/build scripts.
No mail will be sent out, as 'CXF » CXF-4.1.x-fixes-JDK17-deploy » Apache CXF System Tests #1159' does not have a result yet. Please make sure you set a proper result in case of pipeline/build scripts.
No mail will be sent out, as 'CXF » CXF-4.1.x-fixes-JDK17-deploy » Apache CXF Benchmark SOAP/HTTP/Doc/Lit #1159' does not have a result yet. Please make sure you set a proper result in case of pipeline/build scripts.
No mail will be sent out, as 'CXF » CXF-4.1.x-fixes-JDK17-deploy » Apache CXF Rest Security Runtime #1159' does not have a result yet. Please make sure you set a proper result in case of pipeline/build scripts.
No mail will be sent out, as 'CXF » CXF-4.1.x-fixes-JDK17-deploy » CXF sample using a callback object #1159' does not have a result yet. Please make sure you set a proper result in case of pipeline/build scripts.
No mail will be sent out, as 'CXF » CXF-4.1.x-fixes-JDK17-deploy » Apache CXF Runtime HTTP Undertow Transport #1159' does not have a result yet. Please make sure you set a proper result in case of pipeline/build scripts.
No mail will be sent out, as 'CXF » CXF-4.1.x-fixes-JDK17-deploy » Apache CXF Runtime JOSE JAX-RS #1159' does not have a result yet. Please make sure you set a proper result in case of pipeline/build scripts.
No mail will be sent out, as 'CXF » CXF-4.1.x-fixes-JDK17-deploy » JAX-RS WebSocket WebApp Demo #1159' does not have a result yet. Please make sure you set a proper result in case of pipeline/build scripts.
No mail will be sent out, as 'CXF » CXF-4.1.x-fixes-JDK17-deploy » JAX-RS Demo Using Distributed Tracing with OpenTelemetry API, Apache Camel and Jaeger #1159' does not have a result yet. Please make sure you set a proper result in case of pipeline/build scripts.
No mail will be sent out, as 'CXF » CXF-4.1.x-fixes-JDK17-deploy » WSDL first demo using Document/Literal Style #1159' does not have a result yet. Please make sure you set a proper result in case of pipeline/build scripts.
No mail will be sent out, as 'CXF » CXF-4.1.x-fixes-JDK17-deploy » Apache CXF CDI Integration System Tests - Weld #1159' does not have a result yet. Please make sure you set a proper result in case of pipeline/build scripts.
No mail will be sent out, as 'CXF » CXF-4.1.x-fixes-JDK17-deploy » JMS Transport Queue Demo using Document-Literal Style #1159' does not have a result yet. Please make sure you set a proper result in case of pipeline/build scripts.
No mail will be sent out, as 'CXF » CXF-4.1.x-fixes-JDK17-deploy » Apache CXF Java2WS Maven2 Plugin #1159' does not have a result yet. Please make sure you set a proper result in case of pipeline/build scripts.
No mail will be sent out, as 'CXF » CXF-4.1.x-fixes-JDK17-deploy » WSDL first demo using the jms transport and jmsConfigFeature #1159' does not have a result yet. Please make sure you set a proper result in case of pipeline/build scripts.
No mail will be sent out, as 'CXF » CXF-4.1.x-fixes-JDK17-deploy » Apache CXF XKMS #1159' does not have a result yet. Please make sure you set a proper result in case of pipeline/build scripts.
No mail will be sent out, as 'CXF » CXF-4.1.x-fixes-JDK17-deploy » Apache CXF STS basic systests #1159' does not have a result yet. Please make sure you set a proper result in case of pipeline/build scripts.
No mail will be sent out, as 'CXF » CXF-4.1.x-fixes-JDK17-deploy » Apache CXF WS-Security System Tests #1159' does not have a result yet. Please make sure you set a proper result in case of pipeline/build scripts.
No mail will be sent out, as 'CXF » CXF-4.1.x-fixes-JDK17-deploy » Apache CXF WADL2Java Code Generation Maven2 Plugin #1159' does not have a result yet. Please make sure you set a proper result in case of pipeline/build scripts.
No mail will be sent out, as 'CXF » CXF-4.1.x-fixes-JDK17-deploy » Apache CXF Runtime HTTP Netty Client Transport #1159' does not have a result yet. Please make sure you set a proper result in case of pipeline/build scripts.
No mail will be sent out, as 'CXF » CXF-4.1.x-fixes-JDK17-deploy » Apache CXF Runtime JavaScript Client Generator Tests #1159' does not have a result yet. Please make sure you set a proper result in case of pipeline/build scripts.
No mail will be sent out, as 'CXF » CXF-4.1.x-fixes-JDK17-deploy » JAX-WS Asynchronous Demo using Document/Literal Style #1159' does not have a result yet. Please make sure you set a proper result in case of pipeline/build scripts.
No mail will be sent out, as 'CXF » CXF-4.1.x-fixes-JDK17-deploy » Apache CXF WS-* Specifications System Tests #1159' does not have a result yet. Please make sure you set a proper result in case of pipeline/build scripts.
No mail will be sent out, as 'CXF » CXF-4.1.x-fixes-JDK17-deploy » Apache CXF Runtime Simple Frontend #1159' does not have a result yet. Please make sure you set a proper result in case of pipeline/build scripts.
No mail will be sent out, as 'CXF » CXF-4.1.x-fixes-JDK17-deploy » Apache CXF Spring Boot Integration #1159' does not have a result yet. Please make sure you set a proper result in case of pipeline/build scripts.
No mail will be sent out, as 'CXF » CXF-4.1.x-fixes-JDK17-deploy » Apache CXF Runtime JavaScript Client Generator #1159' does not have a result yet. Please make sure you set a proper result in case of pipeline/build scripts.
No mail will be sent out, as 'CXF » CXF-4.1.x-fixes-JDK17-deploy » JAX-RS SSE/CDI Demo (Jetty 9) #1159' does not have a result yet. Please make sure you set a proper result in case of pipeline/build scripts.
No mail will be sent out, as 'CXF » CXF-4.1.x-fixes-JDK17-deploy » Java First demo using JMS #1159' does not have a result yet. Please make sure you set a proper result in case of pipeline/build scripts.
No mail will be sent out, as 'CXF » CXF-4.1.x-fixes-JDK17-deploy » Apache CXF Runtime JAXB DataBinding #1159' does not have a result yet. Please make sure you set a proper result in case of pipeline/build scripts.
No mail will be sent out, as 'CXF » CXF-4.1.x-fixes-JDK17-deploy » Apache CXF WS-Security Interop System Tests #1159' does not have a result yet. Please make sure you set a proper result in case of pipeline/build scripts.
No mail will be sent out, as 'CXF » CXF-4.1.x-fixes-JDK17-deploy » Apache CXF XKMS Common #1159' does not have a result yet. Please make sure you set a proper result in case of pipeline/build scripts.
No mail will be sent out, as 'CXF » CXF-4.1.x-fixes-JDK17-deploy » Apache CXF Runtime JAX-WS Frontend #1159' does not have a result yet. Please make sure you set a proper result in case of pipeline/build scripts.
No mail will be sent out, as 'CXF » CXF-4.1.x-fixes-JDK17-deploy » Apache CXF Runtime JOSE Core #1159' does not have a result yet. Please make sure you set a proper result in case of pipeline/build scripts.
No mail will be sent out, as 'CXF » CXF-4.1.x-fixes-JDK17-deploy » Apache CXF SSE Integration System Tests #1159' does not have a result yet. Please make sure you set a proper result in case of pipeline/build scripts.
No mail will be sent out, as 'CXF » CXF-4.1.x-fixes-JDK17-deploy » Apache CXF System Tests for Maven Plugins #1159' does not have a result yet. Please make sure you set a proper result in case of pipeline/build scripts.
No mail will be sent out, as 'CXF » CXF-4.1.x-fixes-JDK17-deploy » Apache CXF JAX-RS System Tests #1159' does not have a result yet. Please make sure you set a proper result in case of pipeline/build scripts.
No mail will be sent out, as 'CXF » CXF-4.1.x-fixes-JDK17-deploy » Apache CXF Runtime #1159' does not have a result yet. Please make sure you set a proper result in case of pipeline/build scripts.
No mail will be sent out, as 'CXF » CXF-4.1.x-fixes-JDK17-deploy » JAX-WS GraalVM Demo (capture generated classes) #1159' does not have a result yet. Please make sure you set a proper result in case of pipeline/build scripts.
No mail will be sent out, as 'CXF » CXF-4.1.x-fixes-JDK17-deploy » Apache CXF Runtime WebSocket Transport #1159' does not have a result yet. Please make sure you set a proper result in case of pipeline/build scripts.
No mail will be sent out, as 'CXF » CXF-4.1.x-fixes-JDK17-deploy » Apache CXF CDI Integration System Tests - OWB with multiple apps #1159' does not have a result yet. Please make sure you set a proper result in case of pipeline/build scripts.
No mail will be sent out, as 'CXF » CXF-4.1.x-fixes-JDK17-deploy » Apache CXF WSN Core #1159' does not have a result yet. Please make sure you set a proper result in case of pipeline/build scripts.
No mail will be sent out, as 'CXF » CXF-4.1.x-fixes-JDK17-deploy » Apache CXF CDI Integration System Tests - OWB with no apps #1159' does not have a result yet. Please make sure you set a proper result in case of pipeline/build scripts.
No mail will be sent out, as 'CXF » CXF-4.1.x-fixes-JDK17-deploy » Apache CXF XKMS Client #1159' does not have a result yet. Please make sure you set a proper result in case of pipeline/build scripts.
No mail will be sent out, as 'CXF » CXF-4.1.x-fixes-JDK17-deploy » Apache CXF Transport System Tests JMS #1159' does not have a result yet. Please make sure you set a proper result in case of pipeline/build scripts.
No mail will be sent out, as 'CXF » CXF-4.1.x-fixes-JDK17-deploy » Apache CXF Command Line Tools CORBA #1159' does not have a result yet. Please make sure you set a proper result in case of pipeline/build scripts.
No mail will be sent out, as 'CXF » CXF-4.1.x-fixes-JDK17-deploy » JAX-RS Basic Demo With HTTP/2 communications #1159' does not have a result yet. Please make sure you set a proper result in case of pipeline/build scripts.
No mail will be sent out, as 'CXF » CXF-4.1.x-fixes-JDK17-deploy » Apache CXF WS-RM Specifications System Tests #1159' does not have a result yet. Please make sure you set a proper result in case of pipeline/build scripts.
No mail will be sent out, as 'CXF » CXF-4.1.x-fixes-JDK17-deploy » Apache CXF Runtime HTTP Async Transport #1159' does not have a result yet. Please make sure you set a proper result in case of pipeline/build scripts.
No mail will be sent out, as 'CXF » CXF-4.1.x-fixes-JDK17-deploy » Apache CXF MicroProfile No-CDI/Config Sys Tests #1159' does not have a result yet. Please make sure you set a proper result in case of pipeline/build scripts.
No mail will be sent out, as 'CXF » CXF-4.1.x-fixes-JDK17-deploy » CXF WS-SecurityPolicy Signature Encryption Demo #1159' does not have a result yet. Please make sure you set a proper result in case of pipeline/build scripts.
No mail will be sent out, as 'CXF » CXF-4.1.x-fixes-JDK17-deploy » Apache CXF System Tests - MicroProfile Rest Client TCK on Weld #1159' does not have a result yet. Please make sure you set a proper result in case of pipeline/build scripts.
No mail will be sent out, as 'CXF » CXF-4.1.x-fixes-JDK17-deploy » Apache CXF WSN OSGi #1159' does not have a result yet. Please make sure you set a proper result in case of pipeline/build scripts.
No mail will be sent out, as 'CXF » CXF-4.1.x-fixes-JDK17-deploy » WS-Addressing Demo #1159' does not have a result yet. Please make sure you set a proper result in case of pipeline/build scripts.
No mail will be sent out, as 'CXF » CXF-4.1.x-fixes-JDK17-deploy » Apache CXF SSE Integration System Tests base classes #1159' does not have a result yet. Please make sure you set a proper result in case of pipeline/build scripts.
No mail will be sent out, as 'CXF » CXF-4.1.x-fixes-JDK17-deploy » Apache CXF Runtime JavaScript Client Generator Projects #1159' does not have a result yet. Please make sure you set a proper result in case of pipeline/build scripts.
No mail will be sent out, as 'CXF » CXF-4.1.x-fixes-JDK17-deploy » JAX-RS SSE Demo (Jetty 9) #1159' does not have a result yet. Please make sure you set a proper result in case of pipeline/build scripts.
No mail will be sent out, as 'CXF » CXF-4.1.x-fixes-JDK17-deploy » Apache CXF Transports Runtime #1159' does not have a result yet. Please make sure you set a proper result in case of pipeline/build scripts.
No mail will be sent out, as 'CXF » CXF-4.1.x-fixes-JDK17-deploy » Apache CXF Runtime Security functionality #1159' does not have a result yet. Please make sure you set a proper result in case of pipeline/build scripts.
No mail will be sent out, as 'CXF » CXF-4.1.x-fixes-JDK17-deploy » Apache CXF STS test OSGi deployment #1159' does not have a result yet. Please make sure you set a proper result in case of pipeline/build scripts.
No mail will be sent out, as 'CXF » CXF-4.1.x-fixes-JDK17-deploy » JAX-RS Content Negotiation Demo #1159' does not have a result yet. Please make sure you set a proper result in case of pipeline/build scripts.
No mail will be sent out, as 'CXF » CXF-4.1.x-fixes-JDK17-deploy » Apache CXF WS-Discovery #1159' does not have a result yet. Please make sure you set a proper result in case of pipeline/build scripts.
No mail will be sent out, as 'CXF » CXF-4.1.x-fixes-JDK17-deploy » Apache CXF Distributed Tracing using OpenZipkin Brave #1159' does not have a result yet. Please make sure you set a proper result in case of pipeline/build scripts.
No mail will be sent out, as 'CXF » CXF-4.1.x-fixes-JDK17-deploy » Apache CXF Manifest Jar #1159' does not have a result yet. Please make sure you set a proper result in case of pipeline/build scripts.
No mail will be sent out, as 'CXF » CXF-4.1.x-fixes-JDK17-deploy » JAX-RS OData #1159' does not have a result yet. Please make sure you set a proper result in case of pipeline/build scripts.
No mail will be sent out, as 'CXF » CXF-4.1.x-fixes-JDK17-deploy » Apache CXF Runtime OAuth 2.0 #1159' does not have a result yet. Please make sure you set a proper result in case of pipeline/build scripts.
No mail will be sent out, as 'CXF » CXF-4.1.x-fixes-JDK17-deploy » Test for generating code from wsdl in repo #1159' does not have a result yet. Please make sure you set a proper result in case of pipeline/build scripts.
No mail will be sent out, as 'CXF » CXF-4.1.x-fixes-JDK17-deploy » Apache CXF Web Services Runtime #1159' does not have a result yet. Please make sure you set a proper result in case of pipeline/build scripts.
No mail will be sent out, as 'CXF » CXF-4.1.x-fixes-JDK17-deploy » Apache CXF Runtime OAuth 2.0 SAML #1159' does not have a result yet. Please make sure you set a proper result in case of pipeline/build scripts.
No mail will be sent out, as 'CXF » CXF-4.1.x-fixes-JDK17-deploy » Apache CXF Runtime HTTP Jetty Transport #1159' does not have a result yet. Please make sure you set a proper result in case of pipeline/build scripts.
No mail will be sent out, as 'CXF » CXF-4.1.x-fixes-JDK17-deploy » Test for writing wsdl to repo #1159' does not have a result yet. Please make sure you set a proper result in case of pipeline/build scripts.
No mail will be sent out, as 'CXF » CXF-4.1.x-fixes-JDK17-deploy » Apache CXF Command Line Tools #1159' does not have a result yet. Please make sure you set a proper result in case of pipeline/build scripts.
No mail will be sent out, as 'CXF » CXF-4.1.x-fixes-JDK17-deploy » Bank sample using JAX-WS API's to talk via CORBA/IIOP #1159' does not have a result yet. Please make sure you set a proper result in case of pipeline/build scripts.
No mail will be sent out, as 'CXF » CXF-4.1.x-fixes-JDK17-deploy » Sample using SOAP Headers #1159' does not have a result yet. Please make sure you set a proper result in case of pipeline/build scripts.
No mail will be sent out, as 'CXF » CXF-4.1.x-fixes-JDK17-deploy » Apache CXF Parent #1159' does not have a result yet. Please make sure you set a proper result in case of pipeline/build scripts.
No mail will be sent out, as 'CXF » CXF-4.1.x-fixes-JDK17-deploy » Apache CXF Maven Plugins #1159' does not have a result yet. Please make sure you set a proper result in case of pipeline/build scripts.
No mail will be sent out, as 'CXF » CXF-4.1.x-fixes-JDK17-deploy » Apache CXF Archetype - Simple JAX-WS Java First #1159' does not have a result yet. Please make sure you set a proper result in case of pipeline/build scripts.
No mail will be sent out, as 'CXF » CXF-4.1.x-fixes-JDK17-deploy » JAX-RS WebSocket Demo #1159' does not have a result yet. Please make sure you set a proper result in case of pipeline/build scripts.
No mail will be sent out, as 'CXF » CXF-4.1.x-fixes-JDK17-deploy » JAX-RS Basic Demo With HTTP/2 communications #1159' does not have a result yet. Please make sure you set a proper result in case of pipeline/build scripts.
No mail will be sent out, as 'CXF » CXF-4.1.x-fixes-JDK17-deploy » JAX-RS Basic With HTTPS communications #1159' does not have a result yet. Please make sure you set a proper result in case of pipeline/build scripts.
No mail will be sent out, as 'CXF » CXF-4.1.x-fixes-JDK17-deploy » Java First demo using JAX-WS APIs #1159' does not have a result yet. Please make sure you set a proper result in case of pipeline/build scripts.
No mail will be sent out, as 'CXF » CXF-4.1.x-fixes-JDK17-deploy » JAX-RS SSE Client Demo (Tomcat 8) #1159' does not have a result yet. Please make sure you set a proper result in case of pipeline/build scripts.
No mail will be sent out, as 'CXF » CXF-4.1.x-fixes-JDK17-deploy » JAX-WS Handler Demo #1159' does not have a result yet. Please make sure you set a proper result in case of pipeline/build scripts.
No mail will be sent out, as 'CXF » CXF-4.1.x-fixes-JDK17-deploy » Spring Boot CXF Web Services Transaction Sample #1159' does not have a result yet. Please make sure you set a proper result in case of pipeline/build scripts.
No mail will be sent out, as 'CXF » CXF-4.1.x-fixes-JDK17-deploy » Apache CXF Netty Transport System Tests #1159' does not have a result yet. Please make sure you set a proper result in case of pipeline/build scripts.
No mail will be sent out, as 'CXF » CXF-4.1.x-fixes-JDK17-deploy » Apache CXF Command Line Tools JavaTo WS #1159' does not have a result yet. Please make sure you set a proper result in case of pipeline/build scripts.
No mail will be sent out, as 'CXF » CXF-4.1.x-fixes-JDK17-deploy » Apache CXF Runtime HTTP Netty Server Transport #1159' does not have a result yet. Please make sure you set a proper result in case of pipeline/build scripts.
No mail will be sent out, as 'CXF » CXF-4.1.x-fixes-JDK17-deploy » Apache CXF LDAP Integration System Tests #1159' does not have a result yet. Please make sure you set a proper result in case of pipeline/build scripts.
No mail will be sent out, as 'CXF » CXF-4.1.x-fixes-JDK17-deploy » JAX-RS Basic Demo With HTTP/2 communications #1159' does not have a result yet. Please make sure you set a proper result in case of pipeline/build scripts.
No mail will be sent out, as 'CXF » CXF-4.1.x-fixes-JDK17-deploy » SOAP/JMS Transport Specification Demo using Document-Literal Style #1159' does not have a result yet. Please make sure you set a proper result in case of pipeline/build scripts.
No mail will be sent out, as 'CXF » CXF-4.1.x-fixes-JDK17-deploy » Apache CXF Distributed Tracing using OpenTracing #1159' does not have a result yet. Please make sure you set a proper result in case of pipeline/build scripts.
No mail will be sent out, as 'CXF » CXF-4.1.x-fixes-JDK17-deploy » Colocated Demo using Document/Literal Style #1159' does not have a result yet. Please make sure you set a proper result in case of pipeline/build scripts.
No mail will be sent out, as 'CXF » CXF-4.1.x-fixes-JDK17-deploy » Apache CXF Runtime HTTP Transport #1159' does not have a result yet. Please make sure you set a proper result in case of pipeline/build scripts.
No mail will be sent out, as 'CXF » CXF-4.1.x-fixes-JDK17-deploy » Apache CXF Observability using Micrometer Observation #1159' does not have a result yet. Please make sure you set a proper result in case of pipeline/build scripts.
No mail will be sent out, as 'CXF » CXF-4.1.x-fixes-JDK17-deploy » Apache CXF JAX-RS Service Description OpenAPI/Swagger Common #1159' does not have a result yet. Please make sure you set a proper result in case of pipeline/build scripts.
No mail will be sent out, as 'CXF » CXF-4.1.x-fixes-JDK17-deploy » Apache CXF SSE Integration System Tests for Undertow #1159' does not have a result yet. Please make sure you set a proper result in case of pipeline/build scripts.
ERROR: Failed to parse POMs
java.io.IOException: java.lang.reflect.InvocationTargetException
	at PluginClassLoader for maven-plugin//hudson.maven.Maven3Builder.call(Maven3Builder.java:178)
	at PluginClassLoader for maven-plugin//hudson.maven.Maven3Builder.call(Maven3Builder.java:71)
	at hudson.remoting.UserRequest.perform(UserRequest.java:225)
	at hudson.remoting.UserRequest.perform(UserRequest.java:50)
	at hudson.remoting.Request$2.run(Request.java:391)
	at hudson.remoting.InterceptingExecutorService.lambda$wrap$0(InterceptingExecutorService.java:81)
	at java.base/java.util.concurrent.FutureTask.run(FutureTask.java:264)
	at java.base/java.util.concurrent.ThreadPoolExecutor.runWorker(ThreadPoolExecutor.java:1136)
	at java.base/java.util.concurrent.ThreadPoolExecutor$Worker.run(ThreadPoolExecutor.java:635)
	at java.base/java.lang.Thread.run(Thread.java:840)
	Suppressed: hudson.remoting.Channel$CallSiteStackTrace: Remote call to Channel to Maven [/home/jenkins/tools/java/latest17/bin/java, -da, -dsa, -Xmx1024M, -cp, /home/jenkins/maven35-agent.jar:/home/jenkins/tools/maven/latest3/boot/plexus-classworlds-2.12.1.jar:/home/jenkins/tools/maven/latest3/conf/logging, jenkins.maven3.agent.Maven35Main, /home/jenkins/tools/maven/latest3, /home/jenkins/agent.jar, /home/jenkins/maven35-interceptor.jar, /home/jenkins/maven3-interceptor-commons.jar, 42253]
		at hudson.remoting.Channel.attachCallSiteStackTrace(Channel.java:1923)
		at hudson.remoting.UserRequest$ExceptionResponse.retrieve(UserRequest.java:384)
		at hudson.remoting.Channel.call(Channel.java:1112)
		at PluginClassLoader for maven-plugin//hudson.maven.ProcessCache$MavenProcess.call(ProcessCache.java:161)
		at PluginClassLoader for maven-plugin//hudson.maven.MavenModuleSetBuild$MavenModuleSetBuildExecution.doRun(MavenModuleSetBuild.java:877)
		at hudson.model.AbstractBuild$AbstractBuildExecution.run(AbstractBuild.java:527)
		at hudson.model.Run.execute(Run.java:1833)
		at PluginClassLoader for maven-plugin//hudson.maven.MavenModuleSetBuild.run(MavenModuleSetBuild.java:543)
		at hudson.model.ResourceController.execute(ResourceController.java:101)
		at hudson.model.Executor.run(Executor.java:446)
Caused by: java.lang.reflect.InvocationTargetException
	at java.base/jdk.internal.reflect.NativeMethodAccessorImpl.invoke0(Native Method)
	at java.base/jdk.internal.reflect.NativeMethodAccessorImpl.invoke(NativeMethodAccessorImpl.java:77)
	at java.base/jdk.internal.reflect.DelegatingMethodAccessorImpl.invoke(DelegatingMethodAccessorImpl.java:43)
	at java.base/java.lang.reflect.Method.invoke(Method.java:569)
	at PluginClassLoader for maven-plugin//hudson.maven.Maven3Builder.call(Maven3Builder.java:140)
	... 9 more
Caused by: java.lang.Exception: java.lang.reflect.InvocationTargetException
	at jenkins.maven3.agent.Maven35Main.launch(Maven35Main.java:182)
	... 14 more
Caused by: java.lang.reflect.InvocationTargetException
	at java.base/jdk.internal.reflect.NativeMethodAccessorImpl.invoke0(Native Method)
	at java.base/jdk.internal.reflect.NativeMethodAccessorImpl.invoke(NativeMethodAccessorImpl.java:77)
	at java.base/jdk.internal.reflect.DelegatingMethodAccessorImpl.invoke(DelegatingMethodAccessorImpl.java:43)
	at java.base/java.lang.reflect.Method.invoke(Method.java:569)
	at org.codehaus.plexus.classworlds.launcher.Launcher.launchEnhanced(Launcher.java:255)
	at org.codehaus.plexus.classworlds.launcher.Launcher.launch(Launcher.java:201)
	at jenkins.maven3.agent.Maven35Main.launch(Maven35Main.java:179)
	... 14 more
Caused by: java.lang.UnsupportedOperationException
	at org.eclipse.sisu.wire.EntryListAdapter$ValueListIterator.add(EntryListAdapter.java:185)
	at java.base/java.util.AbstractSequentialList.add(AbstractSequentialList.java:146)
	at java.base/java.util.AbstractList.add(AbstractList.java:111)
	at java.base/java.util.AbstractCollection.addAll(AbstractCollection.java:336)
	at org.jvnet.hudson.maven3.launcher.Maven35Launcher.main(Maven35Launcher.java:127)
	... 21 more
channel stopped

Build failed in Jenkins: CXF » CXF-4.1.x-fixes-JDK17-deploy #1158

Posted by Apache Jenkins Server <je...@builds.apache.org>.
See <https://ci-builds.apache.org/job/CXF/job/CXF-4.1.x-fixes-JDK17-deploy/1158/display/redirect>

Changes:


------------------------------------------
[...truncated 22.69 KiB...]
No mail will be sent out, as 'CXF » CXF-4.1.x-fixes-JDK17-deploy » Apache CXF Distributed Tracing Integration System Tests #1158' does not have a result yet. Please make sure you set a proper result in case of pipeline/build scripts.
No mail will be sent out, as 'CXF » CXF-4.1.x-fixes-JDK17-deploy » Apache CXF STS Core #1158' does not have a result yet. Please make sure you set a proper result in case of pipeline/build scripts.
No mail will be sent out, as 'CXF » CXF-4.1.x-fixes-JDK17-deploy » Apache CXF Integration #1158' does not have a result yet. Please make sure you set a proper result in case of pipeline/build scripts.
No mail will be sent out, as 'CXF » CXF-4.1.x-fixes-JDK17-deploy » JAX-RS Demo Using Distributed Tracing with Micrometer Observation #1158' does not have a result yet. Please make sure you set a proper result in case of pipeline/build scripts.
No mail will be sent out, as 'CXF » CXF-4.1.x-fixes-JDK17-deploy » JavaScript Client Demo using Document/Literal Style #1158' does not have a result yet. Please make sure you set a proper result in case of pipeline/build scripts.
No mail will be sent out, as 'CXF » CXF-4.1.x-fixes-JDK17-deploy » Apache CXF RS SSO SAML #1158' does not have a result yet. Please make sure you set a proper result in case of pipeline/build scripts.
No mail will be sent out, as 'CXF » CXF-4.1.x-fixes-JDK17-deploy » Apache CXF SSE Integration System Tests for Jetty #1158' does not have a result yet. Please make sure you set a proper result in case of pipeline/build scripts.
No mail will be sent out, as 'CXF » CXF-4.1.x-fixes-JDK17-deploy » Apache CXF CDI Integration System Tests - Weld with producers #1158' does not have a result yet. Please make sure you set a proper result in case of pipeline/build scripts.
No mail will be sent out, as 'CXF » CXF-4.1.x-fixes-JDK17-deploy » Apache CXF JOSE Security parent #1158' does not have a result yet. Please make sure you set a proper result in case of pipeline/build scripts.
No mail will be sent out, as 'CXF » CXF-4.1.x-fixes-JDK17-deploy » Apache CXF RS XML Security #1158' does not have a result yet. Please make sure you set a proper result in case of pipeline/build scripts.
No mail will be sent out, as 'CXF » CXF-4.1.x-fixes-JDK17-deploy » JAX-WS Dispatch/Provider Demo #1158' does not have a result yet. Please make sure you set a proper result in case of pipeline/build scripts.
No mail will be sent out, as 'CXF » CXF-4.1.x-fixes-JDK17-deploy » Apache CXF WSN API #1158' does not have a result yet. Please make sure you set a proper result in case of pipeline/build scripts.
No mail will be sent out, as 'CXF » CXF-4.1.x-fixes-JDK17-deploy » Apache CXF Runtime XML Binding #1158' does not have a result yet. Please make sure you set a proper result in case of pipeline/build scripts.
No mail will be sent out, as 'CXF » CXF-4.1.x-fixes-JDK17-deploy » Apache CXF Runtime Management #1158' does not have a result yet. Please make sure you set a proper result in case of pipeline/build scripts.
No mail will be sent out, as 'CXF » CXF-4.1.x-fixes-JDK17-deploy » Apache CXF Command Line Tools WADLTo JAXRS Frontend #1158' does not have a result yet. Please make sure you set a proper result in case of pipeline/build scripts.
No mail will be sent out, as 'CXF » CXF-4.1.x-fixes-JDK17-deploy » Apache CXF SSE Integration System Tests for Tomcat #1158' does not have a result yet. Please make sure you set a proper result in case of pipeline/build scripts.
No mail will be sent out, as 'CXF » CXF-4.1.x-fixes-JDK17-deploy » Spring HTTP Servlet demo with groovy support #1158' does not have a result yet. Please make sure you set a proper result in case of pipeline/build scripts.
No mail will be sent out, as 'CXF » CXF-4.1.x-fixes-JDK17-deploy » Sample of JAX-* Service Using an Aegis Client #1158' does not have a result yet. Please make sure you set a proper result in case of pipeline/build scripts.
No mail will be sent out, as 'CXF » CXF-4.1.x-fixes-JDK17-deploy » JAX-RS Demo Using Distributed Tracing with OpenTracing API and Jaeger #1158' does not have a result yet. Please make sure you set a proper result in case of pipeline/build scripts.
No mail will be sent out, as 'CXF » CXF-4.1.x-fixes-JDK17-deploy » Eureka Registry for CXF SpringBoot demos #1158' does not have a result yet. Please make sure you set a proper result in case of pipeline/build scripts.
No mail will be sent out, as 'CXF » CXF-4.1.x-fixes-JDK17-deploy » Apache CXF Spring Boot Autoconfigure #1158' does not have a result yet. Please make sure you set a proper result in case of pipeline/build scripts.
No mail will be sent out, as 'CXF » CXF-4.1.x-fixes-JDK17-deploy » JAX-RS Basic Demo #1158' does not have a result yet. Please make sure you set a proper result in case of pipeline/build scripts.
No mail will be sent out, as 'CXF » CXF-4.1.x-fixes-JDK17-deploy » Apache CXF Command Line Tools WADLTo #1158' does not have a result yet. Please make sure you set a proper result in case of pipeline/build scripts.
No mail will be sent out, as 'CXF » CXF-4.1.x-fixes-JDK17-deploy » JAX-RS Demo Using Distributed Tracing with OpenZipkin Brave #1158' does not have a result yet. Please make sure you set a proper result in case of pipeline/build scripts.
No mail will be sent out, as 'CXF » CXF-4.1.x-fixes-JDK17-deploy » Apache CXF MicroProfile Tracing integration Sys Tests #1158' does not have a result yet. Please make sure you set a proper result in case of pipeline/build scripts.
No mail will be sent out, as 'CXF » CXF-4.1.x-fixes-JDK17-deploy » Hello World Client Demo using JavaScript #1158' does not have a result yet. Please make sure you set a proper result in case of pipeline/build scripts.
No mail will be sent out, as 'CXF » CXF-4.1.x-fixes-JDK17-deploy » Apache CXF JAX-RS Servlet Container Initializer #1158' does not have a result yet. Please make sure you set a proper result in case of pipeline/build scripts.
No mail will be sent out, as 'CXF » CXF-4.1.x-fixes-JDK17-deploy » Apache CXF WS-Transfer System Tests #1158' does not have a result yet. Please make sure you set a proper result in case of pipeline/build scripts.
No mail will be sent out, as 'CXF » CXF-4.1.x-fixes-JDK17-deploy » JAX-RS Basic Oidc Demo #1158' does not have a result yet. Please make sure you set a proper result in case of pipeline/build scripts.
No mail will be sent out, as 'CXF » CXF-4.1.x-fixes-JDK17-deploy » Apache CXF Runtime WS Addressing #1158' does not have a result yet. Please make sure you set a proper result in case of pipeline/build scripts.
No mail will be sent out, as 'CXF » CXF-4.1.x-fixes-JDK17-deploy » Apache CXF Command Line Tools WSDLTo #1158' does not have a result yet. Please make sure you set a proper result in case of pipeline/build scripts.
No mail will be sent out, as 'CXF » CXF-4.1.x-fixes-JDK17-deploy » JAX-RS Spring Security Demo #1158' does not have a result yet. Please make sure you set a proper result in case of pipeline/build scripts.
No mail will be sent out, as 'CXF » CXF-4.1.x-fixes-JDK17-deploy » Apache CXF BOM #1158' does not have a result yet. Please make sure you set a proper result in case of pipeline/build scripts.
No mail will be sent out, as 'CXF » CXF-4.1.x-fixes-JDK17-deploy » Apache CXF Command Line Tools WSDL to JavaScript Front End #1158' does not have a result yet. Please make sure you set a proper result in case of pipeline/build scripts.
No mail will be sent out, as 'CXF » CXF-4.1.x-fixes-JDK17-deploy » JAX-RS Basic Demo #1158' does not have a result yet. Please make sure you set a proper result in case of pipeline/build scripts.
No mail will be sent out, as 'CXF » CXF-4.1.x-fixes-JDK17-deploy » CXF WS-Security UT Demo #1158' does not have a result yet. Please make sure you set a proper result in case of pipeline/build scripts.
No mail will be sent out, as 'CXF » CXF-4.1.x-fixes-JDK17-deploy » WS-SecurityPolicy UT Demo #1158' does not have a result yet. Please make sure you set a proper result in case of pipeline/build scripts.
No mail will be sent out, as 'CXF » CXF-4.1.x-fixes-JDK17-deploy » Apache CXF Runtime Local Transport #1158' does not have a result yet. Please make sure you set a proper result in case of pipeline/build scripts.
No mail will be sent out, as 'CXF » CXF-4.1.x-fixes-JDK17-deploy » Spring Boot CXF Web Services Sample #1158' does not have a result yet. Please make sure you set a proper result in case of pipeline/build scripts.
No mail will be sent out, as 'CXF » CXF-4.1.x-fixes-JDK17-deploy » CXF sample using WRAPPED Style in XML Binding (pure XML over HTTP) #1158' does not have a result yet. Please make sure you set a proper result in case of pipeline/build scripts.
No mail will be sent out, as 'CXF » CXF-4.1.x-fixes-JDK17-deploy » CXF Sample of Stream GZIP Interceptor #1158' does not have a result yet. Please make sure you set a proper result in case of pipeline/build scripts.
No mail will be sent out, as 'CXF » CXF-4.1.x-fixes-JDK17-deploy » Java First demo service using the JAXWSFactoryBeans #1158' does not have a result yet. Please make sure you set a proper result in case of pipeline/build scripts.
No mail will be sent out, as 'CXF » CXF-4.1.x-fixes-JDK17-deploy » Hello world javascript demo #1158' does not have a result yet. Please make sure you set a proper result in case of pipeline/build scripts.
No mail will be sent out, as 'CXF » CXF-4.1.x-fixes-JDK17-deploy » Apache CXF Runtime JAX-RS Frontend #1158' does not have a result yet. Please make sure you set a proper result in case of pipeline/build scripts.
No mail will be sent out, as 'CXF » CXF-4.1.x-fixes-JDK17-deploy » Apache CXF JAX-RS Extensions: Project Reactor #1158' does not have a result yet. Please make sure you set a proper result in case of pipeline/build scripts.
No mail will be sent out, as 'CXF » CXF-4.1.x-fixes-JDK17-deploy » Apache CXF JAX-RS Service Description OpenAPI v3 #1158' does not have a result yet. Please make sure you set a proper result in case of pipeline/build scripts.
No mail will be sent out, as 'CXF » CXF-4.1.x-fixes-JDK17-deploy » WS-Eventing Demo #1158' does not have a result yet. Please make sure you set a proper result in case of pipeline/build scripts.
No mail will be sent out, as 'CXF » CXF-4.1.x-fixes-JDK17-deploy » Apache CXF JAX-RS Extensions: Search #1158' does not have a result yet. Please make sure you set a proper result in case of pipeline/build scripts.
No mail will be sent out, as 'CXF » CXF-4.1.x-fixes-JDK17-deploy » Apache CXF JAX-RS Service Description #1158' does not have a result yet. Please make sure you set a proper result in case of pipeline/build scripts.
No mail will be sent out, as 'CXF » CXF-4.1.x-fixes-JDK17-deploy » Apache CXF Runtime Bindings #1158' does not have a result yet. Please make sure you set a proper result in case of pipeline/build scripts.
No mail will be sent out, as 'CXF » CXF-4.1.x-fixes-JDK17-deploy » Apache CXF MicroProfile JAX-RS integration Sys Tests #1158' does not have a result yet. Please make sure you set a proper result in case of pipeline/build scripts.
No mail will be sent out, as 'CXF » CXF-4.1.x-fixes-JDK17-deploy » JAX-WS GraalVM Demo #1158' does not have a result yet. Please make sure you set a proper result in case of pipeline/build scripts.
No mail will be sent out, as 'CXF » CXF-4.1.x-fixes-JDK17-deploy » JMS Transport Publish/Subscribe Demo using Document-Literal Style #1158' does not have a result yet. Please make sure you set a proper result in case of pipeline/build scripts.
No mail will be sent out, as 'CXF » CXF-4.1.x-fixes-JDK17-deploy » Bank sample using JAX-WS API's to talk via CORBA/IIOP #1158' does not have a result yet. Please make sure you set a proper result in case of pipeline/build scripts.
No mail will be sent out, as 'CXF » CXF-4.1.x-fixes-JDK17-deploy » JAX-RS Open API 3.0 Demo #1158' does not have a result yet. Please make sure you set a proper result in case of pipeline/build scripts.
No mail will be sent out, as 'CXF » CXF-4.1.x-fixes-JDK17-deploy » Apache CXF Spring Boot Starter JAX-RS #1158' does not have a result yet. Please make sure you set a proper result in case of pipeline/build scripts.
No mail will be sent out, as 'CXF » CXF-4.1.x-fixes-JDK17-deploy » Apache CXF Java2WADL Maven2 Plugin #1158' does not have a result yet. Please make sure you set a proper result in case of pipeline/build scripts.
No mail will be sent out, as 'CXF » CXF-4.1.x-fixes-JDK17-deploy » Apache CXF Container Integration Test Grizzly #1158' does not have a result yet. Please make sure you set a proper result in case of pipeline/build scripts.
No mail will be sent out, as 'CXF » CXF-4.1.x-fixes-JDK17-deploy » Apache CXF Runtime CORBA Binding #1158' does not have a result yet. Please make sure you set a proper result in case of pipeline/build scripts.
No mail will be sent out, as 'CXF » CXF-4.1.x-fixes-JDK17-deploy » Apache CXF Runtime Http-Signature #1158' does not have a result yet. Please make sure you set a proper result in case of pipeline/build scripts.
No mail will be sent out, as 'CXF » CXF-4.1.x-fixes-JDK17-deploy » Generated JavaScript Sample using JAX-WS and JSR-181 #1158' does not have a result yet. Please make sure you set a proper result in case of pipeline/build scripts.
No mail will be sent out, as 'CXF » CXF-4.1.x-fixes-JDK17-deploy » JAX-WS GraalVM Demo (capture generated classes) #1158' does not have a result yet. Please make sure you set a proper result in case of pipeline/build scripts.
No mail will be sent out, as 'CXF » CXF-4.1.x-fixes-JDK17-deploy » Apache CXF Maven Archetypes #1158' does not have a result yet. Please make sure you set a proper result in case of pipeline/build scripts.
No mail will be sent out, as 'CXF » CXF-4.1.x-fixes-JDK17-deploy » Apache CXF MicroProfile Async Sys Tests #1158' does not have a result yet. Please make sure you set a proper result in case of pipeline/build scripts.
No mail will be sent out, as 'CXF » CXF-4.1.x-fixes-JDK17-deploy » Apache CXF Runtime SOAP Binding #1158' does not have a result yet. Please make sure you set a proper result in case of pipeline/build scripts.
No mail will be sent out, as 'CXF » CXF-4.1.x-fixes-JDK17-deploy » Apache CXF WSN service #1158' does not have a result yet. Please make sure you set a proper result in case of pipeline/build scripts.
No mail will be sent out, as 'CXF » CXF-4.1.x-fixes-JDK17-deploy » Apache CXF JAX-RS Service Description Microprofile OpenAPI #1158' does not have a result yet. Please make sure you set a proper result in case of pipeline/build scripts.
No mail will be sent out, as 'CXF » CXF-4.1.x-fixes-JDK17-deploy » Apache CXF STS service #1158' does not have a result yet. Please make sure you set a proper result in case of pipeline/build scripts.
No mail will be sent out, as 'CXF » CXF-4.1.x-fixes-JDK17-deploy » Apache CXF Runtime OpenId Connect #1158' does not have a result yet. Please make sure you set a proper result in case of pipeline/build scripts.
No mail will be sent out, as 'CXF » CXF-4.1.x-fixes-JDK17-deploy » Apache CXF MicroProfile TCKs #1158' does not have a result yet. Please make sure you set a proper result in case of pipeline/build scripts.
No mail will be sent out, as 'CXF » CXF-4.1.x-fixes-JDK17-deploy » Apache CXF Runtime WS Transfer #1158' does not have a result yet. Please make sure you set a proper result in case of pipeline/build scripts.
No mail will be sent out, as 'CXF » CXF-4.1.x-fixes-JDK17-deploy » Apache CXF JAX-RS Extensions: Reactive Streams #1158' does not have a result yet. Please make sure you set a proper result in case of pipeline/build scripts.
No mail will be sent out, as 'CXF » CXF-4.1.x-fixes-JDK17-deploy » Apache CXF Uncategorized System Tests #1158' does not have a result yet. Please make sure you set a proper result in case of pipeline/build scripts.
No mail will be sent out, as 'CXF » CXF-4.1.x-fixes-JDK17-deploy » Apache CXF Runtime Core for WSDL #1158' does not have a result yet. Please make sure you set a proper result in case of pipeline/build scripts.
No mail will be sent out, as 'CXF » CXF-4.1.x-fixes-JDK17-deploy » Apache CXF XKMS Service #1158' does not have a result yet. Please make sure you set a proper result in case of pipeline/build scripts.
No mail will be sent out, as 'CXF » CXF-4.1.x-fixes-JDK17-deploy » Apache CXF Command Line Tools Common #1158' does not have a result yet. Please make sure you set a proper result in case of pipeline/build scripts.
No mail will be sent out, as 'CXF » CXF-4.1.x-fixes-JDK17-deploy » Apache CXF Command Line Tools WSDLTo Core #1158' does not have a result yet. Please make sure you set a proper result in case of pipeline/build scripts.
No mail will be sent out, as 'CXF » CXF-4.1.x-fixes-JDK17-deploy » Apache CXF Services #1158' does not have a result yet. Please make sure you set a proper result in case of pipeline/build scripts.
No mail will be sent out, as 'CXF » CXF-4.1.x-fixes-JDK17-deploy » Apache CXF JAX-WS System Tests #1158' does not have a result yet. Please make sure you set a proper result in case of pipeline/build scripts.
No mail will be sent out, as 'CXF » CXF-4.1.x-fixes-JDK17-deploy » Apache CXF Command Line Tools WSDLTo JAXWS Frontend #1158' does not have a result yet. Please make sure you set a proper result in case of pipeline/build scripts.
No mail will be sent out, as 'CXF » CXF-4.1.x-fixes-JDK17-deploy » Apache CXF Samples #1158' does not have a result yet. Please make sure you set a proper result in case of pipeline/build scripts.
No mail will be sent out, as 'CXF » CXF-4.1.x-fixes-JDK17-deploy » Spring HTTP Servlet demo with ruby support #1158' does not have a result yet. Please make sure you set a proper result in case of pipeline/build scripts.
No mail will be sent out, as 'CXF » CXF-4.1.x-fixes-JDK17-deploy » Apache CXF JAX-RS Service Description Swagger UI integration #1158' does not have a result yet. Please make sure you set a proper result in case of pipeline/build scripts.
No mail will be sent out, as 'CXF » CXF-4.1.x-fixes-JDK17-deploy » Apache CXF Runtime Clustering #1158' does not have a result yet. Please make sure you set a proper result in case of pipeline/build scripts.
No mail will be sent out, as 'CXF » CXF-4.1.x-fixes-JDK17-deploy » Apache CXF CDI Integration System Tests - OWB with producers #1158' does not have a result yet. Please make sure you set a proper result in case of pipeline/build scripts.
No mail will be sent out, as 'CXF » CXF-4.1.x-fixes-JDK17-deploy » Apache CXF Archetype - Simple JAX-RS webapp #1158' does not have a result yet. Please make sure you set a proper result in case of pipeline/build scripts.
No mail will be sent out, as 'CXF » CXF-4.1.x-fixes-JDK17-deploy » Apache CXF Databinding System Tests #1158' does not have a result yet. Please make sure you set a proper result in case of pipeline/build scripts.
No mail will be sent out, as 'CXF » CXF-4.1.x-fixes-JDK17-deploy » CXF sample using the Aegis Binding without any webservice #1158' does not have a result yet. Please make sure you set a proper result in case of pipeline/build scripts.
No mail will be sent out, as 'CXF » CXF-4.1.x-fixes-JDK17-deploy » Apache CXF Advanced Logging Feature #1158' does not have a result yet. Please make sure you set a proper result in case of pipeline/build scripts.
No mail will be sent out, as 'CXF » CXF-4.1.x-fixes-JDK17-deploy » Apache CXF CDI Integration System Tests - Weld with no apps #1158' does not have a result yet. Please make sure you set a proper result in case of pipeline/build scripts.
No mail will be sent out, as 'CXF » CXF-4.1.x-fixes-JDK17-deploy » JAX-RS Big Query Demo #1158' does not have a result yet. Please make sure you set a proper result in case of pipeline/build scripts.
No mail will be sent out, as 'CXF » CXF-4.1.x-fixes-JDK17-deploy » JAX-RS Demo Using Distributed Tracing with OpenTelemetry #1158' does not have a result yet. Please make sure you set a proper result in case of pipeline/build scripts.
No mail will be sent out, as 'CXF » CXF-4.1.x-fixes-JDK17-deploy » Apache CXF Runtime WS Policy #1158' does not have a result yet. Please make sure you set a proper result in case of pipeline/build scripts.
No mail will be sent out, as 'CXF » CXF-4.1.x-fixes-JDK17-deploy » JAX-RS Open API 3.0 Demo #1158' does not have a result yet. Please make sure you set a proper result in case of pipeline/build scripts.
No mail will be sent out, as 'CXF » CXF-4.1.x-fixes-JDK17-deploy » Apache CXF Kerberos Integration System Tests #1158' does not have a result yet. Please make sure you set a proper result in case of pipeline/build scripts.
No mail will be sent out, as 'CXF » CXF-4.1.x-fixes-JDK17-deploy » Apache CXF STS advanced systests #1158' does not have a result yet. Please make sure you set a proper result in case of pipeline/build scripts.
No mail will be sent out, as 'CXF » CXF-4.1.x-fixes-JDK17-deploy » Apache CXF Servlet Container Initializer Integration System Tests #1158' does not have a result yet. Please make sure you set a proper result in case of pipeline/build scripts.
No mail will be sent out, as 'CXF » CXF-4.1.x-fixes-JDK17-deploy » Apache CXF WS-Discovery API #1158' does not have a result yet. Please make sure you set a proper result in case of pipeline/build scripts.
No mail will be sent out, as 'CXF » CXF-4.1.x-fixes-JDK17-deploy » Apache CXF JAX-RS System Advanced Security Tests #1158' does not have a result yet. Please make sure you set a proper result in case of pipeline/build scripts.
No mail will be sent out, as 'CXF » CXF-4.1.x-fixes-JDK17-deploy » JAX-RS Swagger2 Spring Demo #1158' does not have a result yet. Please make sure you set a proper result in case of pipeline/build scripts.
No mail will be sent out, as 'CXF » CXF-4.1.x-fixes-JDK17-deploy » Spring HTTP Sample #1158' does not have a result yet. Please make sure you set a proper result in case of pipeline/build scripts.
No mail will be sent out, as 'CXF » CXF-4.1.x-fixes-JDK17-deploy » Apache CXF Throttling Feature #1158' does not have a result yet. Please make sure you set a proper result in case of pipeline/build scripts.
No mail will be sent out, as 'CXF » CXF-4.1.x-fixes-JDK17-deploy » WS-Policy Demo #1158' does not have a result yet. Please make sure you set a proper result in case of pipeline/build scripts.
No mail will be sent out, as 'CXF » CXF-4.1.x-fixes-JDK17-deploy » Apache CXF Features Runtime #1158' does not have a result yet. Please make sure you set a proper result in case of pipeline/build scripts.
No mail will be sent out, as 'CXF » CXF-4.1.x-fixes-JDK17-deploy » Spring Boot CXF Second Web Services #1158' does not have a result yet. Please make sure you set a proper result in case of pipeline/build scripts.
No mail will be sent out, as 'CXF » CXF-4.1.x-fixes-JDK17-deploy » Apache CXF Distributed Tracing using OpenTelemetry #1158' does not have a result yet. Please make sure you set a proper result in case of pipeline/build scripts.
No mail will be sent out, as 'CXF » CXF-4.1.x-fixes-JDK17-deploy » Apache CXF System Tests #1158' does not have a result yet. Please make sure you set a proper result in case of pipeline/build scripts.
No mail will be sent out, as 'CXF » CXF-4.1.x-fixes-JDK17-deploy » Apache CXF Benchmark SOAP/HTTP/Doc/Lit #1158' does not have a result yet. Please make sure you set a proper result in case of pipeline/build scripts.
No mail will be sent out, as 'CXF » CXF-4.1.x-fixes-JDK17-deploy » Apache CXF Rest Security Runtime #1158' does not have a result yet. Please make sure you set a proper result in case of pipeline/build scripts.
No mail will be sent out, as 'CXF » CXF-4.1.x-fixes-JDK17-deploy » CXF sample using a callback object #1158' does not have a result yet. Please make sure you set a proper result in case of pipeline/build scripts.
No mail will be sent out, as 'CXF » CXF-4.1.x-fixes-JDK17-deploy » Apache CXF Runtime HTTP Undertow Transport #1158' does not have a result yet. Please make sure you set a proper result in case of pipeline/build scripts.
No mail will be sent out, as 'CXF » CXF-4.1.x-fixes-JDK17-deploy » Apache CXF Runtime JOSE JAX-RS #1158' does not have a result yet. Please make sure you set a proper result in case of pipeline/build scripts.
No mail will be sent out, as 'CXF » CXF-4.1.x-fixes-JDK17-deploy » JAX-RS WebSocket WebApp Demo #1158' does not have a result yet. Please make sure you set a proper result in case of pipeline/build scripts.
No mail will be sent out, as 'CXF » CXF-4.1.x-fixes-JDK17-deploy » JAX-RS Demo Using Distributed Tracing with OpenTelemetry API, Apache Camel and Jaeger #1158' does not have a result yet. Please make sure you set a proper result in case of pipeline/build scripts.
No mail will be sent out, as 'CXF » CXF-4.1.x-fixes-JDK17-deploy » WSDL first demo using Document/Literal Style #1158' does not have a result yet. Please make sure you set a proper result in case of pipeline/build scripts.
No mail will be sent out, as 'CXF » CXF-4.1.x-fixes-JDK17-deploy » Apache CXF CDI Integration System Tests - Weld #1158' does not have a result yet. Please make sure you set a proper result in case of pipeline/build scripts.
No mail will be sent out, as 'CXF » CXF-4.1.x-fixes-JDK17-deploy » JMS Transport Queue Demo using Document-Literal Style #1158' does not have a result yet. Please make sure you set a proper result in case of pipeline/build scripts.
No mail will be sent out, as 'CXF » CXF-4.1.x-fixes-JDK17-deploy » Apache CXF Java2WS Maven2 Plugin #1158' does not have a result yet. Please make sure you set a proper result in case of pipeline/build scripts.
No mail will be sent out, as 'CXF » CXF-4.1.x-fixes-JDK17-deploy » WSDL first demo using the jms transport and jmsConfigFeature #1158' does not have a result yet. Please make sure you set a proper result in case of pipeline/build scripts.
No mail will be sent out, as 'CXF » CXF-4.1.x-fixes-JDK17-deploy » Apache CXF XKMS #1158' does not have a result yet. Please make sure you set a proper result in case of pipeline/build scripts.
No mail will be sent out, as 'CXF » CXF-4.1.x-fixes-JDK17-deploy » Apache CXF STS basic systests #1158' does not have a result yet. Please make sure you set a proper result in case of pipeline/build scripts.
No mail will be sent out, as 'CXF » CXF-4.1.x-fixes-JDK17-deploy » Apache CXF WS-Security System Tests #1158' does not have a result yet. Please make sure you set a proper result in case of pipeline/build scripts.
No mail will be sent out, as 'CXF » CXF-4.1.x-fixes-JDK17-deploy » Apache CXF WADL2Java Code Generation Maven2 Plugin #1158' does not have a result yet. Please make sure you set a proper result in case of pipeline/build scripts.
No mail will be sent out, as 'CXF » CXF-4.1.x-fixes-JDK17-deploy » Apache CXF Runtime HTTP Netty Client Transport #1158' does not have a result yet. Please make sure you set a proper result in case of pipeline/build scripts.
No mail will be sent out, as 'CXF » CXF-4.1.x-fixes-JDK17-deploy » Apache CXF Runtime JavaScript Client Generator Tests #1158' does not have a result yet. Please make sure you set a proper result in case of pipeline/build scripts.
No mail will be sent out, as 'CXF » CXF-4.1.x-fixes-JDK17-deploy » JAX-WS Asynchronous Demo using Document/Literal Style #1158' does not have a result yet. Please make sure you set a proper result in case of pipeline/build scripts.
No mail will be sent out, as 'CXF » CXF-4.1.x-fixes-JDK17-deploy » Apache CXF WS-* Specifications System Tests #1158' does not have a result yet. Please make sure you set a proper result in case of pipeline/build scripts.
No mail will be sent out, as 'CXF » CXF-4.1.x-fixes-JDK17-deploy » Apache CXF Runtime Simple Frontend #1158' does not have a result yet. Please make sure you set a proper result in case of pipeline/build scripts.
No mail will be sent out, as 'CXF » CXF-4.1.x-fixes-JDK17-deploy » Apache CXF Spring Boot Integration #1158' does not have a result yet. Please make sure you set a proper result in case of pipeline/build scripts.
No mail will be sent out, as 'CXF » CXF-4.1.x-fixes-JDK17-deploy » Apache CXF Runtime JavaScript Client Generator #1158' does not have a result yet. Please make sure you set a proper result in case of pipeline/build scripts.
No mail will be sent out, as 'CXF » CXF-4.1.x-fixes-JDK17-deploy » JAX-RS SSE/CDI Demo (Jetty 9) #1158' does not have a result yet. Please make sure you set a proper result in case of pipeline/build scripts.
No mail will be sent out, as 'CXF » CXF-4.1.x-fixes-JDK17-deploy » Java First demo using JMS #1158' does not have a result yet. Please make sure you set a proper result in case of pipeline/build scripts.
No mail will be sent out, as 'CXF » CXF-4.1.x-fixes-JDK17-deploy » Apache CXF Runtime JAXB DataBinding #1158' does not have a result yet. Please make sure you set a proper result in case of pipeline/build scripts.
No mail will be sent out, as 'CXF » CXF-4.1.x-fixes-JDK17-deploy » Apache CXF WS-Security Interop System Tests #1158' does not have a result yet. Please make sure you set a proper result in case of pipeline/build scripts.
No mail will be sent out, as 'CXF » CXF-4.1.x-fixes-JDK17-deploy » Apache CXF XKMS Common #1158' does not have a result yet. Please make sure you set a proper result in case of pipeline/build scripts.
No mail will be sent out, as 'CXF » CXF-4.1.x-fixes-JDK17-deploy » Apache CXF Runtime JAX-WS Frontend #1158' does not have a result yet. Please make sure you set a proper result in case of pipeline/build scripts.
No mail will be sent out, as 'CXF » CXF-4.1.x-fixes-JDK17-deploy » Apache CXF Runtime JOSE Core #1158' does not have a result yet. Please make sure you set a proper result in case of pipeline/build scripts.
No mail will be sent out, as 'CXF » CXF-4.1.x-fixes-JDK17-deploy » Apache CXF SSE Integration System Tests #1158' does not have a result yet. Please make sure you set a proper result in case of pipeline/build scripts.
No mail will be sent out, as 'CXF » CXF-4.1.x-fixes-JDK17-deploy » Apache CXF System Tests for Maven Plugins #1158' does not have a result yet. Please make sure you set a proper result in case of pipeline/build scripts.
No mail will be sent out, as 'CXF » CXF-4.1.x-fixes-JDK17-deploy » Apache CXF JAX-RS System Tests #1158' does not have a result yet. Please make sure you set a proper result in case of pipeline/build scripts.
No mail will be sent out, as 'CXF » CXF-4.1.x-fixes-JDK17-deploy » Apache CXF Runtime #1158' does not have a result yet. Please make sure you set a proper result in case of pipeline/build scripts.
No mail will be sent out, as 'CXF » CXF-4.1.x-fixes-JDK17-deploy » JAX-WS GraalVM Demo (capture generated classes) #1158' does not have a result yet. Please make sure you set a proper result in case of pipeline/build scripts.
No mail will be sent out, as 'CXF » CXF-4.1.x-fixes-JDK17-deploy » Apache CXF Runtime WebSocket Transport #1158' does not have a result yet. Please make sure you set a proper result in case of pipeline/build scripts.
No mail will be sent out, as 'CXF » CXF-4.1.x-fixes-JDK17-deploy » Apache CXF CDI Integration System Tests - OWB with multiple apps #1158' does not have a result yet. Please make sure you set a proper result in case of pipeline/build scripts.
No mail will be sent out, as 'CXF » CXF-4.1.x-fixes-JDK17-deploy » Apache CXF WSN Core #1158' does not have a result yet. Please make sure you set a proper result in case of pipeline/build scripts.
No mail will be sent out, as 'CXF » CXF-4.1.x-fixes-JDK17-deploy » Apache CXF CDI Integration System Tests - OWB with no apps #1158' does not have a result yet. Please make sure you set a proper result in case of pipeline/build scripts.
No mail will be sent out, as 'CXF » CXF-4.1.x-fixes-JDK17-deploy » Apache CXF XKMS Client #1158' does not have a result yet. Please make sure you set a proper result in case of pipeline/build scripts.
No mail will be sent out, as 'CXF » CXF-4.1.x-fixes-JDK17-deploy » Apache CXF Transport System Tests JMS #1158' does not have a result yet. Please make sure you set a proper result in case of pipeline/build scripts.
No mail will be sent out, as 'CXF » CXF-4.1.x-fixes-JDK17-deploy » Apache CXF Command Line Tools CORBA #1158' does not have a result yet. Please make sure you set a proper result in case of pipeline/build scripts.
No mail will be sent out, as 'CXF » CXF-4.1.x-fixes-JDK17-deploy » JAX-RS Basic Demo With HTTP/2 communications #1158' does not have a result yet. Please make sure you set a proper result in case of pipeline/build scripts.
No mail will be sent out, as 'CXF » CXF-4.1.x-fixes-JDK17-deploy » Apache CXF WS-RM Specifications System Tests #1158' does not have a result yet. Please make sure you set a proper result in case of pipeline/build scripts.
No mail will be sent out, as 'CXF » CXF-4.1.x-fixes-JDK17-deploy » Apache CXF Runtime HTTP Async Transport #1158' does not have a result yet. Please make sure you set a proper result in case of pipeline/build scripts.
No mail will be sent out, as 'CXF » CXF-4.1.x-fixes-JDK17-deploy » Apache CXF MicroProfile No-CDI/Config Sys Tests #1158' does not have a result yet. Please make sure you set a proper result in case of pipeline/build scripts.
No mail will be sent out, as 'CXF » CXF-4.1.x-fixes-JDK17-deploy » CXF WS-SecurityPolicy Signature Encryption Demo #1158' does not have a result yet. Please make sure you set a proper result in case of pipeline/build scripts.
No mail will be sent out, as 'CXF » CXF-4.1.x-fixes-JDK17-deploy » Apache CXF System Tests - MicroProfile Rest Client TCK on Weld #1158' does not have a result yet. Please make sure you set a proper result in case of pipeline/build scripts.
No mail will be sent out, as 'CXF » CXF-4.1.x-fixes-JDK17-deploy » Apache CXF WSN OSGi #1158' does not have a result yet. Please make sure you set a proper result in case of pipeline/build scripts.
No mail will be sent out, as 'CXF » CXF-4.1.x-fixes-JDK17-deploy » WS-Addressing Demo #1158' does not have a result yet. Please make sure you set a proper result in case of pipeline/build scripts.
No mail will be sent out, as 'CXF » CXF-4.1.x-fixes-JDK17-deploy » Apache CXF SSE Integration System Tests base classes #1158' does not have a result yet. Please make sure you set a proper result in case of pipeline/build scripts.
No mail will be sent out, as 'CXF » CXF-4.1.x-fixes-JDK17-deploy » Apache CXF Runtime JavaScript Client Generator Projects #1158' does not have a result yet. Please make sure you set a proper result in case of pipeline/build scripts.
No mail will be sent out, as 'CXF » CXF-4.1.x-fixes-JDK17-deploy » JAX-RS SSE Demo (Jetty 9) #1158' does not have a result yet. Please make sure you set a proper result in case of pipeline/build scripts.
No mail will be sent out, as 'CXF » CXF-4.1.x-fixes-JDK17-deploy » Apache CXF Transports Runtime #1158' does not have a result yet. Please make sure you set a proper result in case of pipeline/build scripts.
No mail will be sent out, as 'CXF » CXF-4.1.x-fixes-JDK17-deploy » Apache CXF Runtime Security functionality #1158' does not have a result yet. Please make sure you set a proper result in case of pipeline/build scripts.
No mail will be sent out, as 'CXF » CXF-4.1.x-fixes-JDK17-deploy » Apache CXF STS test OSGi deployment #1158' does not have a result yet. Please make sure you set a proper result in case of pipeline/build scripts.
No mail will be sent out, as 'CXF » CXF-4.1.x-fixes-JDK17-deploy » JAX-RS Content Negotiation Demo #1158' does not have a result yet. Please make sure you set a proper result in case of pipeline/build scripts.
No mail will be sent out, as 'CXF » CXF-4.1.x-fixes-JDK17-deploy » Apache CXF WS-Discovery #1158' does not have a result yet. Please make sure you set a proper result in case of pipeline/build scripts.
No mail will be sent out, as 'CXF » CXF-4.1.x-fixes-JDK17-deploy » Apache CXF Distributed Tracing using OpenZipkin Brave #1158' does not have a result yet. Please make sure you set a proper result in case of pipeline/build scripts.
No mail will be sent out, as 'CXF » CXF-4.1.x-fixes-JDK17-deploy » Apache CXF Manifest Jar #1158' does not have a result yet. Please make sure you set a proper result in case of pipeline/build scripts.
No mail will be sent out, as 'CXF » CXF-4.1.x-fixes-JDK17-deploy » JAX-RS OData #1158' does not have a result yet. Please make sure you set a proper result in case of pipeline/build scripts.
No mail will be sent out, as 'CXF » CXF-4.1.x-fixes-JDK17-deploy » Apache CXF Runtime OAuth 2.0 #1158' does not have a result yet. Please make sure you set a proper result in case of pipeline/build scripts.
No mail will be sent out, as 'CXF » CXF-4.1.x-fixes-JDK17-deploy » Test for generating code from wsdl in repo #1158' does not have a result yet. Please make sure you set a proper result in case of pipeline/build scripts.
No mail will be sent out, as 'CXF » CXF-4.1.x-fixes-JDK17-deploy » Apache CXF Web Services Runtime #1158' does not have a result yet. Please make sure you set a proper result in case of pipeline/build scripts.
No mail will be sent out, as 'CXF » CXF-4.1.x-fixes-JDK17-deploy » Apache CXF Runtime OAuth 2.0 SAML #1158' does not have a result yet. Please make sure you set a proper result in case of pipeline/build scripts.
No mail will be sent out, as 'CXF » CXF-4.1.x-fixes-JDK17-deploy » Apache CXF Runtime HTTP Jetty Transport #1158' does not have a result yet. Please make sure you set a proper result in case of pipeline/build scripts.
No mail will be sent out, as 'CXF » CXF-4.1.x-fixes-JDK17-deploy » Test for writing wsdl to repo #1158' does not have a result yet. Please make sure you set a proper result in case of pipeline/build scripts.
No mail will be sent out, as 'CXF » CXF-4.1.x-fixes-JDK17-deploy » Apache CXF Command Line Tools #1158' does not have a result yet. Please make sure you set a proper result in case of pipeline/build scripts.
No mail will be sent out, as 'CXF » CXF-4.1.x-fixes-JDK17-deploy » Bank sample using JAX-WS API's to talk via CORBA/IIOP #1158' does not have a result yet. Please make sure you set a proper result in case of pipeline/build scripts.
No mail will be sent out, as 'CXF » CXF-4.1.x-fixes-JDK17-deploy » Sample using SOAP Headers #1158' does not have a result yet. Please make sure you set a proper result in case of pipeline/build scripts.
No mail will be sent out, as 'CXF » CXF-4.1.x-fixes-JDK17-deploy » Apache CXF Parent #1158' does not have a result yet. Please make sure you set a proper result in case of pipeline/build scripts.
No mail will be sent out, as 'CXF » CXF-4.1.x-fixes-JDK17-deploy » Apache CXF Maven Plugins #1158' does not have a result yet. Please make sure you set a proper result in case of pipeline/build scripts.
No mail will be sent out, as 'CXF » CXF-4.1.x-fixes-JDK17-deploy » Apache CXF Archetype - Simple JAX-WS Java First #1158' does not have a result yet. Please make sure you set a proper result in case of pipeline/build scripts.
No mail will be sent out, as 'CXF » CXF-4.1.x-fixes-JDK17-deploy » JAX-RS WebSocket Demo #1158' does not have a result yet. Please make sure you set a proper result in case of pipeline/build scripts.
No mail will be sent out, as 'CXF » CXF-4.1.x-fixes-JDK17-deploy » JAX-RS Basic Demo With HTTP/2 communications #1158' does not have a result yet. Please make sure you set a proper result in case of pipeline/build scripts.
No mail will be sent out, as 'CXF » CXF-4.1.x-fixes-JDK17-deploy » JAX-RS Basic With HTTPS communications #1158' does not have a result yet. Please make sure you set a proper result in case of pipeline/build scripts.
No mail will be sent out, as 'CXF » CXF-4.1.x-fixes-JDK17-deploy » Java First demo using JAX-WS APIs #1158' does not have a result yet. Please make sure you set a proper result in case of pipeline/build scripts.
No mail will be sent out, as 'CXF » CXF-4.1.x-fixes-JDK17-deploy » JAX-RS SSE Client Demo (Tomcat 8) #1158' does not have a result yet. Please make sure you set a proper result in case of pipeline/build scripts.
No mail will be sent out, as 'CXF » CXF-4.1.x-fixes-JDK17-deploy » JAX-WS Handler Demo #1158' does not have a result yet. Please make sure you set a proper result in case of pipeline/build scripts.
No mail will be sent out, as 'CXF » CXF-4.1.x-fixes-JDK17-deploy » Spring Boot CXF Web Services Transaction Sample #1158' does not have a result yet. Please make sure you set a proper result in case of pipeline/build scripts.
No mail will be sent out, as 'CXF » CXF-4.1.x-fixes-JDK17-deploy » Apache CXF Netty Transport System Tests #1158' does not have a result yet. Please make sure you set a proper result in case of pipeline/build scripts.
No mail will be sent out, as 'CXF » CXF-4.1.x-fixes-JDK17-deploy » Apache CXF Command Line Tools JavaTo WS #1158' does not have a result yet. Please make sure you set a proper result in case of pipeline/build scripts.
No mail will be sent out, as 'CXF » CXF-4.1.x-fixes-JDK17-deploy » Apache CXF Runtime HTTP Netty Server Transport #1158' does not have a result yet. Please make sure you set a proper result in case of pipeline/build scripts.
No mail will be sent out, as 'CXF » CXF-4.1.x-fixes-JDK17-deploy » Apache CXF LDAP Integration System Tests #1158' does not have a result yet. Please make sure you set a proper result in case of pipeline/build scripts.
No mail will be sent out, as 'CXF » CXF-4.1.x-fixes-JDK17-deploy » JAX-RS Basic Demo With HTTP/2 communications #1158' does not have a result yet. Please make sure you set a proper result in case of pipeline/build scripts.
No mail will be sent out, as 'CXF » CXF-4.1.x-fixes-JDK17-deploy » SOAP/JMS Transport Specification Demo using Document-Literal Style #1158' does not have a result yet. Please make sure you set a proper result in case of pipeline/build scripts.
No mail will be sent out, as 'CXF » CXF-4.1.x-fixes-JDK17-deploy » Apache CXF Distributed Tracing using OpenTracing #1158' does not have a result yet. Please make sure you set a proper result in case of pipeline/build scripts.
No mail will be sent out, as 'CXF » CXF-4.1.x-fixes-JDK17-deploy » Colocated Demo using Document/Literal Style #1158' does not have a result yet. Please make sure you set a proper result in case of pipeline/build scripts.
No mail will be sent out, as 'CXF » CXF-4.1.x-fixes-JDK17-deploy » Apache CXF Runtime HTTP Transport #1158' does not have a result yet. Please make sure you set a proper result in case of pipeline/build scripts.
No mail will be sent out, as 'CXF » CXF-4.1.x-fixes-JDK17-deploy » Apache CXF Observability using Micrometer Observation #1158' does not have a result yet. Please make sure you set a proper result in case of pipeline/build scripts.
No mail will be sent out, as 'CXF » CXF-4.1.x-fixes-JDK17-deploy » Apache CXF JAX-RS Service Description OpenAPI/Swagger Common #1158' does not have a result yet. Please make sure you set a proper result in case of pipeline/build scripts.
No mail will be sent out, as 'CXF » CXF-4.1.x-fixes-JDK17-deploy » Apache CXF SSE Integration System Tests for Undertow #1158' does not have a result yet. Please make sure you set a proper result in case of pipeline/build scripts.
ERROR: Failed to parse POMs
java.io.IOException: java.lang.reflect.InvocationTargetException
	at PluginClassLoader for maven-plugin//hudson.maven.Maven3Builder.call(Maven3Builder.java:178)
	at PluginClassLoader for maven-plugin//hudson.maven.Maven3Builder.call(Maven3Builder.java:71)
	at hudson.remoting.UserRequest.perform(UserRequest.java:225)
	at hudson.remoting.UserRequest.perform(UserRequest.java:50)
	at hudson.remoting.Request$2.run(Request.java:391)
	at hudson.remoting.InterceptingExecutorService.lambda$wrap$0(InterceptingExecutorService.java:81)
	at java.base/java.util.concurrent.FutureTask.run(FutureTask.java:264)
	at java.base/java.util.concurrent.ThreadPoolExecutor.runWorker(ThreadPoolExecutor.java:1136)
	at java.base/java.util.concurrent.ThreadPoolExecutor$Worker.run(ThreadPoolExecutor.java:635)
	at java.base/java.lang.Thread.run(Thread.java:840)
	Suppressed: hudson.remoting.Channel$CallSiteStackTrace: Remote call to Channel to Maven [/home/jenkins/tools/java/latest17/bin/java, -da, -dsa, -Xmx1024M, -cp, /home/jenkins/maven35-agent.jar:/home/jenkins/tools/maven/latest3/boot/plexus-classworlds-2.12.1.jar:/home/jenkins/tools/maven/latest3/conf/logging, jenkins.maven3.agent.Maven35Main, /home/jenkins/tools/maven/latest3, /home/jenkins/agent.jar, /home/jenkins/maven35-interceptor.jar, /home/jenkins/maven3-interceptor-commons.jar, 38971]
		at hudson.remoting.Channel.attachCallSiteStackTrace(Channel.java:1923)
		at hudson.remoting.UserRequest$ExceptionResponse.retrieve(UserRequest.java:384)
		at hudson.remoting.Channel.call(Channel.java:1112)
		at PluginClassLoader for maven-plugin//hudson.maven.ProcessCache$MavenProcess.call(ProcessCache.java:161)
		at PluginClassLoader for maven-plugin//hudson.maven.MavenModuleSetBuild$MavenModuleSetBuildExecution.doRun(MavenModuleSetBuild.java:877)
		at hudson.model.AbstractBuild$AbstractBuildExecution.run(AbstractBuild.java:527)
		at hudson.model.Run.execute(Run.java:1833)
		at PluginClassLoader for maven-plugin//hudson.maven.MavenModuleSetBuild.run(MavenModuleSetBuild.java:543)
		at hudson.model.ResourceController.execute(ResourceController.java:101)
		at hudson.model.Executor.run(Executor.java:446)
Caused by: java.lang.reflect.InvocationTargetException
	at java.base/jdk.internal.reflect.NativeMethodAccessorImpl.invoke0(Native Method)
	at java.base/jdk.internal.reflect.NativeMethodAccessorImpl.invoke(NativeMethodAccessorImpl.java:77)
	at java.base/jdk.internal.reflect.DelegatingMethodAccessorImpl.invoke(DelegatingMethodAccessorImpl.java:43)
	at java.base/java.lang.reflect.Method.invoke(Method.java:569)
	at PluginClassLoader for maven-plugin//hudson.maven.Maven3Builder.call(Maven3Builder.java:140)
	... 9 more
Caused by: java.lang.Exception: java.lang.reflect.InvocationTargetException
	at jenkins.maven3.agent.Maven35Main.launch(Maven35Main.java:182)
	... 14 more
Caused by: java.lang.reflect.InvocationTargetException
	at java.base/jdk.internal.reflect.NativeMethodAccessorImpl.invoke0(Native Method)
	at java.base/jdk.internal.reflect.NativeMethodAccessorImpl.invoke(NativeMethodAccessorImpl.java:77)
	at java.base/jdk.internal.reflect.DelegatingMethodAccessorImpl.invoke(DelegatingMethodAccessorImpl.java:43)
	at java.base/java.lang.reflect.Method.invoke(Method.java:569)
	at org.codehaus.plexus.classworlds.launcher.Launcher.launchEnhanced(Launcher.java:255)
	at org.codehaus.plexus.classworlds.launcher.Launcher.launch(Launcher.java:201)
	at jenkins.maven3.agent.Maven35Main.launch(Maven35Main.java:179)
	... 14 more
Caused by: java.lang.UnsupportedOperationException
	at org.eclipse.sisu.wire.EntryListAdapter$ValueListIterator.add(EntryListAdapter.java:185)
	at java.base/java.util.AbstractSequentialList.add(AbstractSequentialList.java:146)
	at java.base/java.util.AbstractList.add(AbstractList.java:111)
	at java.base/java.util.AbstractCollection.addAll(AbstractCollection.java:336)
	at org.jvnet.hudson.maven3.launcher.Maven35Launcher.main(Maven35Launcher.java:127)
	... 21 more
channel stopped