You are viewing a plain text version of this content. The canonical link for it is here.
Posted to builds@beam.apache.org by Apache Jenkins Server <je...@builds.apache.org> on 2023/08/12 19:37:14 UTC

Build failed in Jenkins: beam_Inference_Python_Benchmarks_Dataflow #338

See <https://ci-beam.apache.org/job/beam_Inference_Python_Benchmarks_Dataflow/338/display/redirect>

Changes:


------------------------------------------
[...truncated 467.09 KB...]
Using cached scikit_learn-1.3.0-cp38-cp38-manylinux_2_17_x86_64.manylinux2014_x86_64.whl (11.1 MB)
Using cached SQLAlchemy-1.4.49-cp38-cp38-manylinux_2_5_x86_64.manylinux1_x86_64.manylinux_2_17_x86_64.manylinux2014_x86_64.whl (1.6 MB)
Using cached typing_extensions-4.7.1-py3-none-any.whl (33 kB)
Using cached botocore-1.31.25-py3-none-any.whl (11.1 MB)
Using cached certifi-2023.7.22-py3-none-any.whl (158 kB)
Using cached charset_normalizer-3.2.0-cp38-cp38-manylinux_2_17_x86_64.manylinux2014_x86_64.whl (199 kB)
Using cached dnspython-2.4.2-py3-none-any.whl (300 kB)
Using cached docker-6.1.3-py3-none-any.whl (148 kB)
Using cached exceptiongroup-1.1.2-py3-none-any.whl (14 kB)
Using cached execnet-2.0.2-py3-none-any.whl (37 kB)
Using cached google_cloud_resource_manager-1.10.3-py2.py3-none-any.whl (320 kB)
Using cached google_cloud_storage-2.10.0-py2.py3-none-any.whl (114 kB)
Using cached googleapis_common_protos-1.60.0-py2.py3-none-any.whl (227 kB)
Using cached greenlet-3.0.0a1-cp38-cp38-manylinux_2_17_x86_64.manylinux2014_x86_64.whl (613 kB)
Using cached grpcio_status-1.57.0-py3-none-any.whl (5.1 kB)
Using cached msal-1.24.0b1-py2.py3-none-any.whl (90 kB)
Using cached pyparsing-3.1.1-py3-none-any.whl (103 kB)
Using cached threadpoolctl-3.2.0-py3-none-any.whl (15 kB)
Using cached urllib3-1.26.16-py2.py3-none-any.whl (143 kB)
Using cached PyMySQL-1.1.0-py3-none-any.whl (44 kB)
Using cached websocket_client-1.6.1-py3-none-any.whl (56 kB)
Using cached PyJWT-2.8.0-py3-none-any.whl (22 kB)
Building wheels for collected packages: apache-beam
  Building wheel for apache-beam (setup.py): started
  Building wheel for apache-beam (setup.py): finished with status 'done'
  Created wheel for apache-beam: filename=apache_beam-2.51.0.dev0-py3-none-any.whl size=3259086 sha256=f41c304fc9e5b11d45c436d69f682cedd74bb22e27b60cd36bff9ed30123563c
  Stored in directory: /home/jenkins/.cache/pip/wheels/d4/ad/b4/5dfba3e341b10ae80f4e32ab3ad25d368a3c6304b888eb7e37
Successfully built apache-beam
Installing collected packages: sortedcontainers, pytz, docopt, crcmod, zstandard, wrapt, websocket-client, urllib3, typing-extensions, threadpoolctl, tenacity, sqlparse, six, shapely, scipy, regex, pyyaml, pyparsing, pymysql, PyJWT, pyhamcrest, pycparser, pyasn1, pyarrow, psycopg2-binary, protobuf, portalocker, parameterized, overrides, orjson, objsize, mock, joblib, jmespath, iniconfig, idna, greenlet, google-crc32c, fasteners, fastavro, execnet, exceptiongroup, dnspython, dill, deprecation, cloudpickle, charset-normalizer, certifi, attrs, sqlalchemy, scikit-learn, rsa, requests, python-dateutil, pytest, pymongo, pydot, pyasn1-modules, proto-plus, isodate, hypothesis, httplib2, googleapis-common-protos, google-resumable-media, cffi, requests_mock, pytest-xdist, pytest-timeout, pandas, oauth2client, hdfs, grpcio-status, google-auth, freezegun, docker, cryptography, botocore, azure-core, testcontainers, s3transfer, grpc-google-iam-v1, google-auth-httplib2, google-apitools, google-api-core, azure-storage-blob, apache-beam, msal, google-cloud-core, boto3, msal-extensions, google-cloud-vision, google-cloud-videointelligence, google-cloud-storage, google-cloud-spanner, google-cloud-resource-manager, google-cloud-recommendations-ai, google-cloud-pubsub, google-cloud-language, google-cloud-dlp, google-cloud-datastore, google-cloud-bigtable, google-cloud-bigquery-storage, google-cloud-bigquery, google-cloud-pubsublite, google-cloud-aiplatform, azure-identity
  Attempting uninstall: protobuf
    Found existing installation: protobuf 4.24.0
    Uninstalling protobuf-4.24.0:
      Successfully uninstalled protobuf-4.24.0
Successfully installed PyJWT-2.8.0 apache-beam-2.51.0.dev0 attrs-23.1.0 azure-core-1.29.1 azure-identity-1.14.0 azure-storage-blob-12.18.0b1 boto3-1.28.25 botocore-1.31.25 certifi-2023.7.22 cffi-1.15.1 charset-normalizer-3.2.0 cloudpickle-2.2.1 crcmod-1.7 cryptography-41.0.3 deprecation-2.1.0 dill-0.3.1.1 dnspython-2.4.2 docker-6.1.3 docopt-0.6.2 exceptiongroup-1.1.2 execnet-2.0.2 fastavro-1.8.2 fasteners-0.18 freezegun-1.2.2 google-api-core-2.12.0.dev0 google-apitools-0.5.31 google-auth-2.22.0 google-auth-httplib2-0.1.0 google-cloud-aiplatform-1.30.1 google-cloud-bigquery-3.11.4 google-cloud-bigquery-storage-2.22.0 google-cloud-bigtable-2.21.0 google-cloud-core-2.3.3 google-cloud-datastore-2.17.0 google-cloud-dlp-3.12.2 google-cloud-language-2.10.1 google-cloud-pubsub-2.18.2 google-cloud-pubsublite-1.8.3 google-cloud-recommendations-ai-0.10.4 google-cloud-resource-manager-1.10.3 google-cloud-spanner-3.40.0 google-cloud-storage-2.10.0 google-cloud-videointelligence-2.11.3 google-cloud-vision-3.4.4 google-crc32c-1.5.0 google-resumable-media-2.5.0 googleapis-common-protos-1.60.0 greenlet-3.0.0a1 grpc-google-iam-v1-0.12.6 grpcio-status-1.57.0 hdfs-2.7.2 httplib2-0.22.0 hypothesis-6.82.3 idna-3.4 iniconfig-2.0.0 isodate-0.6.1 jmespath-1.0.1 joblib-1.3.2 mock-5.1.0 msal-1.24.0b1 msal-extensions-1.0.0 oauth2client-4.1.3 objsize-0.6.1 orjson-3.9.4 overrides-6.5.0 pandas-1.5.3 parameterized-0.9.0 portalocker-2.7.0 proto-plus-1.22.3 protobuf-4.23.4 psycopg2-binary-2.9.7 pyarrow-11.0.0 pyasn1-0.5.0 pyasn1-modules-0.3.0 pycparser-2.21 pydot-1.4.2 pyhamcrest-2.0.4 pymongo-4.4.1 pymysql-1.1.0 pyparsing-3.1.1 pytest-7.4.0 pytest-timeout-2.1.0 pytest-xdist-3.3.1 python-dateutil-2.8.2 pytz-2023.3 pyyaml-6.0.1 regex-2023.8.8 requests-2.31.0 requests_mock-1.11.0 rsa-4.9 s3transfer-0.6.1 scikit-learn-1.3.0 scipy-1.10.1 shapely-1.8.5.post1 six-1.16.0 sortedcontainers-2.4.0 sqlalchemy-1.4.49 sqlparse-0.4.4 tenacity-8.2.2 testcontainers-3.7.1 threadpoolctl-3.2.0 typing-extensions-4.7.1 urllib3-1.26.16 websocket-client-1.6.1 wrapt-1.15.0 zstandard-0.21.0

> Task :sdks:python:apache_beam:testing:load_tests:run
Collecting torch>=1.7.1 (from -r apache_beam/ml/inference/torch_tests_requirements.txt (line 18))
  Using cached torch-2.0.1-cp38-cp38-manylinux1_x86_64.whl (619.9 MB)
Collecting torchvision>=0.8.2 (from -r apache_beam/ml/inference/torch_tests_requirements.txt (line 19))
  Using cached torchvision-0.15.2-cp38-cp38-manylinux1_x86_64.whl (33.8 MB)
Collecting pillow>=8.0.0 (from -r apache_beam/ml/inference/torch_tests_requirements.txt (line 20))
  Obtaining dependency information for pillow>=8.0.0 from https://files.pythonhosted.org/packages/ff/8c/5927a58c43ebc16e508eef325fdc6473b569e2474d3b4be49798aa371007/Pillow-10.0.0-cp38-cp38-manylinux_2_28_x86_64.whl.metadata
  Using cached Pillow-10.0.0-cp38-cp38-manylinux_2_28_x86_64.whl.metadata (9.5 kB)
Collecting transformers>=4.18.0 (from -r apache_beam/ml/inference/torch_tests_requirements.txt (line 21))
  Obtaining dependency information for transformers>=4.18.0 from https://files.pythonhosted.org/packages/21/02/ae8e595f45b6c8edee07913892b3b41f5f5f273962ad98851dc6a564bbb9/transformers-4.31.0-py3-none-any.whl.metadata
  Using cached transformers-4.31.0-py3-none-any.whl.metadata (116 kB)
Requirement already satisfied: filelock in <https://ci-beam.apache.org/job/beam_Inference_Python_Benchmarks_Dataflow/ws/src/build/gradleenv/1329484227/lib/python3.8/site-packages> (from torch>=1.7.1->-r apache_beam/ml/inference/torch_tests_requirements.txt (line 18)) (3.12.2)
Requirement already satisfied: typing-extensions in <https://ci-beam.apache.org/job/beam_Inference_Python_Benchmarks_Dataflow/ws/src/build/gradleenv/1329484227/lib/python3.8/site-packages> (from torch>=1.7.1->-r apache_beam/ml/inference/torch_tests_requirements.txt (line 18)) (4.7.1)
Collecting sympy (from torch>=1.7.1->-r apache_beam/ml/inference/torch_tests_requirements.txt (line 18))
  Using cached sympy-1.12-py3-none-any.whl (5.7 MB)
Collecting networkx (from torch>=1.7.1->-r apache_beam/ml/inference/torch_tests_requirements.txt (line 18))
  Using cached networkx-3.1-py3-none-any.whl (2.1 MB)
Collecting jinja2 (from torch>=1.7.1->-r apache_beam/ml/inference/torch_tests_requirements.txt (line 18))
  Using cached Jinja2-3.1.2-py3-none-any.whl (133 kB)
Collecting nvidia-cuda-nvrtc-cu11==11.7.99 (from torch>=1.7.1->-r apache_beam/ml/inference/torch_tests_requirements.txt (line 18))
  Using cached nvidia_cuda_nvrtc_cu11-11.7.99-2-py3-none-manylinux1_x86_64.whl (21.0 MB)
Collecting nvidia-cuda-runtime-cu11==11.7.99 (from torch>=1.7.1->-r apache_beam/ml/inference/torch_tests_requirements.txt (line 18))
  Using cached nvidia_cuda_runtime_cu11-11.7.99-py3-none-manylinux1_x86_64.whl (849 kB)
Collecting nvidia-cuda-cupti-cu11==11.7.101 (from torch>=1.7.1->-r apache_beam/ml/inference/torch_tests_requirements.txt (line 18))
  Using cached nvidia_cuda_cupti_cu11-11.7.101-py3-none-manylinux1_x86_64.whl (11.8 MB)
Collecting nvidia-cudnn-cu11==8.5.0.96 (from torch>=1.7.1->-r apache_beam/ml/inference/torch_tests_requirements.txt (line 18))
  Using cached nvidia_cudnn_cu11-8.5.0.96-2-py3-none-manylinux1_x86_64.whl (557.1 MB)
Collecting nvidia-cublas-cu11==11.10.3.66 (from torch>=1.7.1->-r apache_beam/ml/inference/torch_tests_requirements.txt (line 18))
  Using cached nvidia_cublas_cu11-11.10.3.66-py3-none-manylinux1_x86_64.whl (317.1 MB)
Collecting nvidia-cufft-cu11==10.9.0.58 (from torch>=1.7.1->-r apache_beam/ml/inference/torch_tests_requirements.txt (line 18))
  Using cached nvidia_cufft_cu11-10.9.0.58-py3-none-manylinux1_x86_64.whl (168.4 MB)
Collecting nvidia-curand-cu11==10.2.10.91 (from torch>=1.7.1->-r apache_beam/ml/inference/torch_tests_requirements.txt (line 18))
  Using cached nvidia_curand_cu11-10.2.10.91-py3-none-manylinux1_x86_64.whl (54.6 MB)
Collecting nvidia-cusolver-cu11==11.4.0.1 (from torch>=1.7.1->-r apache_beam/ml/inference/torch_tests_requirements.txt (line 18))
  Using cached nvidia_cusolver_cu11-11.4.0.1-2-py3-none-manylinux1_x86_64.whl (102.6 MB)
Collecting nvidia-cusparse-cu11==11.7.4.91 (from torch>=1.7.1->-r apache_beam/ml/inference/torch_tests_requirements.txt (line 18))
  Using cached nvidia_cusparse_cu11-11.7.4.91-py3-none-manylinux1_x86_64.whl (173.2 MB)
Collecting nvidia-nccl-cu11==2.14.3 (from torch>=1.7.1->-r apache_beam/ml/inference/torch_tests_requirements.txt (line 18))
  Using cached nvidia_nccl_cu11-2.14.3-py3-none-manylinux1_x86_64.whl (177.1 MB)
Collecting nvidia-nvtx-cu11==11.7.91 (from torch>=1.7.1->-r apache_beam/ml/inference/torch_tests_requirements.txt (line 18))
  Using cached nvidia_nvtx_cu11-11.7.91-py3-none-manylinux1_x86_64.whl (98 kB)
Collecting triton==2.0.0 (from torch>=1.7.1->-r apache_beam/ml/inference/torch_tests_requirements.txt (line 18))
  Using cached triton-2.0.0-1-cp38-cp38-manylinux2014_x86_64.manylinux_2_17_x86_64.whl (63.2 MB)
Requirement already satisfied: setuptools in <https://ci-beam.apache.org/job/beam_Inference_Python_Benchmarks_Dataflow/ws/src/build/gradleenv/1329484227/lib/python3.8/site-packages> (from nvidia-cublas-cu11==11.10.3.66->torch>=1.7.1->-r apache_beam/ml/inference/torch_tests_requirements.txt (line 18)) (68.0.0)
Requirement already satisfied: wheel in <https://ci-beam.apache.org/job/beam_Inference_Python_Benchmarks_Dataflow/ws/src/build/gradleenv/1329484227/lib/python3.8/site-packages> (from nvidia-cublas-cu11==11.10.3.66->torch>=1.7.1->-r apache_beam/ml/inference/torch_tests_requirements.txt (line 18)) (0.41.1)
Collecting cmake (from triton==2.0.0->torch>=1.7.1->-r apache_beam/ml/inference/torch_tests_requirements.txt (line 18))
  Obtaining dependency information for cmake from https://files.pythonhosted.org/packages/2e/51/3a4672a819b4532a378bfefad8f886cfe71057556e0d4eefb64523fd370a/cmake-3.27.2-py2.py3-none-manylinux2014_x86_64.manylinux_2_17_x86_64.whl.metadata
  Using cached cmake-3.27.2-py2.py3-none-manylinux2014_x86_64.manylinux_2_17_x86_64.whl.metadata (6.7 kB)
Collecting lit (from triton==2.0.0->torch>=1.7.1->-r apache_beam/ml/inference/torch_tests_requirements.txt (line 18))
  Using cached lit-16.0.6-py3-none-any.whl
Requirement already satisfied: numpy in <https://ci-beam.apache.org/job/beam_Inference_Python_Benchmarks_Dataflow/ws/src/build/gradleenv/1329484227/lib/python3.8/site-packages> (from torchvision>=0.8.2->-r apache_beam/ml/inference/torch_tests_requirements.txt (line 19)) (1.24.4)
Requirement already satisfied: requests in <https://ci-beam.apache.org/job/beam_Inference_Python_Benchmarks_Dataflow/ws/src/build/gradleenv/1329484227/lib/python3.8/site-packages> (from torchvision>=0.8.2->-r apache_beam/ml/inference/torch_tests_requirements.txt (line 19)) (2.31.0)
Collecting huggingface-hub<1.0,>=0.14.1 (from transformers>=4.18.0->-r apache_beam/ml/inference/torch_tests_requirements.txt (line 21))
  Obtaining dependency information for huggingface-hub<1.0,>=0.14.1 from https://files.pythonhosted.org/packages/7f/c4/adcbe9a696c135578cabcbdd7331332daad4d49b7c43688bc2d36b3a47d2/huggingface_hub-0.16.4-py3-none-any.whl.metadata
  Using cached huggingface_hub-0.16.4-py3-none-any.whl.metadata (12 kB)
Requirement already satisfied: packaging>=20.0 in <https://ci-beam.apache.org/job/beam_Inference_Python_Benchmarks_Dataflow/ws/src/build/gradleenv/1329484227/lib/python3.8/site-packages> (from transformers>=4.18.0->-r apache_beam/ml/inference/torch_tests_requirements.txt (line 21)) (23.1)
Requirement already satisfied: pyyaml>=5.1 in <https://ci-beam.apache.org/job/beam_Inference_Python_Benchmarks_Dataflow/ws/src/build/gradleenv/1329484227/lib/python3.8/site-packages> (from transformers>=4.18.0->-r apache_beam/ml/inference/torch_tests_requirements.txt (line 21)) (6.0.1)
Requirement already satisfied: regex!=2019.12.17 in <https://ci-beam.apache.org/job/beam_Inference_Python_Benchmarks_Dataflow/ws/src/build/gradleenv/1329484227/lib/python3.8/site-packages> (from transformers>=4.18.0->-r apache_beam/ml/inference/torch_tests_requirements.txt (line 21)) (2023.8.8)
Collecting tokenizers!=0.11.3,<0.14,>=0.11.1 (from transformers>=4.18.0->-r apache_beam/ml/inference/torch_tests_requirements.txt (line 21))
  Using cached tokenizers-0.13.3-cp38-cp38-manylinux_2_17_x86_64.manylinux2014_x86_64.whl (7.8 MB)
Collecting safetensors>=0.3.1 (from transformers>=4.18.0->-r apache_beam/ml/inference/torch_tests_requirements.txt (line 21))
  Obtaining dependency information for safetensors>=0.3.1 from https://files.pythonhosted.org/packages/4d/81/9b6ee8bd7faf7ae79afafde28b4e8abbcb897c9aa089d51eb5d0a1f3ffcd/safetensors-0.3.2-cp38-cp38-manylinux_2_17_x86_64.manylinux2014_x86_64.whl.metadata
  Using cached safetensors-0.3.2-cp38-cp38-manylinux_2_17_x86_64.manylinux2014_x86_64.whl.metadata (4.5 kB)
Collecting tqdm>=4.27 (from transformers>=4.18.0->-r apache_beam/ml/inference/torch_tests_requirements.txt (line 21))
  Obtaining dependency information for tqdm>=4.27 from https://files.pythonhosted.org/packages/00/e5/f12a80907d0884e6dff9c16d0c0114d81b8cd07dc3ae54c5e962cc83037e/tqdm-4.66.1-py3-none-any.whl.metadata
  Using cached tqdm-4.66.1-py3-none-any.whl.metadata (57 kB)
Collecting fsspec (from huggingface-hub<1.0,>=0.14.1->transformers>=4.18.0->-r apache_beam/ml/inference/torch_tests_requirements.txt (line 21))
  Obtaining dependency information for fsspec from https://files.pythonhosted.org/packages/e3/bd/4c0a4619494188a9db5d77e2100ab7d544a42e76b2447869d8e124e981d8/fsspec-2023.6.0-py3-none-any.whl.metadata
  Using cached fsspec-2023.6.0-py3-none-any.whl.metadata (6.7 kB)
Collecting MarkupSafe>=2.0 (from jinja2->torch>=1.7.1->-r apache_beam/ml/inference/torch_tests_requirements.txt (line 18))
  Obtaining dependency information for MarkupSafe>=2.0 from https://files.pythonhosted.org/packages/de/e2/32c14301bb023986dff527a49325b6259cab4ebb4633f69de54af312fc45/MarkupSafe-2.1.3-cp38-cp38-manylinux_2_17_x86_64.manylinux2014_x86_64.whl.metadata
  Using cached MarkupSafe-2.1.3-cp38-cp38-manylinux_2_17_x86_64.manylinux2014_x86_64.whl.metadata (3.0 kB)
Requirement already satisfied: charset-normalizer<4,>=2 in <https://ci-beam.apache.org/job/beam_Inference_Python_Benchmarks_Dataflow/ws/src/build/gradleenv/1329484227/lib/python3.8/site-packages> (from requests->torchvision>=0.8.2->-r apache_beam/ml/inference/torch_tests_requirements.txt (line 19)) (3.2.0)
Requirement already satisfied: idna<4,>=2.5 in <https://ci-beam.apache.org/job/beam_Inference_Python_Benchmarks_Dataflow/ws/src/build/gradleenv/1329484227/lib/python3.8/site-packages> (from requests->torchvision>=0.8.2->-r apache_beam/ml/inference/torch_tests_requirements.txt (line 19)) (3.4)
Requirement already satisfied: urllib3<3,>=1.21.1 in <https://ci-beam.apache.org/job/beam_Inference_Python_Benchmarks_Dataflow/ws/src/build/gradleenv/1329484227/lib/python3.8/site-packages> (from requests->torchvision>=0.8.2->-r apache_beam/ml/inference/torch_tests_requirements.txt (line 19)) (1.26.16)
Requirement already satisfied: certifi>=2017.4.17 in <https://ci-beam.apache.org/job/beam_Inference_Python_Benchmarks_Dataflow/ws/src/build/gradleenv/1329484227/lib/python3.8/site-packages> (from requests->torchvision>=0.8.2->-r apache_beam/ml/inference/torch_tests_requirements.txt (line 19)) (2023.7.22)
Collecting mpmath>=0.19 (from sympy->torch>=1.7.1->-r apache_beam/ml/inference/torch_tests_requirements.txt (line 18))
  Using cached mpmath-1.3.0-py3-none-any.whl (536 kB)
Using cached Pillow-10.0.0-cp38-cp38-manylinux_2_28_x86_64.whl (3.4 MB)
Using cached transformers-4.31.0-py3-none-any.whl (7.4 MB)
Using cached huggingface_hub-0.16.4-py3-none-any.whl (268 kB)
Using cached safetensors-0.3.2-cp38-cp38-manylinux_2_17_x86_64.manylinux2014_x86_64.whl (1.3 MB)
Using cached tqdm-4.66.1-py3-none-any.whl (78 kB)
Using cached MarkupSafe-2.1.3-cp38-cp38-manylinux_2_17_x86_64.manylinux2014_x86_64.whl (25 kB)
Using cached cmake-3.27.2-py2.py3-none-manylinux2014_x86_64.manylinux_2_17_x86_64.whl (26.1 MB)
Using cached fsspec-2023.6.0-py3-none-any.whl (163 kB)
Installing collected packages: tokenizers, safetensors, mpmath, lit, cmake, tqdm, sympy, pillow, nvidia-nvtx-cu11, nvidia-nccl-cu11, nvidia-cusparse-cu11, nvidia-curand-cu11, nvidia-cufft-cu11, nvidia-cuda-runtime-cu11, nvidia-cuda-nvrtc-cu11, nvidia-cuda-cupti-cu11, nvidia-cublas-cu11, networkx, MarkupSafe, fsspec, nvidia-cusolver-cu11, nvidia-cudnn-cu11, jinja2, huggingface-hub, transformers, triton, torch, torchvision
Successfully installed MarkupSafe-2.1.3 cmake-3.27.2 fsspec-2023.6.0 huggingface-hub-0.16.4 jinja2-3.1.2 lit-16.0.6 mpmath-1.3.0 networkx-3.1 nvidia-cublas-cu11-11.10.3.66 nvidia-cuda-cupti-cu11-11.7.101 nvidia-cuda-nvrtc-cu11-11.7.99 nvidia-cuda-runtime-cu11-11.7.99 nvidia-cudnn-cu11-8.5.0.96 nvidia-cufft-cu11-10.9.0.58 nvidia-curand-cu11-10.2.10.91 nvidia-cusolver-cu11-11.4.0.1 nvidia-cusparse-cu11-11.7.4.91 nvidia-nccl-cu11-2.14.3 nvidia-nvtx-cu11-11.7.91 pillow-10.0.0 safetensors-0.3.2 sympy-1.12 tokenizers-0.13.3 torch-2.0.1 torchvision-0.15.2 tqdm-4.66.1 transformers-4.31.0 triton-2.0.0
INFO:root:Device is set to CUDA
INFO:apache_beam.internal.gcp.auth:Setting socket default timeout to 60 seconds.
INFO:apache_beam.internal.gcp.auth:socket default timeout is 60.0 seconds.
WARNING:apache_beam.runners.portability.stager:When using a custom container image, prefer installing additional PyPI dependencies directly into the image, instead of specifying them via runtime options, such as --requirements_file. 
INFO:apache_beam.runners.portability.stager:Executing command: ['<https://ci-beam.apache.org/job/beam_Inference_Python_Benchmarks_Dataflow/ws/src/build/gradleenv/1329484227/bin/python',> '-m', 'pip', 'download', '--dest', '/tmp/dataflow-requirements-cache', '-r', '/tmp/tmpj6ij2p3v/tmp_requirements.txt', '--exists-action', 'i', '--no-deps', '--implementation', 'cp', '--abi', 'cp38', '--platform', 'manylinux2014_x86_64']
INFO:apache_beam.runners.portability.stager:Copying Beam SDK "<https://ci-beam.apache.org/job/beam_Inference_Python_Benchmarks_Dataflow/ws/src/sdks/python/build/apache-beam.tar.gz"> to staging location.
INFO:apache_beam.runners.dataflow.dataflow_runner:Pipeline has additional dependencies to be installed in SDK **** container, consider using the SDK container image pre-building workflow to avoid repetitive installations. Learn more on https://cloud.google.com/dataflow/docs/guides/using-custom-containers#prebuild
INFO:root:Using provided Python SDK container image: us.gcr.io/apache-beam-testing/python-postcommit-it/tensor_rt:latest
INFO:root:Python SDK container image set to "us.gcr.io/apache-beam-testing/python-postcommit-it/tensor_rt:latest" for Docker environment
INFO:apache_beam.runners.portability.fn_api_runner.translations:==================== <function pack_combiners at 0x7f7f0380f670> ====================
INFO:apache_beam.runners.portability.fn_api_runner.translations:==================== <function sort_stages at 0x7f7f0380fe50> ====================
INFO:apache_beam.runners.dataflow.internal.apiclient:Starting GCS upload to gs://temp-storage-for-perf-tests/loadtests/benchmark-tests-pytorch-imagenet-python-gpu0812155050.1691868873.025917/requirements.txt...
INFO:apache_beam.runners.dataflow.internal.apiclient:Completed GCS upload to gs://temp-storage-for-perf-tests/loadtests/benchmark-tests-pytorch-imagenet-python-gpu0812155050.1691868873.025917/requirements.txt in 0 seconds.
INFO:apache_beam.runners.dataflow.internal.apiclient:Starting GCS upload to gs://temp-storage-for-perf-tests/loadtests/benchmark-tests-pytorch-imagenet-python-gpu0812155050.1691868873.025917/mock-2.0.0-py2.py3-none-any.whl...
INFO:apache_beam.runners.dataflow.internal.apiclient:Completed GCS upload to gs://temp-storage-for-perf-tests/loadtests/benchmark-tests-pytorch-imagenet-python-gpu0812155050.1691868873.025917/mock-2.0.0-py2.py3-none-any.whl in 0 seconds.
INFO:apache_beam.runners.dataflow.internal.apiclient:Starting GCS upload to gs://temp-storage-for-perf-tests/loadtests/benchmark-tests-pytorch-imagenet-python-gpu0812155050.1691868873.025917/seaborn-0.12.2-py3-none-any.whl...
INFO:apache_beam.runners.dataflow.internal.apiclient:Completed GCS upload to gs://temp-storage-for-perf-tests/loadtests/benchmark-tests-pytorch-imagenet-python-gpu0812155050.1691868873.025917/seaborn-0.12.2-py3-none-any.whl in 0 seconds.
INFO:apache_beam.runners.dataflow.internal.apiclient:Starting GCS upload to gs://temp-storage-for-perf-tests/loadtests/benchmark-tests-pytorch-imagenet-python-gpu0812155050.1691868873.025917/PyHamcrest-1.10.1-py3-none-any.whl...
INFO:apache_beam.runners.dataflow.internal.apiclient:Completed GCS upload to gs://temp-storage-for-perf-tests/loadtests/benchmark-tests-pytorch-imagenet-python-gpu0812155050.1691868873.025917/PyHamcrest-1.10.1-py3-none-any.whl in 0 seconds.
INFO:apache_beam.runners.dataflow.internal.apiclient:Starting GCS upload to gs://temp-storage-for-perf-tests/loadtests/benchmark-tests-pytorch-imagenet-python-gpu0812155050.1691868873.025917/transformers-4.31.0-py3-none-any.whl...
INFO:apache_beam.runners.dataflow.internal.apiclient:Completed GCS upload to gs://temp-storage-for-perf-tests/loadtests/benchmark-tests-pytorch-imagenet-python-gpu0812155050.1691868873.025917/transformers-4.31.0-py3-none-any.whl in 0 seconds.
INFO:apache_beam.runners.dataflow.internal.apiclient:Starting GCS upload to gs://temp-storage-for-perf-tests/loadtests/benchmark-tests-pytorch-imagenet-python-gpu0812155050.1691868873.025917/beautifulsoup4-4.12.2-py3-none-any.whl...
INFO:apache_beam.runners.dataflow.internal.apiclient:Completed GCS upload to gs://temp-storage-for-perf-tests/loadtests/benchmark-tests-pytorch-imagenet-python-gpu0812155050.1691868873.025917/beautifulsoup4-4.12.2-py3-none-any.whl in 0 seconds.
INFO:apache_beam.runners.dataflow.internal.apiclient:Starting GCS upload to gs://temp-storage-for-perf-tests/loadtests/benchmark-tests-pytorch-imagenet-python-gpu0812155050.1691868873.025917/parameterized-0.7.5-py2.py3-none-any.whl...
INFO:apache_beam.runners.dataflow.internal.apiclient:Completed GCS upload to gs://temp-storage-for-perf-tests/loadtests/benchmark-tests-pytorch-imagenet-python-gpu0812155050.1691868873.025917/parameterized-0.7.5-py2.py3-none-any.whl in 0 seconds.
INFO:apache_beam.runners.dataflow.internal.apiclient:Starting GCS upload to gs://temp-storage-for-perf-tests/loadtests/benchmark-tests-pytorch-imagenet-python-gpu0812155050.1691868873.025917/torch-2.0.1-cp38-cp38-manylinux1_x86_64.whl...
INFO:apache_beam.runners.dataflow.internal.apiclient:Completed GCS upload to gs://temp-storage-for-perf-tests/loadtests/benchmark-tests-pytorch-imagenet-python-gpu0812155050.1691868873.025917/torch-2.0.1-cp38-cp38-manylinux1_x86_64.whl in 27 seconds.
INFO:apache_beam.runners.dataflow.internal.apiclient:Starting GCS upload to gs://temp-storage-for-perf-tests/loadtests/benchmark-tests-pytorch-imagenet-python-gpu0812155050.1691868873.025917/torchvision-0.15.2-cp38-cp38-manylinux1_x86_64.whl...
INFO:apache_beam.runners.dataflow.internal.apiclient:Completed GCS upload to gs://temp-storage-for-perf-tests/loadtests/benchmark-tests-pytorch-imagenet-python-gpu0812155050.1691868873.025917/torchvision-0.15.2-cp38-cp38-manylinux1_x86_64.whl in 1 seconds.
INFO:apache_beam.runners.dataflow.internal.apiclient:Starting GCS upload to gs://temp-storage-for-perf-tests/loadtests/benchmark-tests-pytorch-imagenet-python-gpu0812155050.1691868873.025917/Pillow-10.0.0-cp38-cp38-manylinux_2_17_x86_64.manylinux2014_x86_64.whl...
INFO:apache_beam.runners.dataflow.internal.apiclient:Completed GCS upload to gs://temp-storage-for-perf-tests/loadtests/benchmark-tests-pytorch-imagenet-python-gpu0812155050.1691868873.025917/Pillow-10.0.0-cp38-cp38-manylinux_2_17_x86_64.manylinux2014_x86_64.whl in 0 seconds.
INFO:apache_beam.runners.dataflow.internal.apiclient:Starting GCS upload to gs://temp-storage-for-perf-tests/loadtests/benchmark-tests-pytorch-imagenet-python-gpu0812155050.1691868873.025917/matplotlib-3.7.2-cp39-cp39-manylinux_2_17_x86_64.manylinux2014_x86_64.whl...
INFO:apache_beam.runners.dataflow.internal.apiclient:Completed GCS upload to gs://temp-storage-for-perf-tests/loadtests/benchmark-tests-pytorch-imagenet-python-gpu0812155050.1691868873.025917/matplotlib-3.7.2-cp39-cp39-manylinux_2_17_x86_64.manylinux2014_x86_64.whl in 0 seconds.
INFO:apache_beam.runners.dataflow.internal.apiclient:Starting GCS upload to gs://temp-storage-for-perf-tests/loadtests/benchmark-tests-pytorch-imagenet-python-gpu0812155050.1691868873.025917/scikit_learn-1.0.2-cp39-cp39-manylinux_2_17_x86_64.manylinux2014_x86_64.whl...
INFO:apache_beam.runners.dataflow.internal.apiclient:Completed GCS upload to gs://temp-storage-for-perf-tests/loadtests/benchmark-tests-pytorch-imagenet-python-gpu0812155050.1691868873.025917/scikit_learn-1.0.2-cp39-cp39-manylinux_2_17_x86_64.manylinux2014_x86_64.whl in 1 seconds.
INFO:apache_beam.runners.dataflow.internal.apiclient:Starting GCS upload to gs://temp-storage-for-perf-tests/loadtests/benchmark-tests-pytorch-imagenet-python-gpu0812155050.1691868873.025917/dataflow_python_sdk.tar...
INFO:apache_beam.runners.dataflow.internal.apiclient:Completed GCS upload to gs://temp-storage-for-perf-tests/loadtests/benchmark-tests-pytorch-imagenet-python-gpu0812155050.1691868873.025917/dataflow_python_sdk.tar in 0 seconds.
INFO:apache_beam.runners.dataflow.internal.apiclient:Starting GCS upload to gs://temp-storage-for-perf-tests/loadtests/benchmark-tests-pytorch-imagenet-python-gpu0812155050.1691868873.025917/pipeline.pb...
INFO:apache_beam.runners.dataflow.internal.apiclient:Completed GCS upload to gs://temp-storage-for-perf-tests/loadtests/benchmark-tests-pytorch-imagenet-python-gpu0812155050.1691868873.025917/pipeline.pb in 0 seconds.
INFO:apache_beam.runners.dataflow.internal.apiclient:Create job: <Job
 clientRequestId: '20230812193433027224-4163'
 createTime: '2023-08-12T19:35:06.834283Z'
 currentStateTime: '1970-01-01T00:00:00Z'
 id: '2023-08-12_12_35_05-5687932922082168038'
 location: 'us-central1'
 name: 'benchmark-tests-pytorch-imagenet-python-gpu0812155050'
 projectId: 'apache-beam-testing'
 stageStates: []
 startTime: '2023-08-12T19:35:06.834283Z'
 steps: []
 tempFiles: []
 type: TypeValueValuesEnum(JOB_TYPE_BATCH, 1)>
INFO:apache_beam.runners.dataflow.internal.apiclient:Created job with id: [2023-08-12_12_35_05-5687932922082168038]
INFO:apache_beam.runners.dataflow.internal.apiclient:Submitted job: 2023-08-12_12_35_05-5687932922082168038
INFO:apache_beam.runners.dataflow.internal.apiclient:To access the Dataflow monitoring console, please navigate to https://console.cloud.google.com/dataflow/jobs/us-central1/2023-08-12_12_35_05-5687932922082168038?project=apache-beam-testing
INFO:apache_beam.runners.dataflow.dataflow_runner:Job 2023-08-12_12_35_05-5687932922082168038 is in state JOB_STATE_PENDING
INFO:apache_beam.runners.dataflow.dataflow_runner:2023-08-12T19:35:07.396Z: JOB_MESSAGE_BASIC: The pipeline is using shuffle service with a (boot) persistent disk size / type other than the default. If that configuration was intended solely to speed up the non-service shuffle, consider removing it to reduce costs as those disks are unused by the shuffle service.
INFO:apache_beam.runners.dataflow.dataflow_runner:2023-08-12T19:35:10.381Z: JOB_MESSAGE_BASIC: Worker configuration: n1-standard-2 in us-central1-b.
INFO:apache_beam.runners.dataflow.dataflow_runner:2023-08-12T19:35:12.448Z: JOB_MESSAGE_BASIC: Executing operation ReadImageNames/Read/Impulse+ReadImageNames/Read/Map(<lambda at iobase.py:911>)+ref_AppliedPTransform_ReadImageNames-Read-SDFBoundedSourceReader-ParDo-SDFBoundedSourceDoFn-_7/PairWithRestriction+ref_AppliedPTransform_ReadImageNames-Read-SDFBoundedSourceReader-ParDo-SDFBoundedSourceDoFn-_7/SplitWithSizing
INFO:apache_beam.runners.dataflow.dataflow_runner:2023-08-12T19:35:12.470Z: JOB_MESSAGE_BASIC: Executing operation WriteOutputToGCS/Write/WriteImpl/DoOnce/Impulse+WriteOutputToGCS/Write/WriteImpl/DoOnce/FlatMap(<lambda at core.py:3736>)+WriteOutputToGCS/Write/WriteImpl/DoOnce/Map(decode)+WriteOutputToGCS/Write/WriteImpl/InitializeWrite
INFO:apache_beam.runners.dataflow.dataflow_runner:2023-08-12T19:35:12.514Z: JOB_MESSAGE_BASIC: Starting 75 ****s in us-central1-b...
INFO:apache_beam.runners.dataflow.dataflow_runner:Job 2023-08-12_12_35_05-5687932922082168038 is in state JOB_STATE_RUNNING
INFO:apache_beam.runners.dataflow.dataflow_runner:2023-08-12T19:35:41.205Z: JOB_MESSAGE_BASIC: Your project already contains 100 Dataflow-created metric descriptors, so new user metrics of the form custom.googleapis.com/* will not be created. However, all user metrics are also available in the metric dataflow.googleapis.com/job/user_counter. If you rely on the custom metrics, you can delete old / unused metric descriptors. See https://developers.google.com/apis-explorer/#p/monitoring/v3/monitoring.projects.metricDescriptors.list and https://developers.google.com/apis-explorer/#p/monitoring/v3/monitoring.projects.metricDescriptors.delete
WARNING:apache_beam.runners.dataflow.dataflow_runner:2023-08-12T19:35:58.271Z: JOB_MESSAGE_WARNING: Autoscaling: Startup of the **** pool in zone us-central1-b reached 72 ****s, but the goal was 75 ****s. The service will retry. Please refer to https://cloud.google.com/dataflow/docs/guides/common-errors#****-pool-failure for help troubleshooting. QUOTA_EXCEEDED: Instance 'benchmark-tests-pytorch-i-08121235-4cp9-harness-h0cg' creation failed: Quota 'NVIDIA_T4_GPUS' exceeded.  Limit: 48.0 in region us-central1.
ERROR:apache_beam.runners.dataflow.dataflow_runner:2023-08-12T19:36:07.986Z: JOB_MESSAGE_ERROR: Startup of the **** pool in zone us-central1-b failed to bring up any of the desired 75 ****s. Please refer to https://cloud.google.com/dataflow/docs/guides/common-errors#****-pool-failure for help troubleshooting. QUOTA_EXCEEDED: Instance 'benchmark-tests-pytorch-i-08121235-4cp9-harness-gnn2' creation failed: Quota 'NVIDIA_T4_GPUS' exceeded.  Limit: 48.0 in region us-central1.
ERROR:apache_beam.runners.dataflow.dataflow_runner:2023-08-12T19:36:08.006Z: JOB_MESSAGE_ERROR: Workflow failed.
WARNING:apache_beam.runners.dataflow.dataflow_runner:2023-08-12T19:36:08.102Z: JOB_MESSAGE_WARNING: Unable to delete temp files: "gs://temp-storage-for-perf-tests/loadtests/benchmark-tests-pytorch-imagenet-python-gpu0812155050.1691868873.025917/dax-tmp-2023-08-12_12_35_05-5687932922082168038-S04-0-eda16f75bedaefac/tmp-eda16f75bedae55b@DAX.sdfmeta."
WARNING:apache_beam.runners.dataflow.dataflow_runner:2023-08-12T19:36:08.110Z: JOB_MESSAGE_WARNING: Unable to delete temp files: "gs://temp-storage-for-perf-tests/loadtests/benchmark-tests-pytorch-imagenet-python-gpu0812155050.1691868873.025917/dax-tmp-2023-08-12_12_35_05-5687932922082168038-S01-1-57316301b2c29ffc/tmp-57316301b2c291dd@DAX.recordio."
WARNING:apache_beam.runners.dataflow.dataflow_runner:2023-08-12T19:36:08.112Z: JOB_MESSAGE_WARNING: Unable to delete temp files: "gs://temp-storage-for-perf-tests/loadtests/benchmark-tests-pytorch-imagenet-python-gpu0812155050.1691868873.025917/dax-tmp-2023-08-12_12_35_05-5687932922082168038-S01-0-9115e0c3b46609d6/tmp-9115e0c3b46603fd@DAX.recordio."
WARNING:apache_beam.runners.dataflow.dataflow_runner:2023-08-12T19:36:08.122Z: JOB_MESSAGE_WARNING: S04:ReadImageNames/Read/Impulse+ReadImageNames/Read/Map(<lambda at iobase.py:911>)+ref_AppliedPTransform_ReadImageNames-Read-SDFBoundedSourceReader-ParDo-SDFBoundedSourceDoFn-_7/PairWithRestriction+ref_AppliedPTransform_ReadImageNames-Read-SDFBoundedSourceReader-ParDo-SDFBoundedSourceDoFn-_7/SplitWithSizing failed.
WARNING:apache_beam.runners.dataflow.dataflow_runner:2023-08-12T19:36:08.135Z: JOB_MESSAGE_WARNING: S01:WriteOutputToGCS/Write/WriteImpl/DoOnce/Impulse+WriteOutputToGCS/Write/WriteImpl/DoOnce/FlatMap(<lambda at core.py:3736>)+WriteOutputToGCS/Write/WriteImpl/DoOnce/Map(decode)+WriteOutputToGCS/Write/WriteImpl/InitializeWrite failed.
INFO:apache_beam.runners.dataflow.dataflow_runner:2023-08-12T19:36:08.144Z: JOB_MESSAGE_BASIC: Finished operation ReadImageNames/Read/Impulse+ReadImageNames/Read/Map(<lambda at iobase.py:911>)+ref_AppliedPTransform_ReadImageNames-Read-SDFBoundedSourceReader-ParDo-SDFBoundedSourceDoFn-_7/PairWithRestriction+ref_AppliedPTransform_ReadImageNames-Read-SDFBoundedSourceReader-ParDo-SDFBoundedSourceDoFn-_7/SplitWithSizing
INFO:apache_beam.runners.dataflow.dataflow_runner:2023-08-12T19:36:08.159Z: JOB_MESSAGE_BASIC: Finished operation WriteOutputToGCS/Write/WriteImpl/DoOnce/Impulse+WriteOutputToGCS/Write/WriteImpl/DoOnce/FlatMap(<lambda at core.py:3736>)+WriteOutputToGCS/Write/WriteImpl/DoOnce/Map(decode)+WriteOutputToGCS/Write/WriteImpl/InitializeWrite
INFO:apache_beam.runners.dataflow.dataflow_runner:2023-08-12T19:36:08.282Z: JOB_MESSAGE_BASIC: Stopping **** pool...
INFO:apache_beam.runners.dataflow.dataflow_runner:2023-08-12T19:36:29.824Z: JOB_MESSAGE_BASIC: Worker pool stopped.
INFO:apache_beam.runners.dataflow.dataflow_runner:Job 2023-08-12_12_35_05-5687932922082168038 is in state JOB_STATE_FAILED
ERROR:apache_beam.runners.dataflow.dataflow_runner:Console URL: https://console.cloud.google.com/dataflow/jobs/<RegionId>/2023-08-12_12_35_05-5687932922082168038?project=<ProjectId>
Traceback (most recent call last):
  File "/usr/lib/python3.8/runpy.py", line 194, in _run_module_as_main
    return _run_code(code, main_globals, None,
  File "/usr/lib/python3.8/runpy.py", line 87, in _run_code
    exec(code, run_globals)
  File "<https://ci-beam.apache.org/job/beam_Inference_Python_Benchmarks_Dataflow/ws/src/sdks/python/apache_beam/testing/benchmarks/inference/pytorch_image_classification_benchmarks.py",> line 68, in <module>
    PytorchVisionBenchmarkTest().run()
  File "<https://ci-beam.apache.org/job/beam_Inference_Python_Benchmarks_Dataflow/ws/src/sdks/python/apache_beam/testing/load_tests/load_test.py",> line 148, in run
    self.test()
  File "<https://ci-beam.apache.org/job/beam_Inference_Python_Benchmarks_Dataflow/ws/src/sdks/python/apache_beam/testing/benchmarks/inference/pytorch_image_classification_benchmarks.py",> line 58, in test
    self.result = pytorch_image_classification.run(
  File "<https://ci-beam.apache.org/job/beam_Inference_Python_Benchmarks_Dataflow/ws/src/sdks/python/apache_beam/examples/inference/pytorch_image_classification.py",> line 166, in run
    result.wait_until_finish()
  File "<https://ci-beam.apache.org/job/beam_Inference_Python_Benchmarks_Dataflow/ws/src/sdks/python/apache_beam/runners/dataflow/dataflow_runner.py",> line 765, in wait_until_finish
    raise DataflowRuntimeException(
apache_beam.runners.dataflow.dataflow_runner.DataflowRuntimeException: Dataflow pipeline failed. State: FAILED, Error:
Workflow failed.

> Task :sdks:python:apache_beam:testing:load_tests:run FAILED

FAILURE: Build failed with an exception.

* Where:
Build file '<https://ci-beam.apache.org/job/beam_Inference_Python_Benchmarks_Dataflow/ws/src/sdks/python/apache_beam/testing/load_tests/build.gradle'> line: 63

* What went wrong:
Execution failed for task ':sdks:python:apache_beam:testing:load_tests:run'.
> error occurred

* Try:
> Run with --stacktrace option to get the stack trace.
> Run with --info or --debug option to get more log output.

* Get more help at https://help.gradle.org

Deprecated Gradle features were used in this build, making it incompatible with Gradle 8.0.

You can use '--warning-mode all' to show the individual deprecation warnings and determine if they come from your own scripts or plugins.

See https://docs.gradle.org/7.6.2/userguide/command_line_interface.html#sec:command_line_warnings

BUILD FAILED in 5m 56s
15 actionable tasks: 4 executed, 11 up-to-date

Publishing build scan...
https://ge.apache.org/s/5z3qsxducjve2

Build step 'Invoke Gradle script' changed build result to FAILURE
Build step 'Invoke Gradle script' marked build as failure


---------------------------------------------------------------------
To unsubscribe, e-mail: builds-unsubscribe@beam.apache.org
For additional commands, e-mail: builds-help@beam.apache.org


Jenkins build is back to normal : beam_Inference_Python_Benchmarks_Dataflow #339

Posted by Apache Jenkins Server <je...@builds.apache.org>.
See <https://ci-beam.apache.org/job/beam_Inference_Python_Benchmarks_Dataflow/339/display/redirect>


---------------------------------------------------------------------
To unsubscribe, e-mail: builds-unsubscribe@beam.apache.org
For additional commands, e-mail: builds-help@beam.apache.org