You are viewing a plain text version of this content. The canonical link for it is here.
Posted to builds@beam.apache.org by Apache Jenkins Server <je...@builds.apache.org> on 2020/04/08 14:19:55 UTC
Build failed in Jenkins: beam_PostCommit_Java_Nexmark_Dataflow
#5548
See <https://builds.apache.org/job/beam_PostCommit_Java_Nexmark_Dataflow/5548/display/redirect?page=changes>
Changes:
[github] [BEAM-9147] Add a VideoIntelligence transform to Java SDK (#11261)
------------------------------------------
[...truncated 17.16 KB...]
> Task :runners:google-cloud-dataflow-java:worker:windmill:classes
> Task :model:pipeline:generateProto
> Task :model:pipeline:compileJava FROM-CACHE
> Task :model:pipeline:processResources
> Task :model:pipeline:classes
> Task :model:pipeline:jar
> Task :model:job-management:extractIncludeProto
> Task :model:fn-execution:extractIncludeProto
> Task :model:job-management:generateProto
> Task :model:fn-execution:generateProto
> Task :model:job-management:compileJava FROM-CACHE
> Task :model:job-management:classes
> Task :model:fn-execution:compileJava FROM-CACHE
> Task :model:fn-execution:classes
> Task :sdks:java:extensions:sql:generateFmppSources
> Task :runners:google-cloud-dataflow-java:worker:windmill:shadowJar
> Task :model:pipeline:shadowJar
> Task :sdks:java:extensions:sql:compileJavacc
Java Compiler Compiler Version 4.0 (Parser Generator)
(type "javacc" with no arguments for help)
Reading from file <https://builds.apache.org/job/beam_PostCommit_Java_Nexmark_Dataflow/ws/src/sdks/java/extensions/sql/build/generated/fmpp/javacc/Parser.jj> . . .
Warning: Lookahead adequacy checking not being performed since option LOOKAHEAD is more than 1. Set option FORCE_LA_CHECK to true to force checking.
Note: UNICODE_INPUT option is specified. Please make sure you create the parser/lexer using a Reader with the correct character encoding.
File "TokenMgrError.java" does not exist. Will create one.
File "ParseException.java" does not exist. Will create one.
File "Token.java" does not exist. Will create one.
File "SimpleCharStream.java" does not exist. Will create one.
Parser generated with 0 errors and 1 warnings.
> Task :sdks:java:extensions:sql:processResources
> Task :model:job-management:shadowJar
> Task :model:fn-execution:shadowJar
> Task :sdks:java:core:compileJava FROM-CACHE
> Task :sdks:java:core:classes
> Task :sdks:java:core:shadowJar
> Task :sdks:java:extensions:protobuf:extractIncludeProto
> Task :sdks:java:extensions:protobuf:generateProto NO-SOURCE
> Task :runners:local-java:compileJava FROM-CACHE
> Task :runners:local-java:classes UP-TO-DATE
> Task :runners:local-java:jar
> Task :vendor:sdks-java-extensions-protobuf:compileJava FROM-CACHE
> Task :vendor:sdks-java-extensions-protobuf:classes UP-TO-DATE
> Task :sdks:java:extensions:join-library:compileJava FROM-CACHE
> Task :sdks:java:extensions:join-library:classes UP-TO-DATE
> Task :sdks:java:io:mongodb:compileJava FROM-CACHE
> Task :sdks:java:io:mongodb:classes UP-TO-DATE
> Task :runners:core-construction-java:compileJava FROM-CACHE
> Task :runners:core-construction-java:classes UP-TO-DATE
> Task :sdks:java:extensions:join-library:jar
> Task :sdks:java:io:mongodb:jar
> Task :sdks:java:fn-execution:compileJava FROM-CACHE
> Task :sdks:java:fn-execution:classes UP-TO-DATE
> Task :runners:core-construction-java:jar
> Task :sdks:java:fn-execution:jar
> Task :vendor:sdks-java-extensions-protobuf:shadowJar
> Task :sdks:java:core:jar
> Task :sdks:java:expansion-service:compileJava FROM-CACHE
> Task :sdks:java:expansion-service:classes UP-TO-DATE
> Task :sdks:java:expansion-service:jar
> Task :sdks:java:io:kafka:compileJava FROM-CACHE
> Task :sdks:java:io:kafka:classes UP-TO-DATE
> Task :runners:core-java:compileJava FROM-CACHE
> Task :runners:core-java:classes UP-TO-DATE
> Task :sdks:java:io:kafka:jar
> Task :sdks:java:io:parquet:compileJava FROM-CACHE
> Task :sdks:java:io:parquet:classes UP-TO-DATE
> Task :runners:core-java:jar
> Task :sdks:java:io:parquet:jar
> Task :sdks:java:extensions:google-cloud-platform-core:compileJava FROM-CACHE
> Task :sdks:java:extensions:google-cloud-platform-core:classes UP-TO-DATE
> Task :sdks:java:extensions:google-cloud-platform-core:jar
> Task :sdks:java:testing:test-utils:compileJava FROM-CACHE
> Task :sdks:java:testing:test-utils:classes UP-TO-DATE
> Task :sdks:java:extensions:protobuf:compileJava FROM-CACHE
> Task :sdks:java:extensions:protobuf:classes UP-TO-DATE
> Task :sdks:java:testing:test-utils:jar
> Task :sdks:java:harness:compileJava FROM-CACHE
> Task :sdks:java:harness:classes UP-TO-DATE
> Task :sdks:java:extensions:protobuf:jar
> Task :sdks:java:harness:jar
> Task :sdks:java:io:google-cloud-platform:compileJava FROM-CACHE
> Task :sdks:java:io:google-cloud-platform:classes UP-TO-DATE
> Task :sdks:java:io:google-cloud-platform:jar
> Task :runners:google-cloud-dataflow-java:compileJava FROM-CACHE
> Task :runners:google-cloud-dataflow-java:classes
> Task :runners:google-cloud-dataflow-java:jar
> Task :sdks:java:harness:shadowJar
> Task :runners:java-fn-execution:compileJava FROM-CACHE
> Task :runners:java-fn-execution:classes UP-TO-DATE
> Task :runners:java-fn-execution:jar
> Task :runners:direct-java:compileJava FROM-CACHE
> Task :runners:direct-java:classes UP-TO-DATE
> Task :runners:google-cloud-dataflow-java:worker:legacy-worker:compileJava FROM-CACHE
> Task :runners:google-cloud-dataflow-java:worker:legacy-worker:classes UP-TO-DATE
> Task :runners:direct-java:shadowJar
> Task :sdks:java:extensions:sql:compileJava FROM-CACHE
> Task :sdks:java:extensions:sql:classes
> Task :sdks:java:extensions:sql:jar
> Task :sdks:java:testing:nexmark:compileJava FROM-CACHE
> Task :sdks:java:testing:nexmark:classes
> Task :sdks:java:testing:nexmark:jar
> Task :runners:google-cloud-dataflow-java:worker:legacy-worker:shadowJar
> Task :sdks:java:testing:nexmark:run
2020-04-08T14:18:36.780Z Running query:PASSTHROUGH; exportSummaryToBigQuery:true; numEvents:10000000
2020-04-08T14:18:36.781Z Running query:SELECTION; exportSummaryToBigQuery:true; numEvents:10000000
2020-04-08T14:18:36.781Z Running query:CURRENCY_CONVERSION; exportSummaryToBigQuery:true; numEvents:10000000
2020-04-08T14:18:36.781Z Running query:LOCAL_ITEM_SUGGESTION; exportSummaryToBigQuery:true; numEvents:10000000
2020-04-08T14:18:36.781Z Running query:AVERAGE_PRICE_FOR_CATEGORY; exportSummaryToBigQuery:true; numEvents:1000000
2020-04-08T14:18:36.780Z Running query:HOT_ITEMS; exportSummaryToBigQuery:true; numEvents:10000000
2020-04-08T14:18:36.780Z Running query:AVERAGE_SELLING_PRICE_BY_SELLER; exportSummaryToBigQuery:true; numEvents:1000000
2020-04-08T14:18:36.780Z Running query:MONITOR_NEW_USERS; exportSummaryToBigQuery:true; numEvents:10000000
2020-04-08T14:18:36.780Z Running query:HIGHEST_BID; exportSummaryToBigQuery:true; numEvents:10000000
2020-04-08T14:18:36.780Z Running query:WINNING_BIDS; exportSummaryToBigQuery:true; numEvents:1000000
2020-04-08T14:18:36.780Z Running query:LOG_TO_SHARDED_FILES; exportSummaryToBigQuery:true; numEvents:10000000
2020-04-08T14:18:36.780Z Running query:USER_SESSIONS; exportSummaryToBigQuery:true; numEvents:10000000
2020-04-08T14:18:36.780Z Running query:PROCESSING_TIME_WINDOWS; exportSummaryToBigQuery:true; numEvents:10000000
2020-04-08T14:18:36.780Z Running query:BOUNDED_SIDE_INPUT_JOIN; exportSummaryToBigQuery:true; numEvents:10000000
2020-04-08T14:18:36.780Z Running query:SESSION_SIDE_INPUT_JOIN; exportSummaryToBigQuery:true; numEvents:10000000
==========================================================================================
Run started 2020-04-08T14:18:36.432Z and ran for PT5.794S
Default configuration:
{"debug":true,"query":null,"sourceType":"DIRECT","sinkType":"DEVNULL","exportSummaryToBigQuery":false,"pubSubMode":"COMBINED","sideInputType":"DIRECT","sideInputRowCount":500,"sideInputNumShards":3,"sideInputUrl":null,"sessionGap":{"standardDays":0,"standardHours":0,"standardMinutes":10,"standardSeconds":600,"millis":600000},"numEvents":100000,"numEventGenerators":100,"rateShape":"SINE","firstEventRate":10000,"nextEventRate":10000,"rateUnit":"PER_SECOND","ratePeriodSec":600,"preloadSeconds":0,"streamTimeout":240,"isRateLimited":false,"useWallclockEventTime":false,"avgPersonByteSize":200,"avgAuctionByteSize":500,"avgBidByteSize":100,"hotAuctionRatio":2,"hotSellersRatio":4,"hotBiddersRatio":4,"windowSizeSec":10,"windowPeriodSec":5,"watermarkHoldbackSec":0,"numInFlightAuctions":100,"numActivePeople":1000,"coderStrategy":"HAND","cpuDelayMs":0,"diskBusyBytes":0,"auctionSkip":123,"fanout":5,"maxAuctionsWaitingTime":600,"occasionalDelaySec":3,"probDelayedEvent":0.1,"maxLogEvents":100000,"usePubsubPublishTime":false,"outOfOrderGroupSize":1}
Configurations:
Conf Description
0000 query:PASSTHROUGH; exportSummaryToBigQuery:true; numEvents:10000000
0001 query:CURRENCY_CONVERSION; exportSummaryToBigQuery:true; numEvents:10000000
0002 query:SELECTION; exportSummaryToBigQuery:true; numEvents:10000000
Exception in thread "main" 0003 query:LOCAL_ITEM_SUGGESTION; exportSummaryToBigQuery:true; numEvents:10000000
java.lang.RuntimeException: java.lang.RuntimeException: Failed to construct instance from factory method DataflowRunner#fromOptions(interface org.apache.beam.sdk.options.PipelineOptions)
0004 query:AVERAGE_PRICE_FOR_CATEGORY; exportSummaryToBigQuery:true; numEvents:1000000
at org.apache.beam.sdk.nexmark.Main.runAll(Main.java:128)
0005 query:HOT_ITEMS; exportSummaryToBigQuery:true; numEvents:10000000
at org.apache.beam.sdk.nexmark.Main.main(Main.java:415)
0006 query:AVERAGE_SELLING_PRICE_BY_SELLER; exportSummaryToBigQuery:true; numEvents:1000000
0007 query:HIGHEST_BID; exportSummaryToBigQuery:true; numEvents:10000000
Caused by: java.lang.RuntimeException: Failed to construct instance from factory method DataflowRunner#fromOptions(interface org.apache.beam.sdk.options.PipelineOptions)
0008 query:MONITOR_NEW_USERS; exportSummaryToBigQuery:true; numEvents:10000000
at org.apache.beam.sdk.util.InstanceBuilder.buildFromMethod(InstanceBuilder.java:224)
0009 query:WINNING_BIDS; exportSummaryToBigQuery:true; numEvents:1000000
at org.apache.beam.sdk.util.InstanceBuilder.build(InstanceBuilder.java:155)
0010 query:LOG_TO_SHARDED_FILES; exportSummaryToBigQuery:true; numEvents:10000000
at org.apache.beam.sdk.PipelineRunner.fromOptions(PipelineRunner.java:55)
0011 query:USER_SESSIONS; exportSummar at org.apache.beam.sdk.Pipeline.create(Pipeline.java:149)
yToBigQuery:true; numEvents:10000000
at org.apache.beam.sdk.nexmark.NexmarkLauncher.run(NexmarkLauncher.java:1133)
0012 query:PROCESSING_TIME_WINDOWS; exportSummaryToBigQuery:true; numEvents:10000000
at org.apache.beam.sdk.nexmark.Main$Run.call(Main.java:90)
0013 query:BOUNDED_SIDE_INPUT_JOIN; exportSummaryToBigQuery:true; numEvents:10000000
at org.apache.beam.sdk.nexmark.Main$Run.call(Main.java:79)
0014 query:SESSION_SIDE_INPUT_JOIN; exportSummaryToBigQuery:true; numEvents:10000000
at java.util.concurrent.FutureTask.run(FutureTask.java:266)
at java.util.concurrent.Executors$RunnableAdapter.call(Executors.java:511)
Performance:
at java.util.concurrent.FutureTask.run(FutureTask.java:266)
Conf Runtime(sec) (Baseline) Events(/sec) (Baseline) Results (Baseline)
at java.util.concurrent.ThreadPoolExecutor.runWorker(ThreadPoolExecutor.java:1149)
0000 *** not run ***
at java.util.concurrent.ThreadPoolExecutor$Worker.run(ThreadPoolExecutor.java:624)
0001 *** not run ***
at java.lang.Thread.run(Thread.java:748)
0002 *** not run ***
0003 *** not run ***
Caused by: java.lang.reflect.InvocationTargetException
0004 *** not run ***
at sun.reflect.NativeMethodAccessorImpl.invoke0(Native Method)
0005 *** not run ***
at sun.reflect.NativeMethodAccessorImpl.invoke(NativeMethodAccessorImpl.java:62)
0006 *** not run ***
at sun.reflect.DelegatingMethodAccessorImpl.invoke(DelegatingMethodAccessorImpl.java:43)
0007 *** not run ***
at java.lang.reflect.Method.invoke(Method.java:498)
0008 *** not run ***
at org.apache.beam.sdk.util.InstanceBuilder.buildFromMethod(InstanceBuilder.java:214)
0009 *** not run ***
... 12 more
0010 *** not run ***
Caused by: java.lang.IllegalArgumentException: DataflowRunner requires gcpTempLocation, but failed to retrieve a value from PipelineOptions
0011 *** not run ***
at org.apache.beam.runners.dataflow.DataflowRunner.fromOptions(DataflowRunner.java:256)
0012 *** not run ***
... 17 more
0013 *** not run ***
0014 *** not run ***
==========================================================================================
Caused by: java.lang.IllegalArgumentException: Error constructing default value for gcpTempLocation: tempLocation is not a valid GCS path, gs://temp-storage-for-perf-tests/nexmark/Query12.
at org.apache.beam.sdk.extensions.gcp.options.GcpOptions$GcpTempLocationFactory.create(GcpOptions.java:311)
at org.apache.beam.sdk.extensions.gcp.options.GcpOptions$GcpTempLocationFactory.create(GcpOptions.java:288)
at org.apache.beam.sdk.options.ProxyInvocationHandler.returnDefaultHelper(ProxyInvocationHandler.java:592)
at org.apache.beam.sdk.options.ProxyInvocationHandler.getDefault(ProxyInvocationHandler.java:533)
at org.apache.beam.sdk.options.ProxyInvocationHandler.invoke(ProxyInvocationHandler.java:158)
at com.sun.proxy.$Proxy0.getGcpTempLocation(Unknown Source)
at org.apache.beam.runners.dataflow.DataflowRunner.fromOptions(DataflowRunner.java:254)
... 17 more
Caused by: java.lang.RuntimeException: Unable to verify that GCS bucket gs://temp-storage-for-perf-tests exists.
at org.apache.beam.sdk.extensions.gcp.storage.GcsPathValidator.verifyPathIsAccessible(GcsPathValidator.java:86)
at org.apache.beam.sdk.extensions.gcp.storage.GcsPathValidator.validateOutputFilePrefixSupported(GcsPathValidator.java:53)
at org.apache.beam.sdk.extensions.gcp.options.GcpOptions$GcpTempLocationFactory.create(GcpOptions.java:308)
... 23 more
Caused by: java.io.IOException: Unexpected Error code 504 trying to get security access token from Compute Engine metadata for the default service account: "Request timeout."
at com.google.auth.oauth2.ComputeEngineCredentials.refreshAccessToken(ComputeEngineCredentials.java:142)
at com.google.auth.oauth2.OAuth2Credentials.refresh(OAuth2Credentials.java:157)
at com.google.auth.oauth2.OAuth2Credentials.getRequestMetadata(OAuth2Credentials.java:145)
at com.google.auth.http.HttpCredentialsAdapter.initialize(HttpCredentialsAdapter.java:91)
at com.google.cloud.hadoop.util.ChainingHttpRequestInitializer.initialize(ChainingHttpRequestInitializer.java:52)
at com.google.api.client.http.HttpRequestFactory.buildRequest(HttpRequestFactory.java:88)
at com.google.api.client.googleapis.services.AbstractGoogleClientRequest.buildHttpRequest(AbstractGoogleClientRequest.java:422)
at com.google.api.client.googleapis.services.AbstractGoogleClientRequest.executeUnparsed(AbstractGoogleClientRequest.java:541)
at com.google.api.client.googleapis.services.AbstractGoogleClientRequest.executeUnparsed(AbstractGoogleClientRequest.java:474)
at com.google.api.client.googleapis.services.AbstractGoogleClientRequest.execute(AbstractGoogleClientRequest.java:591)
at com.google.cloud.hadoop.util.ResilientOperation$AbstractGoogleClientRequestExecutor.call(ResilientOperation.java:171)
at com.google.cloud.hadoop.util.ResilientOperation.retry(ResilientOperation.java:67)
at org.apache.beam.sdk.extensions.gcp.util.GcsUtil.getBucket(GcsUtil.java:519)
at org.apache.beam.sdk.extensions.gcp.util.GcsUtil.bucketAccessible(GcsUtil.java:507)
at org.apache.beam.sdk.extensions.gcp.util.GcsUtil.bucketAccessible(GcsUtil.java:480)
at org.apache.beam.sdk.extensions.gcp.storage.GcsPathValidator.verifyPathIsAccessible(GcsPathValidator.java:83)
... 25 more
> Task :sdks:java:testing:nexmark:run FAILED
FAILURE: Build failed with an exception.
* What went wrong:
Execution failed for task ':sdks:java:testing:nexmark:run'.
> Process 'command '/usr/lib/jvm/java-8-openjdk-amd64/bin/java'' finished with non-zero exit value 1
* Try:
Run with --stacktrace option to get the stack trace. Run with --info or --debug option to get more log output. Run with --scan to get full insights.
* Get more help at https://help.gradle.org
Deprecated Gradle features were used in this build, making it incompatible with Gradle 6.0.
Use '--warning-mode all' to show the individual deprecation warnings.
See https://docs.gradle.org/5.2.1/userguide/command_line_interface.html#sec:command_line_warnings
BUILD FAILED in 2m 1s
83 actionable tasks: 56 executed, 27 from cache
Publishing build scan...
https://gradle.com/s/54i3grj3a4tme
Build step 'Invoke Gradle script' changed build result to FAILURE
Build step 'Invoke Gradle script' marked build as failure
---------------------------------------------------------------------
To unsubscribe, e-mail: builds-unsubscribe@beam.apache.org
For additional commands, e-mail: builds-help@beam.apache.org
Jenkins build is back to normal :
beam_PostCommit_Java_Nexmark_Dataflow #5549
Posted by Apache Jenkins Server <je...@builds.apache.org>.
See <https://builds.apache.org/job/beam_PostCommit_Java_Nexmark_Dataflow/5549/display/redirect?page=changes>
---------------------------------------------------------------------
To unsubscribe, e-mail: builds-unsubscribe@beam.apache.org
For additional commands, e-mail: builds-help@beam.apache.org