You are viewing a plain text version of this content. The canonical link for it is here.
Posted to notifications@qpid.apache.org by Apache Jenkins Server <je...@builds.apache.org> on 2012/10/19 07:02:08 UTC
Build failed in Jenkins: Qpid-Java-Java-DBY-TestMatrix » JDK 1.6 (latest),ubuntu,java-dby.0-10 #226
See <https://builds.apache.org/job/Qpid-Java-Java-DBY-TestMatrix/./jdk=JDK%201.6%20(latest),label=ubuntu,profile=java-dby.0-10/226/changes>
Changes:
[shuston] Fix recovering a zero-length message. Fixes QPID-3491.
[chug] QPID-4378 C++ Broker deletes dynamin bridges too aggressively.
Link state should not control bridge life cycle.
Reviewed by Ted Ross.
[chug] QPID-4373 r139931 Fix self test to use proper switch name.
[aconway] Bug 867030 - QPID-4374: Make QueueGuard::cancel idempotent (Jason Dillaman)
Added QueueGuard::cancelled, only call cancel once.
Don't enqueue after cancel.
[aconway] Bug 867030 - QPID-4374: Use configurable credit window for HA backup subscriptions (Jason Dillaman)
[aconway] Bug 867030 - QPID-4374: Reduce contention on Queue::messageLock (Jason Dillaman)
Introduce a separate lock for Queue::UsageBarrier.
[kwall] QPID-4298: AMQQueueDeferredOrderingTest should sync after sending the test messages
* Call AMQSession#sync after the sending of each (non-transactional) message, this is required to avoid spurious
test fails on machines that are CPU starved.
* Renamed test from testPausedOrder to testMessagesSentByTwoThreadsAreDeliveredInOrder to better reflect the
nature of the test.
------------------------------------------
[...truncated 2493 lines...]
[junit] Running org.apache.qpid.disttest.controller.config.ParticipantConfigTest
[junit] Tests run: 1, Failures: 0, Errors: 0, Time elapsed: 0.009 sec
[junit] Running org.apache.qpid.disttest.controller.config.ProducerConfigTest
[junit] Tests run: 3, Failures: 0, Errors: 0, Time elapsed: 0.003 sec
[junit] Running org.apache.qpid.disttest.controller.config.SessionConfigTest
[junit] Tests run: 3, Failures: 0, Errors: 0, Time elapsed: 0.019 sec
[junit] Running org.apache.qpid.disttest.controller.config.TestConfigTest
[junit] Tests run: 5, Failures: 0, Errors: 0, Time elapsed: 0.007 sec
[junit] Running org.apache.qpid.disttest.controller.config.TestInstanceTest
[junit] Tests run: 3, Failures: 0, Errors: 0, Time elapsed: 0.007 sec
[junit] Running org.apache.qpid.disttest.jms.JmsMessageAdaptorTest
[junit] Tests run: 1, Failures: 0, Errors: 0, Time elapsed: 0.003 sec
[junit] Running org.apache.qpid.disttest.message.JsonHandlerTest
[junit] Tests run: 2, Failures: 0, Errors: 0, Time elapsed: 0.019 sec
[junit] Running org.apache.qpid.disttest.message.ParticipantResultTest
[junit] Tests run: 3, Failures: 0, Errors: 0, Time elapsed: 0.042 sec
[junit] Running org.apache.qpid.disttest.results.aggregation.AggregatorTest
[junit] Tests run: 1, Failures: 0, Errors: 0, Time elapsed: 0.01 sec
[junit] Running org.apache.qpid.disttest.results.aggregation.ParticipantResultAggregatorTest
[junit] Tests run: 14, Failures: 0, Errors: 0, Time elapsed: 0.003 sec
[junit] Running org.apache.qpid.disttest.results.aggregation.SeriesStatisticsTest
[junit] Tests run: 1, Failures: 0, Errors: 0, Time elapsed: 0.001 sec
[junit] Running org.apache.qpid.disttest.results.aggregation.TestResultAggregatorTest
[junit] Tests run: 4, Failures: 0, Errors: 0, Time elapsed: 0.004 sec
[junit] Running org.apache.qpid.disttest.results.formatting.CSVFormatterTest
[junit] Tests run: 1, Failures: 0, Errors: 0, Time elapsed: 0.004 sec
[junit] Running org.apache.qpid.disttest.results.formatting.CSVOrderParticipantResultComparatorTest
[junit] Tests run: 6, Failures: 0, Errors: 0, Time elapsed: 0.009 sec
[junit] Running org.apache.qpid.systest.disttest.QpidQueueCreatorTest
[junit] Tests run: 3, Failures: 0, Errors: 1, Time elapsed: 18.476 sec
[junit] TEST org.apache.qpid.systest.disttest.QpidQueueCreatorTest FAILED
[junit] Running org.apache.qpid.systest.disttest.clientonly.BasicDistributedClientTest
[junit] Tests run: 5, Failures: 0, Errors: 0, Time elapsed: 41.822 sec
[junit] Running org.apache.qpid.systest.disttest.clientonly.ConsumerParticipantTest
[junit] Tests run: 3, Failures: 0, Errors: 0, Time elapsed: 30.938 sec
[junit] Running org.apache.qpid.systest.disttest.clientonly.DistributedClientTest
[junit] Tests run: 9, Failures: 0, Errors: 0, Time elapsed: 72.749 sec
[junit] Running org.apache.qpid.systest.disttest.clientonly.MessageProviderTest
[junit] Tests run: 2, Failures: 0, Errors: 0, Time elapsed: 16.617 sec
[junit] Running org.apache.qpid.systest.disttest.clientonly.ProducerParticipantTest
[junit] Tests run: 1, Failures: 0, Errors: 0, Time elapsed: 9.064 sec
[junit] Running org.apache.qpid.systest.disttest.controllerandclient.ControllerAndClientTest
[junit] Tests run: 5, Failures: 0, Errors: 0, Time elapsed: 45.499 sec
[junit] Running org.apache.qpid.systest.disttest.controlleronly.DistributedControllerTest
[junit] Tests run: 1, Failures: 0, Errors: 0, Time elapsed: 9.097 sec
[junit] Running org.apache.qpid.systest.disttest.endtoend.EndToEndTest
[junit] Tests run: 1, Failures: 0, Errors: 0, Time elapsed: 8.391 sec
[junit] Tests FAILED
[echo] Running ant for module : perftests
[delete] Deleting: <https://builds.apache.org/job/Qpid-Java-Java-DBY-TestMatrix/./jdk=JDK%201.6%20(latest),label=ubuntu,profile=java-dby.0-10/ws/trunk/qpid/java/build/scratch/test-java-dby.0-10.properties>
touch-failed:
[touch] Creating <https://builds.apache.org/job/Qpid-Java-Java-DBY-TestMatrix/./jdk=JDK%201.6%20(latest),label=ubuntu,profile=java-dby.0-10/ws/trunk/qpid/java/build/results/perftests/FAILED>
[echo] Running ant for module : broker-plugins/access-control
[delete] Deleting: <https://builds.apache.org/job/Qpid-Java-Java-DBY-TestMatrix/./jdk=JDK%201.6%20(latest),label=ubuntu,profile=java-dby.0-10/ws/trunk/qpid/java/build/scratch/test-java-dby.0-10.properties>
prepare:
compile_velocity:
check_velocity_deps:
gen_logging:
precompile:
compile:
[echo] Targeting : 1.5
copy-metainf-resources:
[copy] Warning: <https://builds.apache.org/job/Qpid-Java-Java-DBY-TestMatrix/./jdk=JDK%201.6%20(latest),label=ubuntu,profile=java-dby.0-10/ws/trunk/qpid/java/broker-plugins/access-control/resources> does not exist.
copy-module-metainf:
jar.manifest:
jar.nomanifest:
jar:
precompile-tests:
compile-tests:
jar-tests:
jar-sources:
libs:
copy-bin:
copy-etc:
postbuild:
build:
test:
[echo] Using profile:java-dby.0-10
[junit] Running org.apache.qpid.server.security.access.config.AclActionTest
[junit] Tests run: 1, Failures: 0, Errors: 0, Time elapsed: 0.229 sec
[junit] Running org.apache.qpid.server.security.access.config.AclRulePredicatesTest
[junit] Tests run: 4, Failures: 0, Errors: 0, Time elapsed: 0.025 sec
[junit] Running org.apache.qpid.server.security.access.config.ActionTest
[junit] Tests run: 7, Failures: 0, Errors: 0, Time elapsed: 0.027 sec
[junit] Running org.apache.qpid.server.security.access.config.ClientActionTest
[junit] Tests run: 4, Failures: 0, Errors: 0, Time elapsed: 0.014 sec
[junit] Running org.apache.qpid.server.security.access.config.PlainConfigurationTest
[junit] Tests run: 22, Failures: 0, Errors: 0, Time elapsed: 0.041 sec
[junit] Running org.apache.qpid.server.security.access.config.RuleTest
[junit] Tests run: 1, Failures: 0, Errors: 0, Time elapsed: 0.008 sec
[junit] Running org.apache.qpid.server.security.access.firewall.HostnameFirewallRuleTest
[junit] Tests run: 4, Failures: 0, Errors: 0, Time elapsed: 0.023 sec
[junit] Running org.apache.qpid.server.security.access.firewall.NetworkFirewallRuleTest
[junit] Tests run: 5, Failures: 0, Errors: 0, Time elapsed: 0.013 sec
[junit] Running org.apache.qpid.server.security.access.plugins.DefaultAccessControlTest
[junit] Tests run: 13, Failures: 0, Errors: 0, Time elapsed: 0.063 sec
[junit] Running org.apache.qpid.server.security.access.plugins.RuleSetTest
[junit] Tests run: 20, Failures: 0, Errors: 0, Time elapsed: 0.043 sec
[echo] Running ant for module : broker-plugins/access-control
[delete] Deleting: <https://builds.apache.org/job/Qpid-Java-Java-DBY-TestMatrix/./jdk=JDK%201.6%20(latest),label=ubuntu,profile=java-dby.0-10/ws/trunk/qpid/java/build/scratch/test-java-dby.0-10.properties>
touch-failed:
[echo] Running ant for module : broker-plugins/management-http
[delete] Deleting: <https://builds.apache.org/job/Qpid-Java-Java-DBY-TestMatrix/./jdk=JDK%201.6%20(latest),label=ubuntu,profile=java-dby.0-10/ws/trunk/qpid/java/build/scratch/test-java-dby.0-10.properties>
prepare:
unwardojo:
precompile:
compile:
[echo] Targeting : 1.5
copy-metainf-resources:
[copy] Warning: <https://builds.apache.org/job/Qpid-Java-Java-DBY-TestMatrix/./jdk=JDK%201.6%20(latest),label=ubuntu,profile=java-dby.0-10/ws/trunk/qpid/java/broker-plugins/management-http/resources> does not exist.
copy-module-metainf:
jar.manifest:
jar.nomanifest:
jar:
precompile-tests:
compile-tests:
jar-tests:
jar-sources:
libs:
copy-bin:
copy-etc:
postbuild:
build:
test:
[echo] Using profile:java-dby.0-10
[junit] Running org.apache.qpid.server.management.plugin.HttpManagementFactoryTest
[junit] Tests run: 3, Failures: 0, Errors: 0, Time elapsed: 0.063 sec
[junit] Running org.apache.qpid.server.management.plugin.servlet.rest.ConfiguredObjectToMapConverterTest
[junit] Tests run: 4, Failures: 0, Errors: 0, Time elapsed: 0.033 sec
[junit] Running org.apache.qpid.server.management.plugin.session.LoginLogoutReporterTest
[junit] Tests run: 2, Failures: 0, Errors: 0, Time elapsed: 0.03 sec
[echo] Running ant for module : broker-plugins/management-http
[delete] Deleting: <https://builds.apache.org/job/Qpid-Java-Java-DBY-TestMatrix/./jdk=JDK%201.6%20(latest),label=ubuntu,profile=java-dby.0-10/ws/trunk/qpid/java/build/scratch/test-java-dby.0-10.properties>
touch-failed:
[echo] Running ant for module : broker-plugins/management-jmx
[delete] Deleting: <https://builds.apache.org/job/Qpid-Java-Java-DBY-TestMatrix/./jdk=JDK%201.6%20(latest),label=ubuntu,profile=java-dby.0-10/ws/trunk/qpid/java/build/scratch/test-java-dby.0-10.properties>
prepare:
precompile:
compile:
[echo] Targeting : 1.5
copy-metainf-resources:
[copy] Warning: <https://builds.apache.org/job/Qpid-Java-Java-DBY-TestMatrix/./jdk=JDK%201.6%20(latest),label=ubuntu,profile=java-dby.0-10/ws/trunk/qpid/java/broker-plugins/management-jmx/resources> does not exist.
copy-module-metainf:
jar.manifest:
jar.nomanifest:
jar:
precompile-tests:
compile-tests:
jar-tests:
jar-sources:
libs:
copy-bin:
copy-etc:
postbuild:
build:
test:
[echo] Using profile:java-dby.0-10
[junit] Running org.apache.qpid.server.jmx.JMXManagementFactoryTest
[junit] Tests run: 2, Failures: 0, Errors: 0, Time elapsed: 0.06 sec
[junit] Running org.apache.qpid.server.jmx.ManagementLogActorTest
[junit] Tests run: 1, Failures: 0, Errors: 0, Time elapsed: 0.439 sec
[junit] Running org.apache.qpid.server.jmx.mbeans.ConnectionMBeanTest
[junit] Tests run: 16, Failures: 0, Errors: 0, Time elapsed: 0.173 sec
[junit] Running org.apache.qpid.server.jmx.mbeans.ExchangeMBeanTest
[junit] Tests run: 10, Failures: 0, Errors: 0, Time elapsed: 0.08 sec
[junit] Running org.apache.qpid.server.jmx.mbeans.LoggingManagementMBeanTest
[junit] Tests run: 20, Failures: 0, Errors: 0, Time elapsed: 0.076 sec
[junit] Running org.apache.qpid.server.jmx.mbeans.QueueMBeanTest
[junit] Tests run: 40, Failures: 0, Errors: 0, Time elapsed: 0.203 sec
[junit] Running org.apache.qpid.server.jmx.mbeans.ServerInformationMBeanTest
[junit] Tests run: 5, Failures: 0, Errors: 0, Time elapsed: 0.019 sec
[junit] Running org.apache.qpid.server.jmx.mbeans.UserManagementMBeanTest
[junit] Tests run: 10, Failures: 0, Errors: 0, Time elapsed: 0.044 sec
[junit] Running org.apache.qpid.server.jmx.mbeans.VirtualHostManagerMBeanTest
[junit] Tests run: 9, Failures: 0, Errors: 0, Time elapsed: 0.056 sec
[echo] Running ant for module : broker-plugins/management-jmx
[delete] Deleting: <https://builds.apache.org/job/Qpid-Java-Java-DBY-TestMatrix/./jdk=JDK%201.6%20(latest),label=ubuntu,profile=java-dby.0-10/ws/trunk/qpid/java/build/scratch/test-java-dby.0-10.properties>
touch-failed:
BUILD FAILED
<https://builds.apache.org/job/Qpid-Java-Java-DBY-TestMatrix/./jdk=JDK%201.6%20(latest),label=ubuntu,profile=java-dby.0-10/ws/trunk/qpid/java/build.xml>:100: TEST SUITE FAILED
Total time: 109 minutes 52 seconds
Build step 'Invoke Ant' marked build as failure
[locks-and-latches] Releasing all the locks
[locks-and-latches] All the locks released
Recording test results
Jenkins build is back to normal : Qpid-Java-Java-DBY-TestMatrix » JDK 1.6 (latest),ubuntu,java-dby.0-10 #227
Posted by Apache Jenkins Server <je...@builds.apache.org>.
See <https://builds.apache.org/job/Qpid-Java-Java-DBY-TestMatrix/./jdk=JDK%201.6%20(latest),label=ubuntu,profile=java-dby.0-10/227/changes>