You are viewing a plain text version of this content. The canonical link for it is here.
Posted to commits@jena.apache.org by Apache Jenkins Server <je...@builds.apache.org> on 2013/06/15 09:52:44 UTC
Build failed in Jenkins: Jena__Development_Deploy #344
See <https://builds.apache.org/job/Jena__Development_Deploy/344/changes>
Changes:
[andy] Update to latest W3C RDF-WG tests for Turtle and TriG
[rvesse] Add <repository> element to jena-text POM as org.restlet.jee artifacts aren't in Maven Central and won't build in some environments (like mine) without this.
Also fix minor typos in some code comments
------------------------------------------
[...truncated 821 lines...]
Tests run: 112, Failures: 0, Errors: 0, Skipped: 0, Time elapsed: 0.084 sec
Running org.apache.jena.atlas.lib.TS_Lib
Tests run: 349, Failures: 0, Errors: 0, Skipped: 0, Time elapsed: 0.703 sec
Running org.apache.jena.atlas.web.TS_Web
Tests run: 17, Failures: 0, Errors: 0, Skipped: 0, Time elapsed: 0.007 sec
Running org.apache.jena.common.TS_Common
Tests run: 28, Failures: 0, Errors: 0, Skipped: 0, Time elapsed: 0.053 sec
Running org.apache.jena.riot.system.TS_RiotSystem
Tests run: 153, Failures: 0, Errors: 0, Skipped: 0, Time elapsed: 0.165 sec
Running org.apache.jena.riot.out.TS_Out
Tests run: 90, Failures: 0, Errors: 0, Skipped: 0, Time elapsed: 0.029 sec
Running org.apache.jena.riot.process.TS_Process
Tests run: 60, Failures: 0, Errors: 0, Skipped: 0, Time elapsed: 0.026 sec
Running org.apache.jena.riot.tokens.TS_Tokens
Tests run: 125, Failures: 0, Errors: 0, Skipped: 0, Time elapsed: 0.031 sec
Running org.apache.jena.riot.lang.TS_Lang
Tests run: 401, Failures: 0, Errors: 0, Skipped: 0, Time elapsed: 3.965 sec
Running org.apache.jena.riot.TS_LangSuite
07:51:22 WARN TestFactoryManifest :: Failed to load: file://<https://builds.apache.org/job/Jena__Development_Deploy/ws/trunk/jena-arq/testing/RIOT/Lang/N-Quads/manifest.ttl>
Not found: file://<https://builds.apache.org/job/Jena__Development_Deploy/ws/trunk/jena-arq/testing/RIOT/Lang/N-Quads/manifest.ttl>
com.hp.hpl.jena.shared.NotFoundException: Not found: file://<https://builds.apache.org/job/Jena__Development_Deploy/ws/trunk/jena-arq/testing/RIOT/Lang/N-Quads/manifest.ttl>
at org.apache.jena.riot.adapters.AdapterFileManager.readModelWorker(AdapterFileManager.java:285)
at com.hp.hpl.jena.util.FileManager.loadModelWorker(FileManager.java:309)
at com.hp.hpl.jena.util.FileManager.loadModel(FileManager.java:261)
at com.hp.hpl.jena.util.junit.Manifest.<init>(Manifest.java:57)
at com.hp.hpl.jena.util.junit.TestFactoryManifest.oneManifest(TestFactoryManifest.java:47)
at com.hp.hpl.jena.util.junit.TestFactoryManifest.oneManifest(TestFactoryManifest.java:63)
at com.hp.hpl.jena.util.junit.TestFactoryManifest.process(TestFactoryManifest.java:39)
at org.apache.jena.riot.langsuite.FactoryTestRiot.make(FactoryTestRiot.java:42)
at org.apache.jena.riot.TS_LangSuite.suite(TS_LangSuite.java:37)
at sun.reflect.NativeMethodAccessorImpl.invoke0(Native Method)
at sun.reflect.NativeMethodAccessorImpl.invoke(NativeMethodAccessorImpl.java:39)
at sun.reflect.DelegatingMethodAccessorImpl.invoke(DelegatingMethodAccessorImpl.java:25)
at java.lang.reflect.Method.invoke(Method.java:597)
at org.junit.internal.runners.SuiteMethod.testFromSuiteMethod(SuiteMethod.java:35)
at org.junit.internal.runners.SuiteMethod.<init>(SuiteMethod.java:24)
at org.junit.runners.AllTests.<init>(AllTests.java:25)
at sun.reflect.NativeConstructorAccessorImpl.newInstance0(Native Method)
at sun.reflect.NativeConstructorAccessorImpl.newInstance(NativeConstructorAccessorImpl.java:39)
at sun.reflect.DelegatingConstructorAccessorImpl.newInstance(DelegatingConstructorAccessorImpl.java:27)
at java.lang.reflect.Constructor.newInstance(Constructor.java:513)
at org.junit.internal.builders.AnnotatedBuilder.buildRunner(AnnotatedBuilder.java:29)
at org.junit.internal.builders.AnnotatedBuilder.runnerForClass(AnnotatedBuilder.java:21)
at org.junit.runners.model.RunnerBuilder.safeRunnerForClass(RunnerBuilder.java:59)
at org.junit.internal.builders.AllDefaultPossibilitiesBuilder.runnerForClass(AllDefaultPossibilitiesBuilder.java:26)
at org.junit.runners.model.RunnerBuilder.safeRunnerForClass(RunnerBuilder.java:59)
at org.junit.internal.requests.ClassRequest.getRunner(ClassRequest.java:26)
at org.apache.maven.surefire.junit4.JUnit4Provider.execute(JUnit4Provider.java:250)
at org.apache.maven.surefire.junit4.JUnit4Provider.executeTestSet(JUnit4Provider.java:141)
at org.apache.maven.surefire.junit4.JUnit4Provider.invoke(JUnit4Provider.java:112)
at sun.reflect.NativeMethodAccessorImpl.invoke0(Native Method)
at sun.reflect.NativeMethodAccessorImpl.invoke(NativeMethodAccessorImpl.java:39)
at sun.reflect.DelegatingMethodAccessorImpl.invoke(DelegatingMethodAccessorImpl.java:25)
at java.lang.reflect.Method.invoke(Method.java:597)
at org.apache.maven.surefire.util.ReflectionUtils.invokeMethodWithArray(ReflectionUtils.java:189)
at org.apache.maven.surefire.booter.ProviderFactory$ProviderProxy.invoke(ProviderFactory.java:165)
at org.apache.maven.surefire.booter.ProviderFactory.invokeProvider(ProviderFactory.java:85)
at org.apache.maven.surefire.booter.ForkedBooter.runSuitesInProcess(ForkedBooter.java:115)
at org.apache.maven.surefire.booter.ForkedBooter.main(ForkedBooter.java:75)
Unrecognized turtle test : (http://openjena.org/test/riot#TestInOut)trig-test-00
Unrecognized turtle test : (http://openjena.org/test/riot#TestInOut)trig-test-01
Unrecognized turtle test : (http://openjena.org/test/riot#TestInOut)trig-test-02
Tests run: 369, Failures: 0, Errors: 0, Skipped: 0, Time elapsed: 3.06 sec
Running org.apache.jena.riot.adapters.TS_RIOTAdapters
Tests run: 13, Failures: 0, Errors: 0, Skipped: 0, Time elapsed: 0.007 sec
Running org.apache.jena.riot.writer.TS_RiotWriter
Tests run: 434, Failures: 0, Errors: 0, Skipped: 0, Time elapsed: 0.769 sec
Running org.apache.jena.riot.stream.TS_IO2
Tests run: 40, Failures: 0, Errors: 0, Skipped: 0, Time elapsed: 0.021 sec
Running org.apache.jena.riot.TS_ReaderRIOT
Tests run: 106, Failures: 0, Errors: 0, Skipped: 0, Time elapsed: 0.074 sec
Running org.apache.jena.riot.web.TS_RiotWeb
Tests run: 19, Failures: 0, Errors: 0, Skipped: 0, Time elapsed: 0.003 sec
Running arq.TS_Cmd
Tests run: 7, Failures: 0, Errors: 0, Skipped: 0, Time elapsed: 0.004 sec
Running com.hp.hpl.jena.query.TS_ParamString
Tests run: 133, Failures: 0, Errors: 0, Skipped: 0, Time elapsed: 0.126 sec
Running com.hp.hpl.jena.sparql.modify.TS_Update
Tests run: 34, Failures: 0, Errors: 0, Skipped: 0, Time elapsed: 0.199 sec
Running com.hp.hpl.jena.sparql.algebra.TS_Algebra
Tests run: 221, Failures: 0, Errors: 0, Skipped: 0, Time elapsed: 0.292 sec
Running com.hp.hpl.jena.sparql.core.TS_Core
Tests run: 82, Failures: 0, Errors: 0, Skipped: 0, Time elapsed: 0.03 sec
Running com.hp.hpl.jena.sparql.expr.TS_Expr
Tests run: 1023, Failures: 0, Errors: 0, Skipped: 0, Time elapsed: 0.372 sec
Running com.hp.hpl.jena.sparql.util.TS_Util
Tests run: 76, Failures: 0, Errors: 0, Skipped: 0, Time elapsed: 0.068 sec
Running com.hp.hpl.jena.sparql.solver.TS_Solver
Tests run: 23, Failures: 0, Errors: 0, Skipped: 0, Time elapsed: 0.011 sec
Running com.hp.hpl.jena.sparql.engine.binding.TS_Binding
Tests run: 16, Failures: 0, Errors: 0, Skipped: 0, Time elapsed: 0.008 sec
Running com.hp.hpl.jena.sparql.engine.TS_Engine
Tests run: 40, Failures: 0, Errors: 0, Skipped: 0, Time elapsed: 8.854 sec
Running com.hp.hpl.jena.sparql.lang.TS_Lang
Tests run: 55, Failures: 0, Errors: 0, Skipped: 0, Time elapsed: 0.02 sec
Running com.hp.hpl.jena.sparql.function.user.TS_UserFunctions
Tests run: 22, Failures: 0, Errors: 0, Skipped: 0, Time elapsed: 0.017 sec
Running com.hp.hpl.jena.sparql.path.TS_Path
Tests run: 107, Failures: 0, Errors: 0, Skipped: 0, Time elapsed: 0.059 sec
Running com.hp.hpl.jena.sparql.TC_Scripted
Tests run: 994, Failures: 0, Errors: 0, Skipped: 0, Time elapsed: 5.025 sec
Running com.hp.hpl.jena.sparql.TC_DAWG
Tests run: 467, Failures: 0, Errors: 0, Skipped: 0, Time elapsed: 1.881 sec
Running com.hp.hpl.jena.sparql.syntax.TS_SSE
Tests run: 113, Failures: 0, Errors: 0, Skipped: 0, Time elapsed: 0.023 sec
Running com.hp.hpl.jena.sparql.syntax.TS_Serialization
Tests run: 42, Failures: 0, Errors: 0, Skipped: 0, Time elapsed: 0.009 sec
Running com.hp.hpl.jena.sparql.resultset.TS_ResultSet
Tests run: 130, Failures: 0, Errors: 0, Skipped: 0, Time elapsed: 0.09 sec
Running com.hp.hpl.jena.sparql.api.TS_API
Tests run: 38, Failures: 0, Errors: 0, Skipped: 0, Time elapsed: 2.546 sec
Running com.hp.hpl.jena.sparql.graph.TS_Graph
Tests run: 62, Failures: 0, Errors: 0, Skipped: 0, Time elapsed: 0.037 sec
Results :
Tests run: 6116, Failures: 0, Errors: 0, Skipped: 0
[JENKINS] Recording test results
[INFO]
[INFO] --- maven-jar-plugin:2.4:jar (default-jar) @ jena-arq ---
[INFO] Building jar: <https://builds.apache.org/job/Jena__Development_Deploy/ws/trunk/jena-arq/target/jena-arq-2.10.2-SNAPSHOT.jar>
[INFO]
[INFO] --- maven-site-plugin:3.0:attach-descriptor (attach-descriptor) @ jena-arq ---
[INFO]
[INFO] --- maven-source-plugin:2.2.1:jar-no-fork (attach-sources) @ jena-arq ---
[INFO] Building jar: <https://builds.apache.org/job/Jena__Development_Deploy/ws/trunk/jena-arq/target/jena-arq-2.10.2-SNAPSHOT-sources.jar>
[INFO]
[INFO] --- maven-source-plugin:2.2.1:test-jar-no-fork (attach-sources-test) @ jena-arq ---
[INFO] Building jar: <https://builds.apache.org/job/Jena__Development_Deploy/ws/trunk/jena-arq/target/jena-arq-2.10.2-SNAPSHOT-test-sources.jar>
[INFO] [INFO] Building jar: <https://builds.apache.org/job/Jena__Development_Deploy/ws/trunk/jena-arq/target/jena-arq-2.10.2-SNAPSHOT-tests.jar>
[INFO] --- maven-jar-plugin:2.4:test-jar (default) @ jena-arq ---
[INFO]
[INFO] --- maven-javadoc-plugin:2.9:jar (attach-javadocs) @ jena-arq ---
[INFO] Building jar: <https://builds.apache.org/job/Jena__Development_Deploy/ws/trunk/jena-arq/target/jena-arq-2.10.2-SNAPSHOT-javadoc.jar>
[INFO] ------------------------------------------------------------------------
[INFO] Reactor Summary:
[INFO]
[INFO] Apache Jena - Parent .............................. SUCCESS [29.112s]
[INFO] Apache Jena - IRI ................................. SUCCESS [28.192s]
[INFO] Apache Jena - CORE API ............................ SUCCESS [1:40.607s]
[INFO] Apache Jena - ARQ (SPARQL 1.1 Query Engine) ....... FAILURE [1:18.649s]
[INFO] Apache Jena - TDB (Native Triple Store) ........... SKIPPED
[INFO] Apache Jena - Libraries POM ....................... SKIPPED
[INFO] Apache Jena - SPARQL and Lucene/Solr .............. SKIPPED
[INFO] Apache Jena - Fuseki (SPARQL 1.1 Server) .......... SKIPPED
[INFO] Apache Jena - Distribution ........................ SKIPPED
[INFO] Apache Jena ....................................... SKIPPED
[INFO] ------------------------------------------------------------------------
[INFO] BUILD FAILURE
[INFO] ------------------------------------------------------------------------
[INFO] Total time: 3:59.168s
[INFO] Finished at: Sat Jun 15 07:52:18 UTC 2013
[INFO] Final Memory: 32M/288M
[INFO] ------------------------------------------------------------------------
[JENKINS] Archiving disabled
[JENKINS] Archiving disabled
[JENKINS] Archiving disabled
[JENKINS] Archiving disabled
[JENKINS] Archiving disabled
[JENKINS] Archiving disabled
[JENKINS] Archiving disabled
[JENKINS] Archiving disabled
[JENKINS] Archiving disabled
[JENKINS] Archiving disabled
Waiting for Jenkins to finish collecting data
mavenExecutionResult exceptions not empty
message : Internal error: java.lang.reflect.UndeclaredThrowableException
cause : null
Stack trace :
org.apache.maven.InternalErrorException: Internal error: java.lang.reflect.UndeclaredThrowableException
at org.apache.maven.lifecycle.internal.BuilderCommon.handleBuildError(BuilderCommon.java:128)
at org.apache.maven.lifecycle.internal.LifecycleModuleBuilder.buildProject(LifecycleModuleBuilder.java:95)
at org.apache.maven.lifecycle.internal.LifecycleModuleBuilder.buildProject(LifecycleModuleBuilder.java:59)
at org.apache.maven.lifecycle.internal.LifecycleStarter.singleThreadedBuild(LifecycleStarter.java:183)
at org.apache.maven.lifecycle.internal.LifecycleStarter.execute(LifecycleStarter.java:161)
at org.apache.maven.DefaultMaven.doExecute(DefaultMaven.java:320)
at org.apache.maven.DefaultMaven.execute(DefaultMaven.java:156)
at org.jvnet.hudson.maven3.launcher.Maven3Launcher.main(Maven3Launcher.java:79)
at sun.reflect.NativeMethodAccessorImpl.invoke0(Native Method)
at sun.reflect.NativeMethodAccessorImpl.invoke(NativeMethodAccessorImpl.java:39)
at sun.reflect.DelegatingMethodAccessorImpl.invoke(DelegatingMethodAccessorImpl.java:25)
at java.lang.reflect.Method.invoke(Method.java:597)
at org.codehaus.plexus.classworlds.launcher.Launcher.launchStandard(Launcher.java:329)
at org.codehaus.plexus.classworlds.launcher.Launcher.launch(Launcher.java:239)
at org.jvnet.hudson.maven3.agent.Maven3Main.launch(Maven3Main.java:158)
at hudson.maven.Maven3Builder.call(Maven3Builder.java:100)
at hudson.maven.Maven3Builder.call(Maven3Builder.java:66)
at hudson.remoting.UserRequest.perform(UserRequest.java:118)
at hudson.remoting.UserRequest.perform(UserRequest.java:48)
at hudson.remoting.Request$2.run(Request.java:326)
at hudson.remoting.InterceptingExecutorService$1.call(InterceptingExecutorService.java:72)
at java.util.concurrent.FutureTask$Sync.innerRun(FutureTask.java:303)
at java.util.concurrent.FutureTask.run(FutureTask.java:138)
at java.util.concurrent.ThreadPoolExecutor$Worker.runTask(ThreadPoolExecutor.java:895)
at java.util.concurrent.ThreadPoolExecutor$Worker.run(ThreadPoolExecutor.java:918)
at java.lang.Thread.run(Thread.java:662)
Caused by: java.lang.reflect.UndeclaredThrowableException
at com.sun.proxy.$Proxy2.setExecutedMojos(Unknown Source)
at hudson.maven.MavenBuildProxy$Filter.setExecutedMojos(MavenBuildProxy.java:243)
at hudson.maven.Maven3Builder$MavenExecutionListener.recordMojoEnded(Maven3Builder.java:439)
at hudson.maven.Maven3Builder$MavenExecutionListener.mojoSucceeded(Maven3Builder.java:425)
at org.apache.maven.lifecycle.internal.DefaultExecutionEventCatapult.fire(DefaultExecutionEventCatapult.java:87)
at org.apache.maven.lifecycle.internal.DefaultExecutionEventCatapult.fire(DefaultExecutionEventCatapult.java:42)
at org.apache.maven.lifecycle.internal.MojoExecutor.execute(MojoExecutor.java:228)
at org.apache.maven.lifecycle.internal.MojoExecutor.execute(MojoExecutor.java:153)
at org.apache.maven.lifecycle.internal.MojoExecutor.execute(MojoExecutor.java:145)
at org.apache.maven.lifecycle.internal.LifecycleModuleBuilder.buildProject(LifecycleModuleBuilder.java:84)
... 24 more
Caused by: java.io.UTFDataFormatException
at java.io.ObjectInputStream$BlockDataInputStream.readUTFSpan(ObjectInputStream.java:3086)
at java.io.ObjectInputStream$BlockDataInputStream.readUTFBody(ObjectInputStream.java:3030)
at java.io.ObjectInputStream$BlockDataInputStream.readUTF(ObjectInputStream.java:2843)
at java.io.ObjectInputStream.readString(ObjectInputStream.java:1617)
at java.io.ObjectInputStream.readObject0(ObjectInputStream.java:1338)
at java.io.ObjectInputStream.defaultReadFields(ObjectInputStream.java:1970)
at java.io.ObjectInputStream.readSerialData(ObjectInputStream.java:1894)
at java.io.ObjectInputStream.readOrdinaryObject(ObjectInputStream.java:1777)
at java.io.ObjectInputStream.readObject0(ObjectInputStream.java:1347)
at java.io.ObjectInputStream.readArray(ObjectInputStream.java:1685)
at java.io.ObjectInputStream.readObject0(ObjectInputStream.java:1341)
at java.io.ObjectInputStream.defaultReadFields(ObjectInputStream.java:1970)
at java.io.ObjectInputStream.defaultReadObject(ObjectInputStream.java:498)
at java.lang.Throwable.readObject(Throwable.java:913)
at sun.reflect.GeneratedMethodAccessor154.invoke(Unknown Source)
at sun.reflect.DelegatingMethodAccessorImpl.invoke(DelegatingMethodAccessorImpl.java:43)
at java.lang.reflect.Method.invoke(Method.java:601)
at java.io.ObjectStreamClass.invokeReadObject(ObjectStreamClass.java:1004)
at java.io.ObjectInputStream.readSerialData(ObjectInputStream.java:1872)
at java.io.ObjectInputStream.readOrdinaryObject(ObjectInputStream.java:1777)
at java.io.ObjectInputStream.readObject0(ObjectInputStream.java:1347)
at java.io.ObjectInputStream.defaultReadFields(ObjectInputStream.java:1970)
at java.io.ObjectInputStream.readSerialData(ObjectInputStream.java:1894)
at java.io.ObjectInputStream.readOrdinaryObject(ObjectInputStream.java:1777)
at java.io.ObjectInputStream.readObject0(ObjectInputStream.java:1347)
at java.io.ObjectInputStream.readObject(ObjectInputStream.java:369)
at hudson.remoting.UserRequest.deserialize(UserRequest.java:182)
at hudson.remoting.UserRequest.perform(UserRequest.java:98)
at hudson.remoting.UserRequest.perform(UserRequest.java:48)
at hudson.remoting.Request$2.run(Request.java:326)
at hudson.remoting.InterceptingExecutorService$1.call(InterceptingExecutorService.java:72)
at java.util.concurrent.FutureTask$Sync.innerRun(FutureTask.java:334)
at java.util.concurrent.FutureTask.run(FutureTask.java:166)
at java.util.concurrent.ThreadPoolExecutor.runWorker(ThreadPoolExecutor.java:1145)
at java.util.concurrent.ThreadPoolExecutor$Worker.run(ThreadPoolExecutor.java:615)
at java.lang.Thread.run(Thread.java:722)
Sending e-mails to: commits@jena.apache.org
channel stopped
Jenkins build is back to normal : Jena__Development_Deploy #345
Posted by Apache Jenkins Server <je...@builds.apache.org>.
See <https://builds.apache.org/job/Jena__Development_Deploy/345/changes>