You are viewing a plain text version of this content. The canonical link for it is here.
Posted to dev@lucene.apache.org by Apache Jenkins Server <je...@builds.apache.org> on 2013/09/14 10:59:27 UTC
[JENKINS] Lucene-Solr-Tests-4.x-Java7 - Build # 1591 - Still
Failing
Build: https://builds.apache.org/job/Lucene-Solr-Tests-4.x-Java7/1591/
2 tests failed.
REGRESSION: org.apache.solr.cloud.SyncSliceTest.testDistribSearch
Error Message:
expected:<5> but was:<4>
Stack Trace:
java.lang.AssertionError: expected:<5> but was:<4>
at __randomizedtesting.SeedInfo.seed([ABE9F1CFCB4E5AA4:2A0F7FD7BC113A98]:0)
at org.junit.Assert.fail(Assert.java:93)
at org.junit.Assert.failNotEquals(Assert.java:647)
at org.junit.Assert.assertEquals(Assert.java:128)
at org.junit.Assert.assertEquals(Assert.java:472)
at org.junit.Assert.assertEquals(Assert.java:456)
at org.apache.solr.cloud.SyncSliceTest.doTest(SyncSliceTest.java:175)
at org.apache.solr.BaseDistributedSearchTestCase.testDistribSearch(BaseDistributedSearchTestCase.java:835)
at sun.reflect.NativeMethodAccessorImpl.invoke0(Native Method)
at sun.reflect.NativeMethodAccessorImpl.invoke(NativeMethodAccessorImpl.java:57)
at sun.reflect.DelegatingMethodAccessorImpl.invoke(DelegatingMethodAccessorImpl.java:43)
at java.lang.reflect.Method.invoke(Method.java:606)
at com.carrotsearch.randomizedtesting.RandomizedRunner.invoke(RandomizedRunner.java:1559)
at com.carrotsearch.randomizedtesting.RandomizedRunner.access$600(RandomizedRunner.java:79)
at com.carrotsearch.randomizedtesting.RandomizedRunner$6.evaluate(RandomizedRunner.java:737)
at com.carrotsearch.randomizedtesting.RandomizedRunner$7.evaluate(RandomizedRunner.java:773)
at com.carrotsearch.randomizedtesting.RandomizedRunner$8.evaluate(RandomizedRunner.java:787)
at com.carrotsearch.randomizedtesting.rules.SystemPropertiesRestoreRule$1.evaluate(SystemPropertiesRestoreRule.java:53)
at org.apache.lucene.util.TestRuleSetupTeardownChained$1.evaluate(TestRuleSetupTeardownChained.java:50)
at org.apache.lucene.util.TestRuleFieldCacheSanity$1.evaluate(TestRuleFieldCacheSanity.java:51)
at org.apache.lucene.util.AbstractBeforeAfterRule$1.evaluate(AbstractBeforeAfterRule.java:46)
at com.carrotsearch.randomizedtesting.rules.SystemPropertiesInvariantRule$1.evaluate(SystemPropertiesInvariantRule.java:55)
at org.apache.lucene.util.TestRuleThreadAndTestName$1.evaluate(TestRuleThreadAndTestName.java:49)
at org.apache.lucene.util.TestRuleIgnoreAfterMaxFailures$1.evaluate(TestRuleIgnoreAfterMaxFailures.java:70)
at org.apache.lucene.util.TestRuleMarkFailure$1.evaluate(TestRuleMarkFailure.java:48)
at com.carrotsearch.randomizedtesting.rules.StatementAdapter.evaluate(StatementAdapter.java:36)
at com.carrotsearch.randomizedtesting.ThreadLeakControl$StatementRunner.run(ThreadLeakControl.java:358)
at com.carrotsearch.randomizedtesting.ThreadLeakControl.forkTimeoutingTask(ThreadLeakControl.java:782)
at com.carrotsearch.randomizedtesting.ThreadLeakControl$3.evaluate(ThreadLeakControl.java:442)
at com.carrotsearch.randomizedtesting.RandomizedRunner.runSingleTest(RandomizedRunner.java:746)
at com.carrotsearch.randomizedtesting.RandomizedRunner$3.evaluate(RandomizedRunner.java:648)
at com.carrotsearch.randomizedtesting.RandomizedRunner$4.evaluate(RandomizedRunner.java:682)
at com.carrotsearch.randomizedtesting.RandomizedRunner$5.evaluate(RandomizedRunner.java:693)
at com.carrotsearch.randomizedtesting.rules.StatementAdapter.evaluate(StatementAdapter.java:36)
at com.carrotsearch.randomizedtesting.rules.SystemPropertiesRestoreRule$1.evaluate(SystemPropertiesRestoreRule.java:53)
at org.apache.lucene.util.AbstractBeforeAfterRule$1.evaluate(AbstractBeforeAfterRule.java:46)
at org.apache.lucene.util.TestRuleStoreClassName$1.evaluate(TestRuleStoreClassName.java:42)
at com.carrotsearch.randomizedtesting.rules.SystemPropertiesInvariantRule$1.evaluate(SystemPropertiesInvariantRule.java:55)
at com.carrotsearch.randomizedtesting.rules.NoShadowingOrOverridesOnMethodsRule$1.evaluate(NoShadowingOrOverridesOnMethodsRule.java:39)
at com.carrotsearch.randomizedtesting.rules.NoShadowingOrOverridesOnMethodsRule$1.evaluate(NoShadowingOrOverridesOnMethodsRule.java:39)
at com.carrotsearch.randomizedtesting.rules.StatementAdapter.evaluate(StatementAdapter.java:36)
at org.apache.lucene.util.TestRuleAssertionsRequired$1.evaluate(TestRuleAssertionsRequired.java:43)
at org.apache.lucene.util.TestRuleMarkFailure$1.evaluate(TestRuleMarkFailure.java:48)
at org.apache.lucene.util.TestRuleIgnoreAfterMaxFailures$1.evaluate(TestRuleIgnoreAfterMaxFailures.java:70)
at org.apache.lucene.util.TestRuleIgnoreTestSuites$1.evaluate(TestRuleIgnoreTestSuites.java:55)
at com.carrotsearch.randomizedtesting.rules.StatementAdapter.evaluate(StatementAdapter.java:36)
at com.carrotsearch.randomizedtesting.ThreadLeakControl$StatementRunner.run(ThreadLeakControl.java:358)
at java.lang.Thread.run(Thread.java:724)
FAILED: org.apache.solr.cloud.BasicDistributedZk2Test.testDistribSearch
Error Message:
Stack Trace:
java.lang.NullPointerException
at __randomizedtesting.SeedInfo.seed([ABE9F1CFCB4E5AA4:2A0F7FD7BC113A98]:0)
at org.apache.solr.common.cloud.ZkCoreNodeProps.getBaseUrl(ZkCoreNodeProps.java:40)
at org.apache.solr.client.solrj.impl.CloudSolrServer.buildUrlMap(CloudSolrServer.java:406)
at org.apache.solr.client.solrj.impl.CloudSolrServer.directUpdate(CloudSolrServer.java:304)
at org.apache.solr.client.solrj.impl.CloudSolrServer.request(CloudSolrServer.java:498)
at org.apache.solr.client.solrj.request.AbstractUpdateRequest.process(AbstractUpdateRequest.java:117)
at org.apache.solr.client.solrj.SolrServer.commit(SolrServer.java:168)
at org.apache.solr.client.solrj.SolrServer.commit(SolrServer.java:146)
at org.apache.solr.cloud.AbstractFullDistribZkTestBase.commit(AbstractFullDistribZkTestBase.java:1517)
at org.apache.solr.cloud.BasicDistributedZk2Test.brindDownShardIndexSomeDocsAndRecover(BasicDistributedZk2Test.java:288)
at org.apache.solr.cloud.BasicDistributedZk2Test.doTest(BasicDistributedZk2Test.java:115)
at org.apache.solr.BaseDistributedSearchTestCase.testDistribSearch(BaseDistributedSearchTestCase.java:835)
at sun.reflect.NativeMethodAccessorImpl.invoke0(Native Method)
at sun.reflect.NativeMethodAccessorImpl.invoke(NativeMethodAccessorImpl.java:57)
at sun.reflect.DelegatingMethodAccessorImpl.invoke(DelegatingMethodAccessorImpl.java:43)
at java.lang.reflect.Method.invoke(Method.java:606)
at com.carrotsearch.randomizedtesting.RandomizedRunner.invoke(RandomizedRunner.java:1559)
at com.carrotsearch.randomizedtesting.RandomizedRunner.access$600(RandomizedRunner.java:79)
at com.carrotsearch.randomizedtesting.RandomizedRunner$6.evaluate(RandomizedRunner.java:737)
at com.carrotsearch.randomizedtesting.RandomizedRunner$7.evaluate(RandomizedRunner.java:773)
at com.carrotsearch.randomizedtesting.RandomizedRunner$8.evaluate(RandomizedRunner.java:787)
at com.carrotsearch.randomizedtesting.rules.SystemPropertiesRestoreRule$1.evaluate(SystemPropertiesRestoreRule.java:53)
at org.apache.lucene.util.TestRuleSetupTeardownChained$1.evaluate(TestRuleSetupTeardownChained.java:50)
at org.apache.lucene.util.TestRuleFieldCacheSanity$1.evaluate(TestRuleFieldCacheSanity.java:51)
at org.apache.lucene.util.AbstractBeforeAfterRule$1.evaluate(AbstractBeforeAfterRule.java:46)
at com.carrotsearch.randomizedtesting.rules.SystemPropertiesInvariantRule$1.evaluate(SystemPropertiesInvariantRule.java:55)
at org.apache.lucene.util.TestRuleThreadAndTestName$1.evaluate(TestRuleThreadAndTestName.java:49)
at org.apache.lucene.util.TestRuleIgnoreAfterMaxFailures$1.evaluate(TestRuleIgnoreAfterMaxFailures.java:70)
at org.apache.lucene.util.TestRuleMarkFailure$1.evaluate(TestRuleMarkFailure.java:48)
at com.carrotsearch.randomizedtesting.rules.StatementAdapter.evaluate(StatementAdapter.java:36)
at com.carrotsearch.randomizedtesting.ThreadLeakControl$StatementRunner.run(ThreadLeakControl.java:358)
at com.carrotsearch.randomizedtesting.ThreadLeakControl.forkTimeoutingTask(ThreadLeakControl.java:782)
at com.carrotsearch.randomizedtesting.ThreadLeakControl$3.evaluate(ThreadLeakControl.java:442)
at com.carrotsearch.randomizedtesting.RandomizedRunner.runSingleTest(RandomizedRunner.java:746)
at com.carrotsearch.randomizedtesting.RandomizedRunner$3.evaluate(RandomizedRunner.java:648)
at com.carrotsearch.randomizedtesting.RandomizedRunner$4.evaluate(RandomizedRunner.java:682)
at com.carrotsearch.randomizedtesting.RandomizedRunner$5.evaluate(RandomizedRunner.java:693)
at com.carrotsearch.randomizedtesting.rules.StatementAdapter.evaluate(StatementAdapter.java:36)
at com.carrotsearch.randomizedtesting.rules.SystemPropertiesRestoreRule$1.evaluate(SystemPropertiesRestoreRule.java:53)
at org.apache.lucene.util.AbstractBeforeAfterRule$1.evaluate(AbstractBeforeAfterRule.java:46)
at org.apache.lucene.util.TestRuleStoreClassName$1.evaluate(TestRuleStoreClassName.java:42)
at com.carrotsearch.randomizedtesting.rules.SystemPropertiesInvariantRule$1.evaluate(SystemPropertiesInvariantRule.java:55)
at com.carrotsearch.randomizedtesting.rules.NoShadowingOrOverridesOnMethodsRule$1.evaluate(NoShadowingOrOverridesOnMethodsRule.java:39)
at com.carrotsearch.randomizedtesting.rules.NoShadowingOrOverridesOnMethodsRule$1.evaluate(NoShadowingOrOverridesOnMethodsRule.java:39)
at com.carrotsearch.randomizedtesting.rules.StatementAdapter.evaluate(StatementAdapter.java:36)
at org.apache.lucene.util.TestRuleAssertionsRequired$1.evaluate(TestRuleAssertionsRequired.java:43)
at org.apache.lucene.util.TestRuleMarkFailure$1.evaluate(TestRuleMarkFailure.java:48)
at org.apache.lucene.util.TestRuleIgnoreAfterMaxFailures$1.evaluate(TestRuleIgnoreAfterMaxFailures.java:70)
at org.apache.lucene.util.TestRuleIgnoreTestSuites$1.evaluate(TestRuleIgnoreTestSuites.java:55)
at com.carrotsearch.randomizedtesting.rules.StatementAdapter.evaluate(StatementAdapter.java:36)
at com.carrotsearch.randomizedtesting.ThreadLeakControl$StatementRunner.run(ThreadLeakControl.java:358)
at java.lang.Thread.run(Thread.java:724)
Build Log:
[...truncated 9646 lines...]
[junit4] Suite: org.apache.solr.cloud.SyncSliceTest
[junit4] 2> 287832 T581 oas.BaseDistributedSearchTestCase.initHostContext Setting hostContext system property: /
[junit4] 2> 287837 T581 oas.SolrTestCaseJ4.setUp ###Starting testDistribSearch
[junit4] 2> Creating dataDir: /usr/home/hudson/hudson-slave/workspace/Lucene-Solr-Tests-4.x-Java7/solr/build/solr-core/test/J0/./solrtest-SyncSliceTest-1379147515971
[junit4] 2> 287838 T581 oasc.ZkTestServer.run STARTING ZK TEST SERVER
[junit4] 2> 287839 T582 oasc.ZkTestServer$ZKServerMain.runFromConfig Starting server
[junit4] 2> 287940 T581 oasc.ZkTestServer.run start zk server on port:48399
[junit4] 2> 287941 T581 oascc.ConnectionManager.waitForConnected Waiting for client to connect to ZooKeeper
[junit4] 2> 287945 T588 oascc.ConnectionManager.process Watcher org.apache.solr.common.cloud.ConnectionManager@74e43fab name:ZooKeeperConnection Watcher:127.0.0.1:48399 got event WatchedEvent state:SyncConnected type:None path:null path:null type:None
[junit4] 2> 287945 T581 oascc.ConnectionManager.waitForConnected Client is connected to ZooKeeper
[junit4] 2> 287946 T581 oascc.SolrZkClient.makePath makePath: /solr
[junit4] 2> 287962 T581 oascc.ConnectionManager.waitForConnected Waiting for client to connect to ZooKeeper
[junit4] 2> 287964 T590 oascc.ConnectionManager.process Watcher org.apache.solr.common.cloud.ConnectionManager@498ddb04 name:ZooKeeperConnection Watcher:127.0.0.1:48399/solr got event WatchedEvent state:SyncConnected type:None path:null path:null type:None
[junit4] 2> 287964 T581 oascc.ConnectionManager.waitForConnected Client is connected to ZooKeeper
[junit4] 2> 287965 T581 oascc.SolrZkClient.makePath makePath: /collections/collection1
[junit4] 2> 287975 T581 oascc.SolrZkClient.makePath makePath: /collections/collection1/shards
[junit4] 2> 287978 T581 oascc.SolrZkClient.makePath makePath: /collections/control_collection
[junit4] 2> 287981 T581 oascc.SolrZkClient.makePath makePath: /collections/control_collection/shards
[junit4] 2> 287988 T581 oasc.AbstractZkTestCase.putConfig put /usr/home/hudson/hudson-slave/workspace/Lucene-Solr-Tests-4.x-Java7/solr/build/solr-core/test-files/solr/collection1/conf/solrconfig-tlog.xml to /configs/conf1/solrconfig.xml
[junit4] 2> 287989 T581 oascc.SolrZkClient.makePath makePath: /configs/conf1/solrconfig.xml
[junit4] 2> 288002 T581 oasc.AbstractZkTestCase.putConfig put /usr/home/hudson/hudson-slave/workspace/Lucene-Solr-Tests-4.x-Java7/solr/build/solr-core/test-files/solr/collection1/conf/schema.xml to /configs/conf1/schema.xml
[junit4] 2> 288002 T581 oascc.SolrZkClient.makePath makePath: /configs/conf1/schema.xml
[junit4] 2> 288107 T581 oasc.AbstractZkTestCase.putConfig put /usr/home/hudson/hudson-slave/workspace/Lucene-Solr-Tests-4.x-Java7/solr/build/solr-core/test-files/solr/collection1/conf/solrconfig.snippet.randomindexconfig.xml to /configs/conf1/solrconfig.snippet.randomindexconfig.xml
[junit4] 2> 288108 T581 oascc.SolrZkClient.makePath makePath: /configs/conf1/solrconfig.snippet.randomindexconfig.xml
[junit4] 2> 288111 T581 oasc.AbstractZkTestCase.putConfig put /usr/home/hudson/hudson-slave/workspace/Lucene-Solr-Tests-4.x-Java7/solr/build/solr-core/test-files/solr/collection1/conf/stopwords.txt to /configs/conf1/stopwords.txt
[junit4] 2> 288112 T581 oascc.SolrZkClient.makePath makePath: /configs/conf1/stopwords.txt
[junit4] 2> 288115 T581 oasc.AbstractZkTestCase.putConfig put /usr/home/hudson/hudson-slave/workspace/Lucene-Solr-Tests-4.x-Java7/solr/build/solr-core/test-files/solr/collection1/conf/protwords.txt to /configs/conf1/protwords.txt
[junit4] 2> 288116 T581 oascc.SolrZkClient.makePath makePath: /configs/conf1/protwords.txt
[junit4] 2> 288119 T581 oasc.AbstractZkTestCase.putConfig put /usr/home/hudson/hudson-slave/workspace/Lucene-Solr-Tests-4.x-Java7/solr/build/solr-core/test-files/solr/collection1/conf/currency.xml to /configs/conf1/currency.xml
[junit4] 2> 288120 T581 oascc.SolrZkClient.makePath makePath: /configs/conf1/currency.xml
[junit4] 2> 288123 T581 oasc.AbstractZkTestCase.putConfig put /usr/home/hudson/hudson-slave/workspace/Lucene-Solr-Tests-4.x-Java7/solr/build/solr-core/test-files/solr/collection1/conf/open-exchange-rates.json to /configs/conf1/open-exchange-rates.json
[junit4] 2> 288124 T581 oascc.SolrZkClient.makePath makePath: /configs/conf1/open-exchange-rates.json
[junit4] 2> 288127 T581 oasc.AbstractZkTestCase.putConfig put /usr/home/hudson/hudson-slave/workspace/Lucene-Solr-Tests-4.x-Java7/solr/build/solr-core/test-files/solr/collection1/conf/mapping-ISOLatin1Accent.txt to /configs/conf1/mapping-ISOLatin1Accent.txt
[junit4] 2> 288128 T581 oascc.SolrZkClient.makePath makePath: /configs/conf1/mapping-ISOLatin1Accent.txt
[junit4] 2> 288131 T581 oasc.AbstractZkTestCase.putConfig put /usr/home/hudson/hudson-slave/workspace/Lucene-Solr-Tests-4.x-Java7/solr/build/solr-core/test-files/solr/collection1/conf/old_synonyms.txt to /configs/conf1/old_synonyms.txt
[junit4] 2> 288131 T581 oascc.SolrZkClient.makePath makePath: /configs/conf1/old_synonyms.txt
[junit4] 2> 288139 T581 oasc.AbstractZkTestCase.putConfig put /usr/home/hudson/hudson-slave/workspace/Lucene-Solr-Tests-4.x-Java7/solr/build/solr-core/test-files/solr/collection1/conf/synonyms.txt to /configs/conf1/synonyms.txt
[junit4] 2> 288140 T581 oascc.SolrZkClient.makePath makePath: /configs/conf1/synonyms.txt
[junit4] 2> 288363 T581 oejs.Server.doStart jetty-8.1.10.v20130312
[junit4] 2> 288366 T581 oejs.AbstractConnector.doStart Started SocketConnector@127.0.0.1:15444
[junit4] 2> 288367 T581 oass.SolrDispatchFilter.init SolrDispatchFilter.init()
[junit4] 2> 288367 T581 oasc.SolrResourceLoader.locateSolrHome JNDI not configured for solr (NoInitialContextEx)
[junit4] 2> 288367 T581 oasc.SolrResourceLoader.locateSolrHome using system property solr.solr.home: ../../../../../../../../../../../usr/home/hudson/hudson-slave/workspace/Lucene-Solr-Tests-4.x-Java7/solr/build/solr-core/test/J0/./org.apache.solr.cloud.SyncSliceTest-controljetty-1379147516278
[junit4] 2> 288368 T581 oasc.SolrResourceLoader.<init> new SolrResourceLoader for directory: '../../../../../../../../../../../usr/home/hudson/hudson-slave/workspace/Lucene-Solr-Tests-4.x-Java7/solr/build/solr-core/test/J0/./org.apache.solr.cloud.SyncSliceTest-controljetty-1379147516278/'
[junit4] 2> 288397 T581 oasc.ConfigSolr.fromFile Loading container configuration from /usr/home/hudson/hudson-slave/workspace/Lucene-Solr-Tests-4.x-Java7/solr/build/solr-core/test/J0/../../../../../../../../../../../usr/home/hudson/hudson-slave/workspace/Lucene-Solr-Tests-4.x-Java7/solr/build/solr-core/test/J0/./org.apache.solr.cloud.SyncSliceTest-controljetty-1379147516278/solr.xml
[junit4] 2> 288466 T581 oasc.CoreContainer.<init> New CoreContainer 334778306
[junit4] 2> 288467 T581 oasc.CoreContainer.load Loading cores into CoreContainer [instanceDir=../../../../../../../../../../../usr/home/hudson/hudson-slave/workspace/Lucene-Solr-Tests-4.x-Java7/solr/build/solr-core/test/J0/./org.apache.solr.cloud.SyncSliceTest-controljetty-1379147516278/]
[junit4] 2> 288469 T581 oashc.HttpShardHandlerFactory.getParameter Setting socketTimeout to: 120000
[junit4] 2> 288469 T581 oashc.HttpShardHandlerFactory.getParameter Setting urlScheme to: http://
[junit4] 2> 288469 T581 oashc.HttpShardHandlerFactory.getParameter Setting connTimeout to: 15000
[junit4] 2> 288470 T581 oashc.HttpShardHandlerFactory.getParameter Setting maxConnectionsPerHost to: 20
[junit4] 2> 288470 T581 oashc.HttpShardHandlerFactory.getParameter Setting corePoolSize to: 0
[junit4] 2> 288470 T581 oashc.HttpShardHandlerFactory.getParameter Setting maximumPoolSize to: 2147483647
[junit4] 2> 288471 T581 oashc.HttpShardHandlerFactory.getParameter Setting maxThreadIdleTime to: 5
[junit4] 2> 288471 T581 oashc.HttpShardHandlerFactory.getParameter Setting sizeOfQueue to: -1
[junit4] 2> 288471 T581 oashc.HttpShardHandlerFactory.getParameter Setting fairnessPolicy to: false
[junit4] 2> 288472 T581 oascsi.HttpClientUtil.createClient Creating new http client, config:maxConnectionsPerHost=20&maxConnections=10000&socketTimeout=120000&connTimeout=15000&retry=false
[junit4] 2> 288485 T581 oasl.LogWatcher.createWatcher SLF4J impl is org.slf4j.impl.Log4jLoggerFactory
[junit4] 2> 288485 T581 oasl.LogWatcher.newRegisteredLogWatcher Registering Log Listener [Log4j (org.slf4j.impl.Log4jLoggerFactory)]
[junit4] 2> 288486 T581 oasc.ZkContainer.initZooKeeper Zookeeper client=127.0.0.1:48399/solr
[junit4] 2> 288486 T581 oasc.ZkController.checkChrootPath zkHost includes chroot
[junit4] 2> 288487 T581 oascc.ConnectionManager.waitForConnected Waiting for client to connect to ZooKeeper
[junit4] 2> 288490 T601 oascc.ConnectionManager.process Watcher org.apache.solr.common.cloud.ConnectionManager@1b231b56 name:ZooKeeperConnection Watcher:127.0.0.1:48399 got event WatchedEvent state:SyncConnected type:None path:null path:null type:None
[junit4] 2> 288490 T581 oascc.ConnectionManager.waitForConnected Client is connected to ZooKeeper
[junit4] 2> 288502 T581 oascsi.HttpClientUtil.createClient Creating new http client, config:maxConnections=500&maxConnectionsPerHost=16&socketTimeout=120000&connTimeout=15000
[junit4] 2> 288511 T581 oascc.ConnectionManager.waitForConnected Waiting for client to connect to ZooKeeper
[junit4] 2> 288513 T603 oascc.ConnectionManager.process Watcher org.apache.solr.common.cloud.ConnectionManager@4edf85e9 name:ZooKeeperConnection Watcher:127.0.0.1:48399/solr got event WatchedEvent state:SyncConnected type:None path:null path:null type:None
[junit4] 2> 288513 T581 oascc.ConnectionManager.waitForConnected Client is connected to ZooKeeper
[junit4] 2> 288515 T581 oascc.SolrZkClient.makePath makePath: /overseer/queue
[junit4] 2> 288525 T581 oascc.SolrZkClient.makePath makePath: /overseer/collection-queue-work
[junit4] 2> 288532 T581 oascc.SolrZkClient.makePath makePath: /live_nodes
[junit4] 2> 288535 T581 oasc.ZkController.createEphemeralLiveNode Register node as live in ZooKeeper:/live_nodes/127.0.0.1:15444_
[junit4] 2> 288536 T581 oascc.SolrZkClient.makePath makePath: /live_nodes/127.0.0.1:15444_
[junit4] 2> 288546 T581 oascc.SolrZkClient.makePath makePath: /overseer_elect/election
[junit4] 2> 288558 T581 oascc.SolrZkClient.makePath makePath: /overseer_elect/leader
[junit4] 2> 288566 T581 oasc.Overseer.start Overseer (id=90383811607003139-127.0.0.1:15444_-n_0000000000) starting
[junit4] 2> 288575 T581 oascc.SolrZkClient.makePath makePath: /overseer/queue-work
[junit4] 2> 288586 T605 oasc.OverseerCollectionProcessor.run Process current queue of collection creations
[junit4] 2> 288587 T581 oascc.SolrZkClient.makePath makePath: /clusterstate.json
[junit4] 2> 288589 T581 oascc.SolrZkClient.makePath makePath: /aliases.json
[junit4] 2> 288591 T581 oascc.ZkStateReader.createClusterStateWatchersAndUpdate Updating cluster state from ZooKeeper...
[junit4] 2> 288593 T604 oasc.Overseer$ClusterStateUpdater.run Starting to work on the main queue
[junit4] 2> 288597 T606 oasc.ZkController.publish publishing core=collection1 state=down
[junit4] 2> 288597 T606 oasc.ZkController.publish numShards not found on descriptor - reading it from system property
[junit4] 2> 288599 T606 oasc.ZkController.waitForCoreNodeName look for our core node name
[junit4] 2> 290097 T604 oascc.ZkStateReader.updateClusterState Updating cloud state from ZooKeeper...
[junit4] 2> 290098 T604 oasc.Overseer$ClusterStateUpdater.updateState Update state numShards=1 message={
[junit4] 2> "operation":"state",
[junit4] 2> "core_node_name":"core_node1",
[junit4] 2> "numShards":"1",
[junit4] 2> "shard":null,
[junit4] 2> "roles":null,
[junit4] 2> "state":"down",
[junit4] 2> "shard_state":"active",
[junit4] 2> "core":"collection1",
[junit4] 2> "collection":"control_collection",
[junit4] 2> "shard_range":null,
[junit4] 2> "node_name":"127.0.0.1:15444_",
[junit4] 2> "base_url":"http://127.0.0.1:15444"}
[junit4] 2> 290099 T604 oasc.Overseer$ClusterStateUpdater.createCollection Create collection control_collection with shards [shard1]
[junit4] 2> 290114 T604 oasc.Overseer$ClusterStateUpdater.updateState Assigning new node to shard shard=shard1
[junit4] 2> 290151 T603 oascc.ZkStateReader$2.process A cluster state change: WatchedEvent state:SyncConnected type:NodeDataChanged path:/clusterstate.json, has occurred - updating... (live nodes size: 1)
[junit4] 2> 290601 T606 oasc.ZkController.waitForShardId waiting to find shard id in clusterstate for collection1
[junit4] 2> 290601 T606 oasc.CoreContainer.create Creating SolrCore 'collection1' using instanceDir: ../../../../../../../../../../../usr/home/hudson/hudson-slave/workspace/Lucene-Solr-Tests-4.x-Java7/solr/build/solr-core/test/J0/./org.apache.solr.cloud.SyncSliceTest-controljetty-1379147516278/collection1
[junit4] 2> 290601 T606 oasc.ZkController.createCollectionZkNode Check for collection zkNode:control_collection
[junit4] 2> 290603 T606 oasc.ZkController.createCollectionZkNode Collection zkNode exists
[junit4] 2> 290603 T606 oasc.ZkController.readConfigName Load collection config from:/collections/control_collection
[junit4] 2> 290604 T606 oasc.SolrResourceLoader.<init> new SolrResourceLoader for directory: '../../../../../../../../../../../usr/home/hudson/hudson-slave/workspace/Lucene-Solr-Tests-4.x-Java7/solr/build/solr-core/test/J0/./org.apache.solr.cloud.SyncSliceTest-controljetty-1379147516278/collection1/'
[junit4] 2> 290606 T606 oasc.SolrResourceLoader.replaceClassLoader Adding 'file:/usr/home/hudson/hudson-slave/workspace/Lucene-Solr-Tests-4.x-Java7/solr/build/solr-core/test/J0/org.apache.solr.cloud.SyncSliceTest-controljetty-1379147516278/collection1/lib/README' to classloader
[junit4] 2> 290607 T606 oasc.SolrResourceLoader.replaceClassLoader Adding 'file:/usr/home/hudson/hudson-slave/workspace/Lucene-Solr-Tests-4.x-Java7/solr/build/solr-core/test/J0/org.apache.solr.cloud.SyncSliceTest-controljetty-1379147516278/collection1/lib/classes/' to classloader
[junit4] 2> 290680 T606 oasc.SolrConfig.<init> Using Lucene MatchVersion: LUCENE_46
[junit4] 2> 290751 T606 oasc.SolrConfig.<init> Loaded SolrConfig: solrconfig.xml
[junit4] 2> 290853 T606 oass.IndexSchema.readSchema Reading Solr Schema from schema.xml
[junit4] 2> 290867 T606 oass.IndexSchema.readSchema [null] Schema name=test
[junit4] 2> 291583 T606 oass.ByteField.init WARN ByteField is deprecated and will be removed in 5.0. You should use TrieIntField instead.
[junit4] 2> 291584 T606 oass.ShortField.init WARN ShortField is deprecated and will be removed in 5.0. You should use TrieIntField instead.
[junit4] 2> 291585 T606 oass.OpenExchangeRatesOrgProvider.init Initialized with rates=open-exchange-rates.json, refreshInterval=1440.
[junit4] 2> 291600 T606 oass.IndexSchema.readSchema default search field in schema is text
[junit4] 2> 291604 T606 oass.IndexSchema.readSchema unique key field: id
[junit4] 2> 291623 T606 oass.FileExchangeRateProvider.reload Reloading exchange rates from file currency.xml
[junit4] 2> 291629 T606 oass.FileExchangeRateProvider.reload Reloading exchange rates from file currency.xml
[junit4] 2> 291634 T606 oass.OpenExchangeRatesOrgProvider.reload Reloading exchange rates from open-exchange-rates.json
[junit4] 2> 291635 T606 oass.OpenExchangeRatesOrgProvider$OpenExchangeRates.<init> WARN Unknown key IMPORTANT NOTE
[junit4] 2> 291636 T606 oass.OpenExchangeRatesOrgProvider$OpenExchangeRates.<init> WARN Expected key, got STRING
[junit4] 2> 291636 T606 oass.OpenExchangeRatesOrgProvider.reload Reloading exchange rates from open-exchange-rates.json
[junit4] 2> 291637 T606 oass.OpenExchangeRatesOrgProvider$OpenExchangeRates.<init> WARN Unknown key IMPORTANT NOTE
[junit4] 2> 291637 T606 oass.OpenExchangeRatesOrgProvider$OpenExchangeRates.<init> WARN Expected key, got STRING
[junit4] 2> 291638 T606 oasc.SolrCore.initDirectoryFactory org.apache.solr.core.MockDirectoryFactory
[junit4] 2> 291638 T606 oasc.SolrCore.<init> [collection1] Opening new SolrCore at ../../../../../../../../../../../usr/home/hudson/hudson-slave/workspace/Lucene-Solr-Tests-4.x-Java7/solr/build/solr-core/test/J0/./org.apache.solr.cloud.SyncSliceTest-controljetty-1379147516278/collection1/, dataDir=./org.apache.solr.cloud.SyncSliceTest-1379147515970/control/data/
[junit4] 2> 291639 T606 oasc.JmxMonitoredMap.<init> JMX monitoring is enabled. Adding Solr mbeans to JMX Server: com.sun.jmx.mbeanserver.JmxMBeanServer@55088a5f
[junit4] 2> 291640 T606 oasc.CachingDirectoryFactory.get return new directory for ./org.apache.solr.cloud.SyncSliceTest-1379147515970/control/data
[junit4] 2> 291640 T606 oasc.SolrCore.getNewIndexDir New index directory detected: old=null new=./org.apache.solr.cloud.SyncSliceTest-1379147515970/control/data/index/
[junit4] 2> 291640 T606 oasc.SolrCore.initIndex WARN [collection1] Solr index directory './org.apache.solr.cloud.SyncSliceTest-1379147515970/control/data/index' doesn't exist. Creating new index...
[junit4] 2> 291641 T606 oasc.CachingDirectoryFactory.get return new directory for ./org.apache.solr.cloud.SyncSliceTest-1379147515970/control/data/index
[junit4] 2> 291641 T606 oasu.RandomMergePolicy.<init> RandomMergePolicy wrapping class org.apache.lucene.index.TieredMergePolicy: [TieredMergePolicy: maxMergeAtOnce=13, maxMergeAtOnceExplicit=38, maxMergedSegmentMB=35.0029296875, floorSegmentMB=1.01171875, forceMergeDeletesPctAllowed=14.693232198061866, segmentsPerTier=15.0, maxCFSSegmentSizeMB=8.796093022207999E12, noCFSRatio=1.0
[junit4] 2> 291642 T606 oasc.SolrDeletionPolicy.onCommit SolrDeletionPolicy.onCommit: commits: num=1
[junit4] 2> commit{dir=MockDirectoryWrapper(org.apache.lucene.store.RAMDirectory@69fb34e9 lockFactory=org.apache.lucene.store.SingleInstanceLockFactory@201fe173),segFN=segments_1,generation=1}
[junit4] 2> 291642 T606 oasc.SolrDeletionPolicy.updateCommits newest commit generation = 1
[junit4] 2> 291646 T606 oasup.UpdateRequestProcessorChain.init creating updateRequestProcessorChain "nodistrib"
[junit4] 2> 291647 T606 oasup.UpdateRequestProcessorChain.init creating updateRequestProcessorChain "dedupe"
[junit4] 2> 291647 T606 oasup.UpdateRequestProcessorChain.init inserting DistributedUpdateProcessorFactory into updateRequestProcessorChain "dedupe"
[junit4] 2> 291647 T606 oasup.UpdateRequestProcessorChain.init creating updateRequestProcessorChain "stored_sig"
[junit4] 2> 291648 T606 oasup.UpdateRequestProcessorChain.init inserting DistributedUpdateProcessorFactory into updateRequestProcessorChain "stored_sig"
[junit4] 2> 291648 T606 oasup.UpdateRequestProcessorChain.init creating updateRequestProcessorChain "distrib-dup-test-chain-explicit"
[junit4] 2> 291649 T606 oasup.UpdateRequestProcessorChain.init creating updateRequestProcessorChain "distrib-dup-test-chain-implicit"
[junit4] 2> 291649 T606 oasup.UpdateRequestProcessorChain.init inserting DistributedUpdateProcessorFactory into updateRequestProcessorChain "distrib-dup-test-chain-implicit"
[junit4] 2> 291649 T606 oasc.SolrCore.loadUpdateProcessorChains no updateRequestProcessorChain defined as default, creating implicit default
[junit4] 2> 291650 T606 oasc.RequestHandlers.initHandlersFromConfig created standard: solr.StandardRequestHandler
[junit4] 2> 291650 T606 oasc.RequestHandlers.initHandlersFromConfig created /get: solr.RealTimeGetHandler
[junit4] 2> 291651 T606 oasc.RequestHandlers.initHandlersFromConfig adding lazy requestHandler: solr.ReplicationHandler
[junit4] 2> 291651 T606 oasc.RequestHandlers.initHandlersFromConfig created /replication: solr.ReplicationHandler
[junit4] 2> 291652 T606 oasc.RequestHandlers.initHandlersFromConfig created /update: solr.UpdateRequestHandler
[junit4] 2> 291652 T606 oasc.RequestHandlers.initHandlersFromConfig created /admin/: org.apache.solr.handler.admin.AdminHandlers
[junit4] 2> 291672 T606 oashl.XMLLoader.init xsltCacheLifetimeSeconds=60
[junit4] 2> 291679 T606 oasu.CommitTracker.<init> Hard AutoCommit: disabled
[junit4] 2> 291679 T606 oasu.CommitTracker.<init> Soft AutoCommit: disabled
[junit4] 2> 291680 T606 oasu.RandomMergePolicy.<init> RandomMergePolicy wrapping class org.apache.lucene.index.TieredMergePolicy: [TieredMergePolicy: maxMergeAtOnce=25, maxMergeAtOnceExplicit=34, maxMergedSegmentMB=86.6728515625, floorSegmentMB=0.8720703125, forceMergeDeletesPctAllowed=15.856030406949497, segmentsPerTier=13.0, maxCFSSegmentSizeMB=8.796093022207999E12, noCFSRatio=0.0
[junit4] 2> 291681 T606 oasc.SolrDeletionPolicy.onInit SolrDeletionPolicy.onInit: commits: num=1
[junit4] 2> commit{dir=MockDirectoryWrapper(org.apache.lucene.store.RAMDirectory@69fb34e9 lockFactory=org.apache.lucene.store.SingleInstanceLockFactory@201fe173),segFN=segments_1,generation=1}
[junit4] 2> 291681 T606 oasc.SolrDeletionPolicy.updateCommits newest commit generation = 1
[junit4] 2> 291682 T606 oass.SolrIndexSearcher.<init> Opening Searcher@27cf7abb main
[junit4] 2> 291685 T607 oasc.SolrCore.registerSearcher [collection1] Registered new searcher Searcher@27cf7abb main{StandardDirectoryReader(segments_1:1:nrt)}
[junit4] 2> 291687 T606 oasc.CoreContainer.registerCore registering core: collection1
[junit4] 2> 291687 T606 oasc.ZkController.register Register replica - core:collection1 address:http://127.0.0.1:15444 collection:control_collection shard:shard1
[junit4] 2> 291688 T606 oascsi.HttpClientUtil.createClient Creating new http client, config:maxConnections=10000&maxConnectionsPerHost=20&connTimeout=15000&socketTimeout=30000&retry=false
[junit4] 2> 291699 T606 oascc.SolrZkClient.makePath makePath: /collections/control_collection/leader_elect/shard1/election
[junit4] 2> 291720 T606 oasc.ShardLeaderElectionContext.runLeaderProcess Running the leader process for shard shard1
[junit4] 2> 291731 T606 oasc.ShardLeaderElectionContext.waitForReplicasToComeUp Enough replicas found to continue.
[junit4] 2> 291731 T606 oasc.ShardLeaderElectionContext.runLeaderProcess I may be the new leader - try and sync
[junit4] 2> 291731 T606 oasc.SyncStrategy.sync Sync replicas to http://127.0.0.1:15444/collection1/
[junit4] 2> 291732 T606 oasc.SyncStrategy.syncReplicas Sync Success - now sync replicas to me
[junit4] 2> 291732 T606 oasc.SyncStrategy.syncToMe http://127.0.0.1:15444/collection1/ has no replicas
[junit4] 2> 291732 T606 oasc.ShardLeaderElectionContext.runLeaderProcess I am the new leader: http://127.0.0.1:15444/collection1/ shard1
[junit4] 2> 291732 T606 oascc.SolrZkClient.makePath makePath: /collections/control_collection/leaders/shard1
[junit4] 2> 293158 T604 oascc.ZkStateReader.updateClusterState Updating cloud state from ZooKeeper...
[junit4] 2> 293177 T603 oascc.ZkStateReader$2.process A cluster state change: WatchedEvent state:SyncConnected type:NodeDataChanged path:/clusterstate.json, has occurred - updating... (live nodes size: 1)
[junit4] 2> 293226 T606 oasc.ZkController.register We are http://127.0.0.1:15444/collection1/ and leader is http://127.0.0.1:15444/collection1/
[junit4] 2> 293226 T606 oasc.ZkController.register No LogReplay needed for core=collection1 baseURL=http://127.0.0.1:15444
[junit4] 2> 293226 T606 oasc.ZkController.checkRecovery I am the leader, no recovery necessary
[junit4] 2> 293226 T606 oasc.ZkController.publish publishing core=collection1 state=active
[junit4] 2> 293227 T606 oasc.ZkController.publish numShards not found on descriptor - reading it from system property
[junit4] 2> 293229 T606 oascc.ZkStateReader.updateClusterState Updating cloud state from ZooKeeper...
[junit4] 2> 293230 T581 oass.SolrDispatchFilter.init user.dir=/usr/home/hudson/hudson-slave/workspace/Lucene-Solr-Tests-4.x-Java7/solr/build/solr-core/test/J0
[junit4] 2> 293230 T581 oass.SolrDispatchFilter.init SolrDispatchFilter.init() done
[junit4] 2> 293231 T581 oascsi.HttpClientUtil.createClient Creating new http client, config:maxConnections=128&maxConnectionsPerHost=32&followRedirects=false
[junit4] 2> 293251 T581 oascsi.HttpClientUtil.createClient Creating new http client, config:
[junit4] 2> 293258 T581 oascc.ConnectionManager.waitForConnected Waiting for client to connect to ZooKeeper
[junit4] 2> 293260 T610 oascc.ConnectionManager.process Watcher org.apache.solr.common.cloud.ConnectionManager@6825aff6 name:ZooKeeperConnection Watcher:127.0.0.1:48399/solr got event WatchedEvent state:SyncConnected type:None path:null path:null type:None
[junit4] 2> 293260 T581 oascc.ConnectionManager.waitForConnected Client is connected to ZooKeeper
[junit4] 2> 293262 T581 oascc.ZkStateReader.createClusterStateWatchersAndUpdate Updating cluster state from ZooKeeper...
[junit4] 2> 293266 T581 oasc.ChaosMonkey.monkeyLog monkey: init - expire sessions:true cause connection loss:true
[junit4] 2> 293481 T581 oejs.Server.doStart jetty-8.1.10.v20130312
[junit4] 2> 293484 T581 oejs.AbstractConnector.doStart Started SocketConnector@127.0.0.1:19156
[junit4] 2> 293484 T581 oass.SolrDispatchFilter.init SolrDispatchFilter.init()
[junit4] 2> 293485 T581 oasc.SolrResourceLoader.locateSolrHome JNDI not configured for solr (NoInitialContextEx)
[junit4] 2> 293485 T581 oasc.SolrResourceLoader.locateSolrHome using system property solr.solr.home: ./org.apache.solr.cloud.SyncSliceTest-jetty1-1379147521399
[junit4] 2> 293485 T581 oasc.SolrResourceLoader.<init> new SolrResourceLoader for directory: './org.apache.solr.cloud.SyncSliceTest-jetty1-1379147521399/'
[junit4] 2> 293514 T581 oasc.ConfigSolr.fromFile Loading container configuration from /usr/home/hudson/hudson-slave/workspace/Lucene-Solr-Tests-4.x-Java7/solr/build/solr-core/test/J0/./org.apache.solr.cloud.SyncSliceTest-jetty1-1379147521399/solr.xml
[junit4] 2> 293584 T581 oasc.CoreContainer.<init> New CoreContainer 451963269
[junit4] 2> 293585 T581 oasc.CoreContainer.load Loading cores into CoreContainer [instanceDir=./org.apache.solr.cloud.SyncSliceTest-jetty1-1379147521399/]
[junit4] 2> 293586 T581 oashc.HttpShardHandlerFactory.getParameter Setting socketTimeout to: 120000
[junit4] 2> 293586 T581 oashc.HttpShardHandlerFactory.getParameter Setting urlScheme to: http://
[junit4] 2> 293587 T581 oashc.HttpShardHandlerFactory.getParameter Setting connTimeout to: 15000
[junit4] 2> 293587 T581 oashc.HttpShardHandlerFactory.getParameter Setting maxConnectionsPerHost to: 20
[junit4] 2> 293587 T581 oashc.HttpShardHandlerFactory.getParameter Setting corePoolSize to: 0
[junit4] 2> 293588 T581 oashc.HttpShardHandlerFactory.getParameter Setting maximumPoolSize to: 2147483647
[junit4] 2> 293588 T581 oashc.HttpShardHandlerFactory.getParameter Setting maxThreadIdleTime to: 5
[junit4] 2> 293588 T581 oashc.HttpShardHandlerFactory.getParameter Setting sizeOfQueue to: -1
[junit4] 2> 293589 T581 oashc.HttpShardHandlerFactory.getParameter Setting fairnessPolicy to: false
[junit4] 2> 293589 T581 oascsi.HttpClientUtil.createClient Creating new http client, config:maxConnectionsPerHost=20&maxConnections=10000&socketTimeout=120000&connTimeout=15000&retry=false
[junit4] 2> 293601 T581 oasl.LogWatcher.createWatcher SLF4J impl is org.slf4j.impl.Log4jLoggerFactory
[junit4] 2> 293601 T581 oasl.LogWatcher.newRegisteredLogWatcher Registering Log Listener [Log4j (org.slf4j.impl.Log4jLoggerFactory)]
[junit4] 2> 293602 T581 oasc.ZkContainer.initZooKeeper Zookeeper client=127.0.0.1:48399/solr
[junit4] 2> 293602 T581 oasc.ZkController.checkChrootPath zkHost includes chroot
[junit4] 2> 293603 T581 oascc.ConnectionManager.waitForConnected Waiting for client to connect to ZooKeeper
[junit4] 2> 293605 T621 oascc.ConnectionManager.process Watcher org.apache.solr.common.cloud.ConnectionManager@3f1cc4f8 name:ZooKeeperConnection Watcher:127.0.0.1:48399 got event WatchedEvent state:SyncConnected type:None path:null path:null type:None
[junit4] 2> 293606 T581 oascc.ConnectionManager.waitForConnected Client is connected to ZooKeeper
[junit4] 2> 293620 T581 oascsi.HttpClientUtil.createClient Creating new http client, config:maxConnections=500&maxConnectionsPerHost=16&socketTimeout=120000&connTimeout=15000
[junit4] 2> 293628 T581 oascc.ConnectionManager.waitForConnected Waiting for client to connect to ZooKeeper
[junit4] 2> 293630 T623 oascc.ConnectionManager.process Watcher org.apache.solr.common.cloud.ConnectionManager@b8c5ad6 name:ZooKeeperConnection Watcher:127.0.0.1:48399/solr got event WatchedEvent state:SyncConnected type:None path:null path:null type:None
[junit4] 2> 293630 T581 oascc.ConnectionManager.waitForConnected Client is connected to ZooKeeper
[junit4] 2> 293640 T581 oascc.ZkStateReader.createClusterStateWatchersAndUpdate Updating cluster state from ZooKeeper...
[junit4] 2> 294644 T581 oasc.ZkController.createEphemeralLiveNode Register node as live in ZooKeeper:/live_nodes/127.0.0.1:19156_
[junit4] 2> 294646 T581 oascc.SolrZkClient.makePath makePath: /live_nodes/127.0.0.1:19156_
[junit4] 2> 294665 T603 oascc.ZkStateReader$2.process A cluster state change: WatchedEvent state:SyncConnected type:NodeChildrenChanged path:/live_nodes, has occurred - updating... (live nodes size: 1)
[junit4] 2> 294666 T610 oascc.ZkStateReader$3.process Updating live nodes... (2)
[junit4] 2> 294666 T623 oascc.ZkStateReader$3.process Updating live nodes... (2)
[junit4] 2> 294667 T603 oascc.ZkStateReader$3.process Updating live nodes... (2)
[junit4] 2> 294674 T624 oasc.ZkController.publish publishing core=collection1 state=down
[junit4] 2> 294675 T624 oasc.ZkController.publish numShards not found on descriptor - reading it from system property
[junit4] 2> 294676 T624 oasc.ZkController.waitForCoreNodeName look for our core node name
[junit4] 2> 294689 T604 oascc.ZkStateReader.updateClusterState Updating cloud state from ZooKeeper...
[junit4] 2> 294689 T604 oasc.Overseer$ClusterStateUpdater.updateState Update state numShards=1 message={
[junit4] 2> "operation":"state",
[junit4] 2> "core_node_name":"core_node1",
[junit4] 2> "numShards":"1",
[junit4] 2> "shard":"shard1",
[junit4] 2> "roles":null,
[junit4] 2> "state":"active",
[junit4] 2> "shard_state":"active",
[junit4] 2> "core":"collection1",
[junit4] 2> "collection":"control_collection",
[junit4] 2> "shard_range":null,
[junit4] 2> "node_name":"127.0.0.1:15444_",
[junit4] 2> "base_url":"http://127.0.0.1:15444"}
[junit4] 2> 294693 T604 oasc.Overseer$ClusterStateUpdater.updateState Update state numShards=1 message={
[junit4] 2> "operation":"state",
[junit4] 2> "core_node_name":"core_node1",
[junit4] 2> "numShards":"1",
[junit4] 2> "shard":null,
[junit4] 2> "roles":null,
[junit4] 2> "state":"down",
[junit4] 2> "shard_state":"active",
[junit4] 2> "core":"collection1",
[junit4] 2> "collection":"collection1",
[junit4] 2> "shard_range":null,
[junit4] 2> "node_name":"127.0.0.1:19156_",
[junit4] 2> "base_url":"http://127.0.0.1:19156"}
[junit4] 2> 294694 T604 oasc.Overseer$ClusterStateUpdater.createCollection Create collection collection1 with shards [shard1]
[junit4] 2> 294694 T604 oasc.Overseer$ClusterStateUpdater.updateState Assigning new node to shard shard=shard1
[junit4] 2> 294705 T623 oascc.ZkStateReader$2.process A cluster state change: WatchedEvent state:SyncConnected type:NodeDataChanged path:/clusterstate.json, has occurred - updating... (live nodes size: 2)
[junit4] 2> 294705 T610 oascc.ZkStateReader$2.process A cluster state change: WatchedEvent state:SyncConnected type:NodeDataChanged path:/clusterstate.json, has occurred - updating... (live nodes size: 2)
[junit4] 2> 294705 T603 oascc.ZkStateReader$2.process A cluster state change: WatchedEvent state:SyncConnected type:NodeDataChanged path:/clusterstate.json, has occurred - updating... (live nodes size: 2)
[junit4] 2> 295677 T624 oasc.ZkController.waitForShardId waiting to find shard id in clusterstate for collection1
[junit4] 2> 295677 T624 oasc.CoreContainer.create Creating SolrCore 'collection1' using instanceDir: ./org.apache.solr.cloud.SyncSliceTest-jetty1-1379147521399/collection1
[junit4] 2> 295677 T624 oasc.ZkController.createCollectionZkNode Check for collection zkNode:collection1
[junit4] 2> 295679 T624 oasc.ZkController.createCollectionZkNode Collection zkNode exists
[junit4] 2> 295679 T624 oasc.ZkController.readConfigName Load collection config from:/collections/collection1
[junit4] 2> 295680 T624 oasc.SolrResourceLoader.<init> new SolrResourceLoader for directory: './org.apache.solr.cloud.SyncSliceTest-jetty1-1379147521399/collection1/'
[junit4] 2> 295682 T624 oasc.SolrResourceLoader.replaceClassLoader Adding 'file:/usr/home/hudson/hudson-slave/workspace/Lucene-Solr-Tests-4.x-Java7/solr/build/solr-core/test/J0/org.apache.solr.cloud.SyncSliceTest-jetty1-1379147521399/collection1/lib/classes/' to classloader
[junit4] 2> 295683 T624 oasc.SolrResourceLoader.replaceClassLoader Adding 'file:/usr/home/hudson/hudson-slave/workspace/Lucene-Solr-Tests-4.x-Java7/solr/build/solr-core/test/J0/org.apache.solr.cloud.SyncSliceTest-jetty1-1379147521399/collection1/lib/README' to classloader
[junit4] 2> 295759 T624 oasc.SolrConfig.<init> Using Lucene MatchVersion: LUCENE_46
[junit4] 2> 295833 T624 oasc.SolrConfig.<init> Loaded SolrConfig: solrconfig.xml
[junit4] 2> 295934 T624 oass.IndexSchema.readSchema Reading Solr Schema from schema.xml
[junit4] 2> 295948 T624 oass.IndexSchema.readSchema [null] Schema name=test
[junit4] 2> 296647 T624 oass.ByteField.init WARN ByteField is deprecated and will be removed in 5.0. You should use TrieIntField instead.
[junit4] 2> 296649 T624 oass.ShortField.init WARN ShortField is deprecated and will be removed in 5.0. You should use TrieIntField instead.
[junit4] 2> 296650 T624 oass.OpenExchangeRatesOrgProvider.init Initialized with rates=open-exchange-rates.json, refreshInterval=1440.
[junit4] 2> 296665 T624 oass.IndexSchema.readSchema default search field in schema is text
[junit4] 2> 296670 T624 oass.IndexSchema.readSchema unique key field: id
[junit4] 2> 296689 T624 oass.FileExchangeRateProvider.reload Reloading exchange rates from file currency.xml
[junit4] 2> 296694 T624 oass.FileExchangeRateProvider.reload Reloading exchange rates from file currency.xml
[junit4] 2> 296699 T624 oass.OpenExchangeRatesOrgProvider.reload Reloading exchange rates from open-exchange-rates.json
[junit4] 2> 296700 T624 oass.OpenExchangeRatesOrgProvider$OpenExchangeRates.<init> WARN Unknown key IMPORTANT NOTE
[junit4] 2> 296700 T624 oass.OpenExchangeRatesOrgProvider$OpenExchangeRates.<init> WARN Expected key, got STRING
[junit4] 2> 296701 T624 oass.OpenExchangeRatesOrgProvider.reload Reloading exchange rates from open-exchange-rates.json
[junit4] 2> 296702 T624 oass.OpenExchangeRatesOrgProvider$OpenExchangeRates.<init> WARN Unknown key IMPORTANT NOTE
[junit4] 2> 296702 T624 oass.OpenExchangeRatesOrgProvider$OpenExchangeRates.<init> WARN Expected key, got STRING
[junit4] 2> 296703 T624 oasc.SolrCore.initDirectoryFactory org.apache.solr.core.MockDirectoryFactory
[junit4] 2> 296703 T624 oasc.SolrCore.<init> [collection1] Opening new SolrCore at ./org.apache.solr.cloud.SyncSliceTest-jetty1-1379147521399/collection1/, dataDir=./org.apache.solr.cloud.SyncSliceTest-1379147515970/jetty1/
[junit4] 2> 296703 T624 oasc.JmxMonitoredMap.<init> JMX monitoring is enabled. Adding Solr mbeans to JMX Server: com.sun.jmx.mbeanserver.JmxMBeanServer@55088a5f
[junit4] 2> 296704 T624 oasc.CachingDirectoryFactory.get return new directory for ./org.apache.solr.cloud.SyncSliceTest-1379147515970/jetty1
[junit4] 2> 296705 T624 oasc.SolrCore.getNewIndexDir New index directory detected: old=null new=./org.apache.solr.cloud.SyncSliceTest-1379147515970/jetty1/index/
[junit4] 2> 296705 T624 oasc.SolrCore.initIndex WARN [collection1] Solr index directory './org.apache.solr.cloud.SyncSliceTest-1379147515970/jetty1/index' doesn't exist. Creating new index...
[junit4] 2> 296705 T624 oasc.CachingDirectoryFactory.get return new directory for ./org.apache.solr.cloud.SyncSliceTest-1379147515970/jetty1/index
[junit4] 2> 296706 T624 oasu.RandomMergePolicy.<init> RandomMergePolicy wrapping class org.apache.lucene.index.TieredMergePolicy: [TieredMergePolicy: maxMergeAtOnce=13, maxMergeAtOnceExplicit=38, maxMergedSegmentMB=35.0029296875, floorSegmentMB=1.01171875, forceMergeDeletesPctAllowed=14.693232198061866, segmentsPerTier=15.0, maxCFSSegmentSizeMB=8.796093022207999E12, noCFSRatio=1.0
[junit4] 2> 296707 T624 oasc.SolrDeletionPolicy.onCommit SolrDeletionPolicy.onCommit: commits: num=1
[junit4] 2> commit{dir=MockDirectoryWrapper(org.apache.lucene.store.RAMDirectory@3872ad78 lockFactory=org.apache.lucene.store.SingleInstanceLockFactory@1130ad00),segFN=segments_1,generation=1}
[junit4] 2> 296707 T624 oasc.SolrDeletionPolicy.updateCommits newest commit generation = 1
[junit4] 2> 296711 T624 oasup.UpdateRequestProcessorChain.init creating updateRequestProcessorChain "nodistrib"
[junit4] 2> 296712 T624 oasup.UpdateRequestProcessorChain.init creating updateRequestProcessorChain "dedupe"
[junit4] 2> 296712 T624 oasup.UpdateRequestProcessorChain.init inserting DistributedUpdateProcessorFactory into updateRequestProcessorChain "dedupe"
[junit4] 2> 296713 T624 oasup.UpdateRequestProcessorChain.init creating updateRequestProcessorChain "stored_sig"
[junit4] 2> 296713 T624 oasup.UpdateRequestProcessorChain.init inserting DistributedUpdateProcessorFactory into updateRequestProcessorChain "stored_sig"
[junit4] 2> 296713 T624 oasup.UpdateRequestProcessorChain.init creating updateRequestProcessorChain "distrib-dup-test-chain-explicit"
[junit4] 2> 296714 T624 oasup.UpdateRequestProcessorChain.init creating updateRequestProcessorChain "distrib-dup-test-chain-implicit"
[junit4] 2> 296714 T624 oasup.UpdateRequestProcessorChain.init inserting DistributedUpdateProcessorFactory into updateRequestProcessorChain "distrib-dup-test-chain-implicit"
[junit4] 2> 296714 T624 oasc.SolrCore.loadUpdateProcessorChains no updateRequestProcessorChain defined as default, creating implicit default
[junit4] 2> 296715 T624 oasc.RequestHandlers.initHandlersFromConfig created standard: solr.StandardRequestHandler
[junit4] 2> 296716 T624 oasc.RequestHandlers.initHandlersFromConfig created /get: solr.RealTimeGetHandler
[junit4] 2> 296716 T624 oasc.RequestHandlers.initHandlersFromConfig adding lazy requestHandler: solr.ReplicationHandler
[junit4] 2> 296716 T624 oasc.RequestHandlers.initHandlersFromConfig created /replication: solr.ReplicationHandler
[junit4] 2> 296717 T624 oasc.RequestHandlers.initHandlersFromConfig created /update: solr.UpdateRequestHandler
[junit4] 2> 296718 T624 oasc.RequestHandlers.initHandlersFromConfig created /admin/: org.apache.solr.handler.admin.AdminHandlers
[junit4] 2> 296733 T624 oashl.XMLLoader.init xsltCacheLifetimeSeconds=60
[junit4] 2> 296738 T624 oasu.CommitTracker.<init> Hard AutoCommit: disabled
[junit4] 2> 296739 T624 oasu.CommitTracker.<init> Soft AutoCommit: disabled
[junit4] 2> 296740 T624 oasu.RandomMergePolicy.<init> RandomMergePolicy wrapping class org.apache.lucene.index.TieredMergePolicy: [TieredMergePolicy: maxMergeAtOnce=25, maxMergeAtOnceExplicit=34, maxMergedSegmentMB=86.6728515625, floorSegmentMB=0.8720703125, forceMergeDeletesPctAllowed=15.856030406949497, segmentsPerTier=13.0, maxCFSSegmentSizeMB=8.796093022207999E12, noCFSRatio=0.0
[junit4] 2> 296740 T624 oasc.SolrDeletionPolicy.onInit SolrDeletionPolicy.onInit: commits: num=1
[junit4] 2> commit{dir=MockDirectoryWrapper(org.apache.lucene.store.RAMDirectory@3872ad78 lockFactory=org.apache.lucene.store.SingleInstanceLockFactory@1130ad00),segFN=segments_1,generation=1}
[junit4] 2> 296741 T624 oasc.SolrDeletionPolicy.updateCommits newest commit generation = 1
[junit4] 2> 296741 T624 oass.SolrIndexSearcher.<init> Opening Searcher@4c4a5d91 main
[junit4] 2> 296746 T625 oasc.SolrCore.registerSearcher [collection1] Registered new searcher Searcher@4c4a5d91 main{StandardDirectoryReader(segments_1:1:nrt)}
[junit4] 2> 296748 T624 oasc.CoreContainer.registerCore registering core: collection1
[junit4] 2> 296749 T624 oasc.ZkController.register Register replica - core:collection1 address:http://127.0.0.1:19156 collection:collection1 shard:shard1
[junit4] 2> 296749 T624 oascsi.HttpClientUtil.createClient Creating new http client, config:maxConnections=10000&maxConnectionsPerHost=20&connTimeout=15000&socketTimeout=30000&retry=false
[junit4] 2> 296762 T624 oascc.SolrZkClient.makePath makePath: /collections/collection1/leader_elect/shard1/election
[junit4] 2> 296781 T624 oasc.ShardLeaderElectionContext.runLeaderProcess Running the leader process for shard shard1
[junit4] 2> 296784 T624 oasc.ShardLeaderElectionContext.waitForReplicasToComeUp Enough replicas found to continue.
[junit4] 2> 296784 T624 oasc.ShardLeaderElectionContext.runLeaderProcess I may be the new leader - try and sync
[junit4] 2> 296785 T624 oasc.SyncStrategy.sync Sync replicas to http://127.0.0.1:19156/collection1/
[junit4] 2> 296785 T624 oasc.SyncStrategy.syncReplicas Sync Success - now sync replicas to me
[junit4] 2> 296785 T624 oasc.SyncStrategy.syncToMe http://127.0.0.1:19156/collection1/ has no replicas
[junit4] 2> 296786 T624 oasc.ShardLeaderElectionContext.runLeaderProcess I am the new leader: http://127.0.0.1:19156/collection1/ shard1
[junit4] 2> 296786 T624 oascc.SolrZkClient.makePath makePath: /collections/collection1/leaders/shard1
[junit4] 2> 297722 T604 oascc.ZkStateReader.updateClusterState Updating cloud state from ZooKeeper...
[junit4] 2> 297779 T603 oascc.ZkStateReader$2.process A cluster state change: WatchedEvent state:SyncConnected type:NodeDataChanged path:/clusterstate.json, has occurred - updating... (live nodes size: 2)
[junit4] 2> 297779 T623 oascc.ZkStateReader$2.process A cluster state change: WatchedEvent state:SyncConnected type:NodeDataChanged path:/clusterstate.json, has occurred - updating... (live nodes size: 2)
[junit4] 2> 297779 T610 oascc.ZkStateReader$2.process A cluster state change: WatchedEvent state:SyncConnected type:NodeDataChanged path:/clusterstate.json, has occurred - updating... (live nodes size: 2)
[junit4] 2> 297814 T624 oasc.ZkController.register We are http://127.0.0.1:19156/collection1/ and leader is http://127.0.0.1:19156/collection1/
[junit4] 2> 297814 T624 oasc.ZkController.register No LogReplay needed for core=collection1 baseURL=http://127.0.0.1:19156
[junit4] 2> 297814 T624 oasc.ZkController.checkRecovery I am the leader, no recovery necessary
[junit4] 2> 297814 T624 oasc.ZkController.publish publishing core=collection1 state=active
[junit4] 2> 297815 T624 oasc.ZkController.publish numShards not found on descriptor - reading it from system property
[junit4] 2> 297817 T624 oascc.ZkStateReader.updateClusterState Updating cloud state from ZooKeeper...
[junit4] 2> 297818 T581 oass.SolrDispatchFilter.init user.dir=/usr/home/hudson/hudson-slave/workspace/Lucene-Solr-Tests-4.x-Java7/solr/build/solr-core/test/J0
[junit4] 2> 297819 T581 oass.SolrDispatchFilter.init SolrDispatchFilter.init() done
[junit4] 2> 297819 T581 oascsi.HttpClientUtil.createClient Creating new http client, config:maxConnections=128&maxConnectionsPerHost=32&followRedirects=false
[junit4] 2> 298113 T581 oejs.Server.doStart jetty-8.1.10.v20130312
[junit4] 2> 298116 T581 oejs.AbstractConnector.doStart Started SocketConnector@127.0.0.1:53155
[junit4] 2> 298117 T581 oass.SolrDispatchFilter.init SolrDispatchFilter.init()
[junit4] 2> 298118 T581 oasc.SolrResourceLoader.locateSolrHome JNDI not configured for solr (NoInitialContextEx)
[junit4] 2> 298118 T581 oasc.SolrResourceLoader.locateSolrHome using system property solr.solr.home: ./org.apache.solr.cloud.SyncSliceTest-jetty2-1379147525964
[junit4] 2> 298119 T581 oasc.SolrResourceLoader.<init> new SolrResourceLoader for directory: './org.apache.solr.cloud.SyncSliceTest-jetty2-1379147525964/'
[junit4] 2> 298157 T581 oasc.ConfigSolr.fromFile Loading container configuration from /usr/home/hudson/hudson-slave/workspace/Lucene-Solr-Tests-4.x-Java7/solr/build/solr-core/test/J0/./org.apache.solr.cloud.SyncSliceTest-jetty2-1379147525964/solr.xml
[junit4] 2> 298250 T581 oasc.CoreContainer.<init> New CoreContainer 1135525047
[junit4] 2> 298251 T581 oasc.CoreContainer.load Loading cores into CoreContainer [instanceDir=./org.apache.solr.cloud.SyncSliceTest-jetty2-1379147525964/]
[junit4] 2> 298253 T581 oashc.HttpShardHandlerFactory.getParameter Setting socketTimeout to: 120000
[junit4] 2> 298253 T581 oashc.HttpShardHandlerFactory.getParameter Setting urlScheme to: http://
[junit4] 2> 298253 T581 oashc.HttpShardHandlerFactory.getParameter Setting connTimeout to: 15000
[junit4] 2> 298254 T581 oashc.HttpShardHandlerFactory.getParameter Setting maxConnectionsPerHost to: 20
[junit4] 2> 298254 T581 oashc.HttpShardHandlerFactory.getParameter Setting corePoolSize to: 0
[junit4] 2> 298255 T581 oashc.HttpShardHandlerFactory.getParameter Setting maximumPoolSize to: 2147483647
[junit4] 2> 298255 T581 oashc.HttpShardHandlerFactory.getParameter Setting maxThreadIdleTime to: 5
[junit4] 2> 298256 T581 oashc.HttpShardHandlerFactory.getParameter Setting sizeOfQueue to: -1
[junit4] 2> 298256 T581 oashc.HttpShardHandlerFactory.getParameter Setting fairnessPolicy to: false
[junit4] 2> 298257 T581 oascsi.HttpClientUtil.createClient Creating new http client, config:maxConnectionsPerHost=20&maxConnections=10000&socketTimeout=120000&connTimeout=15000&retry=false
[junit4] 2> 298274 T581 oasl.LogWatcher.createWatcher SLF4J impl is org.slf4j.impl.Log4jLoggerFactory
[junit4] 2> 298274 T581 oasl.LogWatcher.newRegisteredLogWatcher Registering Log Listener [Log4j (org.slf4j.impl.Log4jLoggerFactory)]
[junit4] 2> 298275 T581 oasc.ZkContainer.initZooKeeper Zookeeper client=127.0.0.1:48399/solr
[junit4] 2> 298275 T581 oasc.ZkController.checkChrootPath zkHost includes chroot
[junit4] 2> 298276 T581 oascc.ConnectionManager.waitForConnected Waiting for client to connect to ZooKeeper
[junit4] 2> 298280 T637 oascc.ConnectionManager.process Watcher org.apache.solr.common.cloud.ConnectionManager@7fde17df name:ZooKeeperConnection Watcher:127.0.0.1:48399 got event WatchedEvent state:SyncConnected type:None path:null path:null type:None
[junit4] 2> 298280 T581 oascc.ConnectionManager.waitForConnected Client is connected to ZooKeeper
[junit4] 2> 298293 T581 oascsi.HttpClientUtil.createClient Creating new http client, config:maxConnections=500&maxConnectionsPerHost=16&socketTimeout=120000&connTimeout=15000
[junit4] 2> 298305 T581 oascc.ConnectionManager.waitForConnected Waiting for client to connect to ZooKeeper
[junit4] 2> 298307 T639 oascc.ConnectionManager.process Watcher org.apache.solr.common.cloud.ConnectionManager@373e2c27 name:ZooKeeperConnection Watcher:127.0.0.1:48399/solr got event WatchedEvent state:SyncConnected type:None path:null path:null type:None
[junit4] 2> 298308 T581 oascc.ConnectionManager.waitForConnected Client is connected to ZooKeeper
[junit4] 2> 298318 T581 oascc.ZkStateReader.createClusterStateWatchersAndUpdate Updating cluster state from ZooKeeper...
[junit4] 2> 299293 T604 oascc.ZkStateReader.updateClusterState Updating cloud state from ZooKeeper...
[junit4] 2> 299294 T604 oasc.Overseer$ClusterStateUpdater.updateState Update state numShards=1 message={
[junit4] 2> "operation":"state",
[junit4] 2> "core_node_name":"core_node1",
[junit4] 2> "numShards":"1",
[junit4] 2> "shard":"shard1",
[junit4] 2> "roles":null,
[junit4] 2> "state":"active",
[junit4] 2> "shard_state":"active",
[junit4] 2> "core":"collection1",
[junit4] 2> "collection":"collection1",
[junit4] 2> "shard_range":null,
[junit4] 2> "node_name":"127.0.0.1:19156_",
[junit4] 2> "base_url":"http://127.0.0.1:19156"}
[junit4] 2> 299314 T603 oascc.ZkStateReader$2.process A cluster state change: WatchedEvent state:SyncConnected type:NodeDataChanged path:/clusterstate.json, has occurred - updating... (live nodes size: 2)
[junit4] 2> 299314 T623 oascc.ZkStateReader$2.process A cluster state change: WatchedEvent state:SyncConnected type:NodeDataChanged path:/clusterstate.json, has occurred - updating... (live nodes size: 2)
[junit4] 2> 299314 T639 oascc.ZkStateReader$2.process A cluster state change: WatchedEvent state:SyncConnected type:NodeDataChanged path:/clusterstate.json, has occurred - updating... (live nodes size: 2)
[junit4] 2> 299314 T610 oascc.ZkStateReader$2.process A cluster state change: WatchedEvent state:SyncConnected type:NodeDataChanged path:/clusterstate.json, has occurred - updating... (live nodes size: 2)
[junit4] 2> 299323 T581 oasc.ZkController.createEphemeralLiveNode Register node as live in ZooKeeper:/live_nodes/127.0.0.1:53155_
[junit4] 2> 299325 T581 oascc.SolrZkClient.makePath makePath: /live_nodes/127.0.0.1:53155_
[junit4] 2> 299328 T603 oascc.ZkStateReader$2.process A cluster state change: WatchedEvent state:SyncConnected type:NodeChildrenChanged path:/live_nodes, has occurred - updating... (live nodes size: 2)
[junit4] 2> 299328 T610 oascc.ZkStateReader$2.process A cluster state change: WatchedEvent state:SyncConnected type:NodeChildrenChanged path:/live_nodes, has occurred - updating... (live nodes size: 2)
[junit4] 2> 299329 T623 oascc.ZkStateReader$3.process Updating live nodes... (3)
[junit4] 2> 299329 T639 oascc.ZkStateReader$3.process Updating live nodes... (3)
[junit4] 2> 299329 T623 oascc.ZkStateReader$2.process A cluster state change: WatchedEvent state:SyncConnected type:NodeChildrenChanged path:/live_nodes, has occurred - updating... (live nodes size: 3)
[junit4] 2> 299329 T639 oascc.ZkStateReader$2.process A cluster state change: WatchedEvent state:SyncConnected type:NodeChildrenChanged path:/live_nodes, has occurred - updating... (live nodes size: 3)
[junit4] 2> 299330 T603 oascc.ZkStateReader$3.process Updating live nodes... (3)
[junit4] 2> 299330 T610 oascc.ZkStateReader$3.process Updating live nodes... (3)
[junit4] 2> 299339 T640 oasc.ZkController.publish publishing core=collection1 state=down
[junit4] 2> 299339 T640 oasc.ZkController.publish numShards not found on descriptor - reading it from system property
[junit4] 2> 299341 T640 oasc.ZkController.waitForCoreNodeName look for our core node name
[junit4] 2> 300820 T604 oascc.ZkStateReader.updateClusterState Updating cloud state from ZooKeeper...
[junit4] 2> 300822 T604 oasc.Overseer$ClusterStateUpdater.updateState Update state numShards=1 message={
[junit4] 2> "operation":"state",
[junit4] 2> "core_node_name":"core_node2",
[junit4] 2> "numShards":"1",
[junit4] 2> "shard":null,
[junit4] 2> "roles":null,
[junit4] 2> "state":"down",
[junit4] 2> "shard_state":"active",
[junit4] 2> "core":"collection1",
[junit4] 2> "collection":"collection1",
[junit4] 2> "shard_range":null,
[junit4] 2> "node_name":"127.0.0.1:53155_",
[junit4] 2> "base_url":"http://127.0.0.1:53155"}
[junit4] 2> 300822 T604 oasc.Overseer$ClusterStateUpdater.updateState Collection already exists with numShards=1
[junit4] 2> 300822 T604 oasc.Overseer$ClusterStateUpdater.updateState Assigning new node to shard shard=shard1
[junit4] 2> 300845 T623 oascc.ZkStateReader$2.process A cluster state change: WatchedEvent state:SyncConnected type:NodeDataChanged path:/clusterstate.json, has occurred - updating... (live nodes size: 3)
[junit4] 2> 300845 T639 oascc.ZkStateReader$2.process A cluster state change: WatchedEvent state:SyncConnected type:NodeDataChanged path:/clusterstate.json, has occurred - updating... (live nodes size: 3)
[junit4] 2> 300845 T610 oascc.ZkStateReader$2.process A cluster state change: WatchedEvent state:SyncConnected type:NodeDataChanged path:/clusterstate.json, has occurred - updating... (live nodes size: 3)
[junit4] 2> 300845 T603 oascc.ZkStateReader$2.process A cluster state change: WatchedEvent state:SyncConnected type:NodeDataChanged path:/clusterstate.json, has occurred - updating... (live nodes size: 3)
[junit4] 2> 301343 T640 oasc.ZkController.waitForShardId waiting to find shard id in clusterstate for collection1
[junit4] 2> 301343 T640 oasc.CoreContainer.create Creating SolrCore 'collection1' using instanceDir: ./org.apache.solr.cloud.SyncSliceTest-jetty2-1379147525964/collection1
[junit4] 2> 301343 T640 oasc.ZkController.createCollectionZkNode Check for collection zkNode:collection1
[junit4] 2> 301344 T640 oasc.ZkController.createCollectionZkNode Collection zkNode exists
[junit4] 2> 301345 T640 oasc.ZkController.readConfigName Load collection config from:/collections/collection1
[junit4] 2> 301346 T640 oasc.SolrResourceLoader.<init> new SolrResourceLoader for directory: './org.apache.solr.cloud.SyncSliceTest-jetty2-1379147525964/collection1/'
[junit4] 2> 301347 T640 oasc.SolrResourceLoader.replaceClassLoader Adding 'file:/usr/home/hudson/hudson-slave/workspace/Lucene-Solr-Tests-4.x-Java7/solr/build/solr-core/test/J0/org.apache.solr.cloud.SyncSliceTest-jetty2-1379147525964/collection1/lib/README' to classloader
[junit4] 2> 301348 T640 oasc.SolrResourceLoader.replaceClassLoader Adding 'file:/usr/home/hudson/hudson-slave/workspace/Lucene-Solr-Tests-4.x-Java7/solr/build/solr-core/test/J0/org.apache.solr.cloud.SyncSliceTest-jetty2-1379147525964/collection1/lib/classes/' to classloader
[junit4] 2> 301414 T640 oasc.SolrConfig.<init> Using Lucene MatchVersion: LUCENE_46
[junit4] 2> 301479 T640 oasc.SolrConfig.<init> Loaded SolrConfig: solrconfig.xml
[junit4] 2> 301581 T640 oass.IndexSchema.readSchema Reading Solr Schema from schema.xml
[junit4] 2> 301594 T640 oass.IndexSchema.readSchema [null] Schema name=test
[junit4] 2> 302225 T640 oass.ByteField.init WARN ByteField is deprecated and will be removed in 5.0. You should use TrieIntField instead.
[junit4] 2> 302226 T640 oass.ShortField.init WARN ShortField is deprecated and will be removed in 5.0. You should use TrieIntField instead.
[junit4] 2> 302227 T640 oass.OpenExchangeRatesOrgProvider.init Initialized with rates=open-exchange-rates.json, refreshInterval=1440.
[junit4] 2> 302236 T640 oass.IndexSchema.readSchema default search field in schema is text
[junit4] 2> 302239 T640 oass.IndexSchema.readSchema unique key field: id
[junit4] 2> 302254 T640 oass.FileExchangeRateProvider.reload Reloading exchange rates from file currency.xml
[junit4] 2> 302258 T640 oass.FileExchangeRateProvider.reload Reloading exchange rates from file currency.xml
[junit4] 2> 302262 T640 oass.OpenExchangeRatesOrgProvider.reload Reloading exchange rates from open-exchange-rates.json
[junit4] 2> 302263 T640 oass.OpenExchangeRatesOrgProvider$OpenExchangeRates.<init> WARN Unknown key IMPORTANT NOTE
[junit4] 2> 302263 T640 oass.OpenExchangeRatesOrgProvider$OpenExchangeRates.<init> WARN Expected key, got STRING
[junit4] 2> 302263 T640 oass.OpenExchangeRatesOrgProvider.reload Reloading exchange rates from open-exchange-rates.json
[junit4] 2> 302265 T640 oass.OpenExchangeRatesOrgProvider$OpenExchangeRates.<init> WARN Unknown key IMPORTANT NOTE
[junit4] 2> 302265 T640 oass.OpenExchangeRatesOrgProvider$OpenExchangeRates.<init> WARN Expected key, got STRING
[junit4] 2> 302265 T640 oasc.SolrCore.initDirectoryFactory org.apache.solr.core.MockDirectoryFactory
[junit4] 2> 302265 T640 oasc.SolrCore.<init> [collection1] Opening new SolrCore at ./org.apache.solr.cloud.SyncSliceTest-jetty2-1379147525964/collection1/, dataDir=./org.apache.solr.cloud.SyncSliceTest-1379147515970/jetty2/
[junit4] 2> 302266 T640 oasc.JmxMonitoredMap.<init> JMX monitoring is enabled. Adding Solr mbeans to JMX Server: com.sun.jmx.mbeanserver.JmxMBeanServer@55088a5f
[junit4] 2> 302267 T640 oasc.CachingDirectoryFactory.get return new directory for ./org.apache.solr.cloud.SyncSliceTest-1379147515970/jetty2
[junit4] 2> 302267 T640 oasc.SolrCore.getNewIndexDir New index directory detected: old=null new=./org.apache.solr.cloud.SyncSliceTest-1379147515970/jetty2/index/
[junit4] 2> 302267 T640 oasc.SolrCore.initIndex WARN [collection1] Solr index directory './org.apache.solr.cloud.SyncSliceTest-1379147515970/jetty2/index' doesn't exist. Creating new index...
[junit4] 2> 302267 T640 oasc.CachingDirectoryFactory.get return new directory for ./org.apache.solr.cloud.SyncSliceTest-1379147515970/jetty2/index
[junit4] 2> 302268 T640 oasu.RandomMergePolicy.<init> RandomMergePolicy wrapping class org.apache.lucene.index.TieredMergePolicy: [TieredMergePolicy: maxMergeAtOnce=13, maxMergeAtOnceExplicit=38, maxMergedSegmentMB=35.0029296875, floorSegmentMB=1.01171875, forceMergeDeletesPctAllowed=14.693232198061866, segmentsPerTier=15.0, maxCFSSegmentSizeMB=8.796093022207999E12, noCFSRatio=1.0
[junit4] 2> 302268 T640 oasc.SolrDeletionPolicy.onCommit SolrDeletionPolicy.onCommit: commits: num=1
[junit4] 2> commit{dir=MockDirectoryWrapper(org.apache.lucene.store.RAMDirectory@31b1f282 lockFactory=org.apache.lucene.store.SingleInstanceLockFactory@6f40ad97),segFN=segments_1,generation=1}
[junit4] 2> 302269 T640 oasc.SolrDeletionPolicy.updateCommits newest commit generation = 1
[junit4] 2> 302272 T640 oasup.UpdateRequestProcessorChain.init creating updateRequestProcessorChain "nodistrib"
[junit4] 2> 302272 T640 oasup.UpdateRequestProcessorChain.init creating updateRequestProcessorChain "dedupe"
[junit4] 2> 302272 T640 oasup.UpdateRequestProcessorChain.init inserting DistributedUpdateProcessorFactory into updateRequestProcessorChain "dedupe"
[junit4] 2> 302272 T640 oasup.UpdateRequestProcessorChain.init creating updateRequestProcessorChain "stored_sig"
[junit4] 2> 302273 T640 oasup.UpdateRequestProcessorChain.init inserting DistributedUpdateProcessorFactory into updateRequestProcessorChain "stored_sig"
[junit4] 2> 302273 T640 oasup.UpdateRequestProcessorChain.init creating updateRequestProcessorChain "distrib-dup-test-chain-explicit"
[junit4] 2> 302273 T640 oasup.UpdateRequestProcessorChain.init creating updateRequestProcessorChain "distrib-dup-test-chain-implicit"
[junit4] 2> 302274 T640 oasup.UpdateRequestProcessorChain.init inserting DistributedUpdateProcessorFactory into updateRequestProcessorChain "distrib-dup-test-chain-implicit"
[junit4] 2> 302274 T640 oasc.SolrCore.loadUpdateProcessorChains no updateRequestProcessorChain defined as default, creating implicit default
[junit4] 2> 302274 T640 oasc.RequestHandlers.initHandlersFromConfig created standard: solr.StandardRequestHandler
[junit4] 2> 302275 T640 oasc.RequestHandlers.initHandlersFromConfig created /get: solr.RealTimeGetHandler
[junit4] 2> 302275 T640 oasc.RequestHandlers.initHandlersFromConfig adding lazy requestHandler: solr.ReplicationHandler
[junit4] 2> 302275 T640 oasc.RequestHandlers.initHandlersFromConfig created /replication: solr.ReplicationHandler
[junit4] 2> 302276 T640 oasc.RequestHandlers.initHandlersFromConfig created /update: solr.UpdateRequestHandler
[junit4] 2> 302276 T640 oasc.RequestHandlers.initHandlersFromConfig created /admin/: org.apache.solr.handler.admin.AdminHandlers
[junit4] 2> 302287 T640 oashl.XMLLoader.init xsltCacheLifetimeSeconds=60
[junit4] 2> 302290 T640 oasu.CommitTracker.<init> Hard AutoCommit: disabled
[junit4] 2> 302291 T640 oasu.CommitTracker.<init> Soft AutoCommit: disabled
[junit4] 2> 302291 T640 oasu.RandomMergePolicy.<init> RandomMergePolicy wrapping class org.apache.lucene.index.TieredMergePolicy: [TieredMergePolicy: maxMergeAtOnce=25, maxMergeAtOnceExplicit=34, maxMergedSegmentMB=86.6728515625, floorSegmentMB=0.8720703125, forceMergeDeletesPctAllowed=15.856030406949497, segmentsPerTier=13.0, maxCFSSegmentSizeMB=8.796093022207999E12, noCFSRatio=0.0
[junit4] 2> 302292 T640 oasc.SolrDeletionPolicy.onInit SolrDeletionPolicy.onInit: commits: num=1
[junit4] 2> commit{dir=MockDirectoryWrapper(org.apache.lucene.store.RAMDirectory@31b1f282 lockFactory=org.apache.lucene.store.SingleInstanceLockFactory@6f40ad97),segFN=segments_1,generation=1}
[junit4] 2> 302292 T640 oasc.SolrDeletionPolicy.updateCommits newest commit generation = 1
[junit4] 2> 302292 T640 oass.SolrIndexSearcher.<init> Opening Searcher@30de1dea main
[junit4] 2> 302296 T641 oasc.SolrCore.registerSearcher [collection1] Registered new searcher Searcher@30de1dea main{StandardDirectoryReader(segments_1:1:nrt)}
[junit4] 2> 302299 T640 oasc.CoreContainer.registerCore registering core: collection1
[junit4] 2> 302299 T640 oasc.ZkController.register Register replica - core:collection1 address:http://127.0.0.1:53155 collection:collection1 shard:shard1
[junit4] 2> 302299 T640 oascsi.HttpClientUtil.createClient Creating new http client, config:maxConnections=10000&maxConnectionsPerHost=20&connTimeout=15000&socketTimeout=30000&retry=false
[junit4] 2> 302316 T640 oasc.ZkController.register We are http://127.0.0.1:53155/collection1/ and leader is http://127.0.0.1:19156/collection1/
[junit4] 2> 302316 T640 oasc.ZkController.register No LogReplay needed for core=collection1 baseURL=http://127.0.0.1:53155
[junit4] 2> 302316 T640 oasc.ZkController.checkRecovery Core needs to recover:collection1
[junit4] 2> 302316 T640 oasu.DefaultSolrCoreState.doRecovery Running recovery - first canceling any ongoing recovery
[junit4] 2> ASYNC NEW_CORE C494 name=collection1 org.apache.solr.core.SolrCore@2c694c78 url=http://127.0.0.1:53155/collection1 node=127.0.0.1:53155_ C494_STATE=coll:collection1 core:collection1 props:{state=down, core=collection1, node_name=127.0.0.1:53155_, base_url=http://127.0.0.1:53155}
[junit4] 2> 302325 T642 C494 P53155 oasc.RecoveryStrategy.run Starting recovery process. core=collection1 recoveringAfterStartup=true
[junit4] 2> 302325 T640 oascc.ZkStateReader.updateClusterState Updating cloud state from ZooKeeper...
[junit4] 2> 302325 T642 C494 P53155 oasc.RecoveryStrategy.doRecovery ###### startupVersions=[]
[junit4] 2> 302326 T642 C494 P53155 oasc.ZkController.publish publishing core=collection1 state=recovering
[junit4] 2> 302326 T642 C494 P53155 oasc.ZkController.publish numShards not found on descriptor - reading it from system property
[junit4] 2> 302326 T581 oass.SolrDispatchFilter.init user.dir=/usr/home/hudson/hudson-slave/workspace/Lucene-Solr-Tests-4.x-Java7/solr/build/solr-core/test/J0
[junit4] 2> 302327 T581 oass.SolrDispatchFilter.init SolrDispatchFilter.init() done
[junit4] 2> 302327 T581 oascsi.HttpClientUtil.createClient Creating new http client, config:maxConnections=128&maxConnectionsPerHost=32&followRedirects=false
[junit4] 2> 302328 T642 C494 P53155 oascsi.HttpClientUtil.createClient Creating new http client, config:maxConnections=128&maxConnectionsPerHost=32&followRedirects=false
[junit4] 2> 302344 T613 oasha.CoreAdminHandler.handleWaitForStateAction Going to wait for coreNodeName: core_node2, state: recovering, checkLive: true, onlyIfLeader: true
[junit4] 2> 302350 T604 oascc.ZkStateReader.updateClusterState Updating cloud state from ZooKeeper...
[junit4] 2> 302351 T604 oasc.Overseer$ClusterStateUpdater.updateState Update state numShards=1 message={
[junit4] 2> "operation":"state",
[junit4] 2> "core_node_name":"core_node2",
[junit4] 2> "numShards":"1",
[junit4] 2> "shard":"shard1",
[junit4] 2> "roles":null,
[junit4] 2> "state":"recovering",
[junit4] 2> "shard_state":"active",
[junit4] 2> "core":"collection1",
[junit4] 2> "collection":"collection1",
[junit4] 2> "shard_range":null,
[junit4] 2> "node_name":"127.0.0.1:53155_",
[junit4] 2> "base_url":"http://127.0.0.1:53155"}
[junit4] 2> 302364 T603 oascc.ZkStateReader$2.process A cluster state change: WatchedEvent state:SyncConnected type:NodeDataChanged path:/clusterstate.json, has occurred - updating... (live nodes size: 3)
[junit4] 2> 302364 T639 oascc.ZkStateReader$2.process A cluster state change: WatchedEvent state:SyncConnected type:NodeDataChanged path:/clusterstate.json, has occurred - updating... (live nodes size: 3)
[junit4] 2> 302364 T610 oascc.ZkStateReader$2.process A cluster state change: WatchedEvent state:SyncConnected type:NodeDataChanged path:/clusterstate.json, has occurred - updating... (live nodes size: 3)
[junit4] 2> 302364 T623 oascc.ZkStateReader$2.process A cluster state change: WatchedEvent state:SyncConnected type:NodeDataChanged path:/clusterstate.json, has occurred - updating... (live nodes size: 3)
[junit4] 2> 302525 T581 oejs.Server.doStart jetty-8.1.10.v20130312
[junit4] 2> 302527 T581 oejs.AbstractConnector.doStart Started SocketConnector@127.0.0.1:17534
[junit4] 2> 302528 T581 oass.SolrDispatchFilter.init SolrDispatchFilter.init()
[junit4] 2> 302529 T581 oasc.SolrResourceLoader.locateSolrHome JNDI not configured for solr (NoInitialContextEx)
[junit4] 2> 302529 T581 oasc.SolrResourceLoader.locateSolrHome using system property solr.solr.home: ./org.apache.solr.cloud.SyncSliceTest-jetty3-1379147530469
[junit4] 2> 302529 T581 oasc.SolrResourceLoader.<init> new SolrResourceLoader for directory: './org.apache.solr.cloud.SyncSliceTest-jetty3-1379147530469/'
[junit4] 2> 302554 T581 oasc.ConfigSolr.fromFile Loading container configuration from /usr/home/hudson/hudson-slave/workspace/Lucene-Solr-Tests-4.x-Java7/solr/build/solr-core/test/J0/./org.apache.solr.cloud.SyncSliceTest-jetty3-1379147530469/solr.xml
[junit4] 2> 302614 T581 oasc.CoreContainer.<init> New CoreContainer 247876054
[junit4] 2> 302615 T581 oasc.CoreContainer.load Loading cores into CoreContainer [instanceDir=./org.apache.solr.cloud.SyncSliceTest-jetty3-1379147530469/]
[junit4] 2> 302616 T581 oashc.HttpShardHandlerFactory.getParameter Setting socketTimeout to: 120000
[junit4] 2> 302616 T581 oashc.HttpShardHandlerFactory.getParameter Setting urlScheme to: http://
[junit4] 2> 302617 T581 oashc.HttpShardHandlerFactory.getParameter Setting connTimeout to: 15000
[junit4] 2> 302617 T581 oashc.HttpShardHandlerFactory.getParameter Setting maxConnectionsPerHost to: 20
[junit4] 2> 302618 T581 oashc.HttpShardHandlerFactory.getParameter Setting corePoolSize to: 0
[junit4] 2> 302618 T581 oashc.HttpShardHandlerFactory.getParameter Setting maximumPoolSize to: 2147483647
[junit4] 2> 302618 T581 oashc.HttpShardHandlerFactory.getParameter Setting maxThreadIdleTime to: 5
[junit4] 2> 302618 T581 oashc.HttpShardHandlerFactory.getParameter Setting sizeOfQueue to: -1
[junit4] 2> 302619 T581 oashc.HttpShardHandlerFactory.getParameter Setting fairnessPolicy to: false
[junit4] 2> 302619 T581 oascsi.HttpClientUtil.createClient Creating new http client, config:maxConnectionsPerHost=20&maxConnections=10000&socketTimeout=120000&connTimeout=15000&retry=false
[junit4] 2> 302630 T581 oasl.LogWatcher.createWatcher SLF4J impl is org.slf4j.impl.Log4jLoggerFactory
[junit4] 2> 302630 T581 oasl.LogWatcher.newRegisteredLogWatcher Registering Log Listener [Log4j (org.slf4j.impl.Log4jLoggerFactory)]
[junit4] 2> 302631 T581 oasc.ZkContainer.initZooKeeper Zookeeper client=127.0.0.1:48399/solr
[junit4] 2> 302631 T581 oasc.ZkController.checkChrootPath zkHost includes chroot
[junit4] 2> 302632 T581 oascc.ConnectionManager.waitForConnected Waiting for client to connect to ZooKeeper
[junit4] 2> 302635 T654 oascc.ConnectionManager.process Watcher org.apache.solr.common.cloud.ConnectionManager@52d44937 name:ZooKeeperConnection Watcher:127.0.0.1:48399 got event WatchedEvent state:SyncConnected type:None path:null path:null type:None
[junit4] 2> 302636 T581 oascc.ConnectionManager.waitForConnected Client is connected to ZooKeeper
[junit4] 2> 302651 T581 oascsi.HttpClientUtil.createClient Creating new http client, config:maxConnections=500&maxConnectionsPerHost=16&socketTimeout=120000&connTimeout=15000
[junit4] 2> 302663 T581 oascc.ConnectionManager.waitForConnected Waiting for client to connect to ZooKeeper
[junit4] 2> 302665 T656 oascc.ConnectionManager.process Watcher org.apache.solr.common.cloud.ConnectionManager@2b0203ea name:ZooKeeperConnection Watcher:127.0.0.1:48399/solr got event WatchedEvent state:SyncConnected type:None path:null path:null type:None
[junit4] 2> 302666 T581 oascc.ConnectionManager.waitForConnected Client is connected to ZooKeeper
[junit4] 2> 302677 T581 oascc.ZkStateReader.createClusterStateWatchersAndUpdate Updating cluster state from ZooKeeper...
[junit4] 2> 303345 T613 oasha.CoreAdminHandler.handleWaitForStateAction Waited coreNodeName: core_node2, state: recovering, checkLive: true, onlyIfLeader: true for: 1 seconds.
[junit4] 2> 303345 T613 oass.SolrDispatchFilter.handleAdminRequest [admin] webapp=null path=/admin/cores params={coreNodeName=core_node2&state=recovering&nodeName=127.0.0.1:53155_&action=PREPRECOVERY&checkLive=true&core=collection1&wt=javabin&onlyIfLeader=true&version=2} status=0 QTime=1001
[junit4] 2> 303681 T581 oasc.ZkController.createEphemeralLiveNode Register node as live in ZooKeeper:/live_nodes/127.0.0.1:17534_
[junit4] 2> 303684 T581 oascc.SolrZkClient.makePath makePath: /live_nodes/127.0.0.1:17534_
[junit4] 2> 303687 T610 oascc.ZkStateReader$2.process A cluster state change: WatchedEvent state:SyncConnected type:NodeChildrenChanged path:/live_nodes, has occurred - updating... (live nodes size: 3)
[junit4] 2> 303687 T603 oascc.ZkStateReader$2.process A cluster state change: WatchedEvent state:SyncConnected type:NodeChildrenChanged path:/live_nodes, has occurred - updating... (live nodes size: 3)
[junit4] 2> 303688 T656 oascc.ZkStateReader$3.process Updating live nodes... (4)
[junit4] 2> 303688 T639 oascc.ZkStateReader$3.process Updating live nodes... (4)
[junit4] 2> 303688 T623 oascc.ZkStateReader$3.process Updating live nodes... (4)
[junit4] 2> 303688 T639 oascc.ZkStateReader$2.process A cluster state change: WatchedEvent state:SyncConnected type:NodeChildrenChanged path:/live_nodes, has occurred - updating... (live nodes size: 4)
[junit4] 2> 303689 T623 oascc.ZkStateReader$2.process A cluster state change: WatchedEvent state:SyncConnected type:NodeChildrenChanged path:/live_nodes, has occurred - updating... (live nodes size: 4)
[junit4] 2> 303690 T610 oascc.ZkStateReader$3.process Updating live nodes... (4)
[junit4] 2> 303690 T603 oascc.ZkStateReader$3.process Updating live nodes... (4)
[junit4] 2> 303703 T657 oasc.ZkController.publish publishing core=collection1 state=down
[junit4] 2> 303704 T657 oasc.ZkController.publish numShards not found on descriptor - reading it from system property
[junit4] 2> 303706 T657 oasc.ZkController.waitForCoreNodeName look for our core node name
[junit4] 2> 303869 T604 oascc.ZkStateReader.updateClusterState Updating cloud state from ZooKeeper...
[junit4] 2> 303870 T604 oasc.Overseer$ClusterStateUpdater.updateState Update state numShards=1 message={
[junit4] 2> "operation":"state",
[junit4] 2> "core_node_name":"core_node3",
[junit4] 2> "numShards":"1",
[junit4] 2> "shard":null,
[junit4] 2> "roles":null,
[junit4] 2> "state":"down",
[junit4] 2> "shard_state":"active",
[junit4] 2> "core":"collection1",
[junit4] 2> "collection":"collection1",
[junit4] 2> "shard_range":null,
[junit4] 2> "node_name":"127.0.0.1:17534_",
[junit4] 2> "base_url":"http://127.0.0.1:17534"}
[junit4] 2> 303870 T604 oasc.Overseer$ClusterStateUpdater.updateState Collection already exists with numShards=1
[junit4] 2> 303870 T604 oasc.Overseer$ClusterStateUpdater.updateState Assigning new node to shard shard=shard1
[junit4] 2> 303885 T656 oascc.ZkStateReader$2.process A cluster state change: WatchedEvent state:SyncConnected type:NodeDataChanged path:/clusterstate.json, has occurred - updating... (live nodes size: 4)
[junit4] 2> 303885 T603 oascc.ZkStateReader$2.process A cluster state change: WatchedEvent state:SyncConnected type:NodeDataChanged path:/clusterstate.json, has occurred - updating... (live nodes size: 4)
[junit4] 2> 303885 T639 oascc.ZkStateReader$2.process A cluster state change: WatchedEvent state:SyncConnected type:NodeDataChanged path:/clusterstate.json, has occurred - updating... (live nodes size: 4)
[junit4] 2> 303885 T623 oascc.ZkStateReader$2.process A cluster state change: WatchedEvent state:SyncConnected type:NodeDataChanged path:/clusterstate.json, has occurred - updating... (live nodes size: 4)
[junit4] 2> 303885 T610 oascc.ZkStateReader$2.process A cluster state change: WatchedEvent state:SyncConnected type:NodeDataChanged path:/clusterstate.json, has occurred - updating... (live nodes size: 4)
[junit4] 2> 304707 T657 oasc.ZkController.waitForShardId waiting to find shard id in clusterstate for collection1
[junit4] 2> 304707 T657 oasc.CoreContainer.create Creating SolrCore 'collection1' using instanceDir: ./org.apache.solr.cloud.SyncSliceTest-jetty3-1379147530469/collection1
[junit4] 2> 304707 T657 oasc.ZkController.createCollectionZkNode Check for collection zkNode:collection1
[junit4] 2> 304709 T657 oasc.ZkController.createCollectionZkNode Collection zkNode exists
[junit4] 2> 304709 T657 oasc.ZkController.readConfigName Load collection config from:/collections/collection1
[junit4] 2> 304710 T657 oasc.SolrResourceLoader.<init> new SolrResourceLoader for directory: './org.apache.solr.cloud.SyncSliceTest-jetty3-1379147530469/collection1/'
[junit4] 2> 304712 T657 oasc.SolrResourceLoader.replaceClassLoader Adding 'file:/usr/home/hudson/hudson-slave/workspace/Lucene-Solr-Tests-4.x-Java7/solr/build/solr-core/test/J0/org.apache.solr.cloud.SyncSliceTest-jetty3-1379147530469/collection1/lib/classes/' to classloader
[junit4] 2> 304712 T657 oasc.SolrResourceLoader.replaceClassLoader Adding 'file:/usr/home/hudson/hudson-slave/workspace/Lucene-Solr-Tests-4.x-Java7/solr/build/solr-core/test/J0/org.apache.solr.cloud.SyncSliceTest-jetty3-1379147530469/collection1/lib/README' to classloader
[junit4] 2> 304777 T657 oasc.SolrConfig.<init> Using Lucene MatchVersion: LUCENE_46
[junit4] 2> 304846 T657 oasc.SolrConfig.<init> Loaded SolrConfig: solrconfig.xml
[junit4] 2> 304948 T657 oass.IndexSchema.readSchema Reading Solr Schema from schema.xml
[junit4] 2> 304961 T657 oass.IndexSchema.readSchema [null] Schema name=test
[junit4] 2> ASYNC NEW_CORE C495 name=collection1 org.apache.solr.core.SolrCore@2c694c78 url=http://127.0.0.1:53155/collection1 node=127.0.0.1:53155_ C495_STATE=coll:collection1 core:collection1 props:{state=recovering, core=collection1, node_name=127.0.0.1:53155_, base_url=http://127.0.0.1:53155}
[junit4] 2> 305347 T642 C495 P53155 oasc.RecoveryStrategy.doRecovery Attempting to PeerSync from http://127.0.0.1:19156/collection1/ core=collection1 - recoveringAfterStartup=true
[junit4] 2> 305362 T642 C495 P53155 oascsi.HttpClientUtil.createClient Creating new http client, config:maxConnectionsPerHost=20&maxConnections=10000&connTimeout=30000&socketTimeout=30000&retry=false
[junit4] 2> 305388 T642 C495 P53155 oasu.PeerSync.sync PeerSync: core=collection1 url=http://127.0.0.1:53155 START replicas=[http://127.0.0.1:19156/collection1/] nUpdates=100
[junit4] 2> 305389 T642 C495 P53155 oasu.PeerSync.sync WARN no frame of reference to tell if we've missed updates
[junit4] 2> 305389 T642 C495 P53155 oasc.RecoveryStrategy.doRecovery PeerSync Recovery was not successful - trying replication. core=collection1
[junit4] 2> 305390 T642 C495 P53155 oasc.RecoveryStrategy.doRecovery Starting Replication Recovery. core=collection1
[junit4] 2> 305390 T642 C495 P53155 oasc.RecoveryStrategy.doRecovery Begin buffering updates. core=collection1
[junit4] 2> 305390 T642 C495 P53155 oasu.UpdateLog.bufferUpdates Starting to buffer updates. FSUpdateLog{state=ACTIVE, tlog=null}
[junit4] 2> 305390 T642 C495 P53155 oasc.RecoveryStrategy.replicate Attempting to replicate from http://127.0.0.1:19156/collection1/. core=collection1
[junit4] 2> 305391 T642 C495 P53155 oascsi.HttpClientUtil.createClient Creating new http client, config:maxConnections=128&maxConnectionsPerHost=32&followRedirects=false
[junit4] 2> ASYNC NEW_CORE C496 name=collection1 org.apache.solr.core.SolrCore@1f4645de url=http://127.0.0.1:19156/collection1 node=127.0.0.1:19156_ C496_STATE=coll:collection1 core:collection1 props:{state=active, core=collection1, node_name=127.0.0.1:19156_, base_url=http://127.0.0.1:19156, leader=true}
[junit4] 2> 305400 T614 C496 P19156 oasc.SolrCore.execute [collection1] webapp= path=/get params={getVersions=100&distrib=false&wt=javabin&qt=/get&version=2} status=0 QTime=1
[junit4] 2> 305446 T615 C496 P19156 oasu.DirectUpdateHandler2.commit start commit{,optimize=false,openSearcher=false,waitSearcher=true,expungeDeletes=false,softCommit=false,prepareCommit=false}
[junit4] 2> 305447 T615 C496 P19156 oasu.DirectUpdateHandler2.commit No uncommitted changes. Skipping IW.commit.
[junit4] 2> 305447 T615 C496 P19156 oasu.DirectUpdateHandler2.commit end_commit_flush
[junit4] 2> 305448 T615 C496 P19156 oasup.LogUpdateProcessor.finish [collection1] webapp= path=/update params={waitSearcher=true&openSearcher=false&commit=true&wt=javabin&commit_end_point=true&version=2&softCommit=false} {commit=} 0 41
[junit4] 2> 305542 T642 C495 P53155 oash.ReplicationHandler.inform Commits will be reserved for 10000
[junit4] 2> 305543 T642 C495 P53155 oascsi.HttpClientUtil.createClient Creating new http client, config:connTimeout=5000&socketTimeout=20000&allowCompression=false&maxConnections=10000&maxConnectionsPerHost=10000
[junit4] 2> 305572 T642 C495 P53155 oash.SnapPuller.<init> No value set for 'pollInterval'. Timer Task not started.
[junit4] 2> 305575 T616 C496 P19156 oash.ReplicationHandler.inform Commits will be reserved for 10000
[junit4] 2> 305576 T616 C496 P19156 oasc.SolrCore.execute [collection1] webapp= path=/replication p
[...truncated too long message...]
teHandler2.close closing DirectUpdateHandler2{commits=4,autocommits=0,soft autocommits=0,optimizes=0,rollbacks=0,expungeDeletes=0,docsPending=0,adds=0,deletesById=0,deletesByQuery=0,errors=0,cumulative_adds=35,cumulative_deletesById=0,cumulative_deletesByQuery=0,cumulative_errors=0}
[junit4] 2> 427914 T685 oasu.SolrCoreState.decrefSolrCoreState Closing SolrCoreState
[junit4] 2> 427914 T685 oasu.DefaultSolrCoreState.closeIndexWriter SolrCoreState ref count has reached 0 - closing IndexWriter
[junit4] 2> 427914 T685 oasu.DefaultSolrCoreState.closeIndexWriter closing IndexWriter with IndexWriterCloser
[junit4] 2> 427915 T685 oasc.SolrCore.closeSearcher [collection1] Closing main searcher on request.
[junit4] 2> 427916 T685 oasc.CachingDirectoryFactory.close Closing MockDirectoryFactory - 2 directories currently being tracked
[junit4] 2> 427916 T685 oasc.CachingDirectoryFactory.closeCacheValue looking to close ./org.apache.solr.cloud.BasicDistributedZk2Test-1379147567201/jetty4 [CachedDir<<refCount=0;path=./org.apache.solr.cloud.BasicDistributedZk2Test-1379147567201/jetty4;done=false>>]
[junit4] 2> 427916 T685 oasc.CachingDirectoryFactory.close Closing directory: ./org.apache.solr.cloud.BasicDistributedZk2Test-1379147567201/jetty4
[junit4] 2> 427917 T685 oasc.CachingDirectoryFactory.closeCacheValue looking to close ./org.apache.solr.cloud.BasicDistributedZk2Test-1379147567201/jetty4/index [CachedDir<<refCount=0;path=./org.apache.solr.cloud.BasicDistributedZk2Test-1379147567201/jetty4/index;done=false>>]
[junit4] 2> 427917 T685 oasc.CachingDirectoryFactory.close Closing directory: ./org.apache.solr.cloud.BasicDistributedZk2Test-1379147567201/jetty4/index
[junit4] 2> 427917 T685 oascc.SolrZkClient.makePath makePath: /collections/collection1/leaders/shard2
[junit4] 2> 427918 T685 oasc.SolrException.log ERROR There was a problem trying to register as the leader:org.apache.zookeeper.KeeperException$SessionExpiredException: KeeperErrorCode = Session expired for /collections
[junit4] 2> at org.apache.zookeeper.KeeperException.create(KeeperException.java:127)
[junit4] 2> at org.apache.zookeeper.KeeperException.create(KeeperException.java:51)
[junit4] 2> at org.apache.zookeeper.ZooKeeper.exists(ZooKeeper.java:1041)
[junit4] 2> at org.apache.solr.common.cloud.SolrZkClient$3.execute(SolrZkClient.java:184)
[junit4] 2> at org.apache.solr.common.cloud.SolrZkClient$3.execute(SolrZkClient.java:181)
[junit4] 2> at org.apache.solr.common.cloud.ZkCmdExecutor.retryOperation(ZkCmdExecutor.java:65)
[junit4] 2> at org.apache.solr.common.cloud.SolrZkClient.exists(SolrZkClient.java:181)
[junit4] 2> at org.apache.solr.common.cloud.SolrZkClient.makePath(SolrZkClient.java:392)
[junit4] 2> at org.apache.solr.common.cloud.SolrZkClient.makePath(SolrZkClient.java:361)
[junit4] 2> at org.apache.solr.common.cloud.SolrZkClient.makePath(SolrZkClient.java:348)
[junit4] 2> at org.apache.solr.cloud.ShardLeaderElectionContextBase.runLeaderProcess(ElectionContext.java:95)
[junit4] 2> at org.apache.solr.cloud.ShardLeaderElectionContext.runLeaderProcess(ElectionContext.java:255)
[junit4] 2> at org.apache.solr.cloud.LeaderElector.runIamLeaderProcess(LeaderElector.java:156)
[junit4] 2> at org.apache.solr.cloud.LeaderElector.checkIfIamLeader(LeaderElector.java:100)
[junit4] 2> at org.apache.solr.cloud.LeaderElector.access$000(LeaderElector.java:55)
[junit4] 2> at org.apache.solr.cloud.LeaderElector$1.process(LeaderElector.java:129)
[junit4] 2> at org.apache.zookeeper.ClientCnxn$EventThread.processEvent(ClientCnxn.java:519)
[junit4] 2> at org.apache.zookeeper.ClientCnxn$EventThread.run(ClientCnxn.java:495)
[junit4] 2>
[junit4] 2> 427918 T685 oasc.LeaderElector$1.process WARN org.apache.zookeeper.KeeperException$SessionExpiredException: KeeperErrorCode = Session expired for /collections/collection1/leader_elect/shard2/election/90383814989578252-core_node4-n_0000000001
[junit4] 2> at org.apache.zookeeper.KeeperException.create(KeeperException.java:127)
[junit4] 2> at org.apache.zookeeper.KeeperException.create(KeeperException.java:51)
[junit4] 2> at org.apache.zookeeper.ZooKeeper.delete(ZooKeeper.java:873)
[junit4] 2> at org.apache.solr.common.cloud.SolrZkClient$2.execute(SolrZkClient.java:152)
[junit4] 2> at org.apache.solr.common.cloud.SolrZkClient$2.execute(SolrZkClient.java:149)
[junit4] 2> at org.apache.solr.common.cloud.ZkCmdExecutor.retryOperation(ZkCmdExecutor.java:65)
[junit4] 2> at org.apache.solr.common.cloud.SolrZkClient.delete(SolrZkClient.java:149)
[junit4] 2> at org.apache.solr.cloud.ElectionContext.cancelElection(ElectionContext.java:63)
[junit4] 2> at org.apache.solr.cloud.ShardLeaderElectionContext.runLeaderProcess(ElectionContext.java:258)
[junit4] 2> at org.apache.solr.cloud.LeaderElector.runIamLeaderProcess(LeaderElector.java:156)
[junit4] 2> at org.apache.solr.cloud.LeaderElector.checkIfIamLeader(LeaderElector.java:100)
[junit4] 2> at org.apache.solr.cloud.LeaderElector.access$000(LeaderElector.java:55)
[junit4] 2> at org.apache.solr.cloud.LeaderElector$1.process(LeaderElector.java:129)
[junit4] 2> at org.apache.zookeeper.ClientCnxn$EventThread.processEvent(ClientCnxn.java:519)
[junit4] 2> at org.apache.zookeeper.ClientCnxn$EventThread.run(ClientCnxn.java:495)
[junit4] 2>
[junit4] 2> 427919 T685 oascc.ZkStateReader$3.process WARN ZooKeeper watch triggered, but Solr cannot talk to ZK
[junit4] 2> 427920 T685 oascc.ZkStateReader$2.process A cluster state change: WatchedEvent state:SyncConnected type:NodeChildrenChanged path:/live_nodes, has occurred - updating... (live nodes size: 3)
[junit4] 2> 427920 T685 oascc.ZkStateReader$2.process WARN ZooKeeper watch triggered, but Solr cannot talk to ZK
[junit4] 2> 427920 T685 oasc.LeaderElector$1.process WARN org.apache.zookeeper.KeeperException$SessionExpiredException: KeeperErrorCode = Session expired for /overseer_elect/election
[junit4] 2> at org.apache.zookeeper.KeeperException.create(KeeperException.java:127)
[junit4] 2> at org.apache.zookeeper.KeeperException.create(KeeperException.java:51)
[junit4] 2> at org.apache.zookeeper.ZooKeeper.getChildren(ZooKeeper.java:1468)
[junit4] 2> at org.apache.solr.common.cloud.SolrZkClient$6.execute(SolrZkClient.java:235)
[junit4] 2> at org.apache.solr.common.cloud.SolrZkClient$6.execute(SolrZkClient.java:232)
[junit4] 2> at org.apache.solr.common.cloud.ZkCmdExecutor.retryOperation(ZkCmdExecutor.java:65)
[junit4] 2> at org.apache.solr.common.cloud.SolrZkClient.getChildren(SolrZkClient.java:232)
[junit4] 2> at org.apache.solr.cloud.LeaderElector.checkIfIamLeader(LeaderElector.java:84)
[junit4] 2> at org.apache.solr.cloud.LeaderElector.access$000(LeaderElector.java:55)
[junit4] 2> at org.apache.solr.cloud.LeaderElector$1.process(LeaderElector.java:129)
[junit4] 2> at org.apache.zookeeper.ClientCnxn$EventThread.processEvent(ClientCnxn.java:519)
[junit4] 2> at org.apache.zookeeper.ClientCnxn$EventThread.run(ClientCnxn.java:495)
[junit4] 2>
[junit4] 2> NOTE: test params are: codec=Lucene42, sim=DefaultSimilarity, locale=ms, timezone=Atlantic/Faroe
[junit4] 2> NOTE: FreeBSD 9.1-RELEASE-p3 amd64/Oracle Corporation 1.7.0_25 (64-bit)/cpus=16,threads=2,free=186108328,total=264241152
[junit4] 2> NOTE: All tests run in this JVM: [TestSweetSpotSimilarityFactory, TestSolrXMLSerializer, TestSolrCoreProperties, PingRequestHandlerTest, PrimitiveFieldTypeTest, TestQueryTypes, TestClassNameShortening, TestDistributedSearch, DistributedSpellCheckComponentTest, TestRandomFaceting, TestXIncludeConfig, TestOmitPositions, TestCSVResponseWriter, QueryParsingTest, TestShardHandlerFactory, HighlighterConfigTest, NotRequiredUniqueKeyTest, TestLMJelinekMercerSimilarityFactory, StatelessScriptUpdateProcessorFactoryTest, TestQueryUtils, TestSchemaSimilarityResource, SpellingQueryConverterTest, TestSolrJ, CachingDirectoryFactoryTest, DirectUpdateHandlerOptimizeTest, TestFieldTypeCollectionResource, TestBinaryResponseWriter, TestCopyFieldCollectionResource, TermsComponentTest, HdfsRecoveryZkTest, TestFieldResource, HdfsChaosMonkeySafeLeaderTest, BJQParserTest, TestIndexSearcher, AnalysisAfterCoreReloadTest, SuggesterWFSTTest, TestLRUCache, FieldMutatingUpdateProcessorTest, HdfsSyncSliceTest, DocValuesMissingTest, TestCoreDiscovery, BasicDistributedZk2Test]
[junit4] Completed on J1 in 89.24s, 1 test, 1 error <<< FAILURES!
[...truncated 743 lines...]
BUILD FAILED
/usr/home/hudson/hudson-slave/workspace/Lucene-Solr-Tests-4.x-Java7/build.xml:402: The following error occurred while executing this line:
/usr/home/hudson/hudson-slave/workspace/Lucene-Solr-Tests-4.x-Java7/build.xml:382: The following error occurred while executing this line:
/usr/home/hudson/hudson-slave/workspace/Lucene-Solr-Tests-4.x-Java7/build.xml:39: The following error occurred while executing this line:
/usr/home/hudson/hudson-slave/workspace/Lucene-Solr-Tests-4.x-Java7/solr/build.xml:189: The following error occurred while executing this line:
/usr/home/hudson/hudson-slave/workspace/Lucene-Solr-Tests-4.x-Java7/solr/common-build.xml:455: The following error occurred while executing this line:
/usr/home/hudson/hudson-slave/workspace/Lucene-Solr-Tests-4.x-Java7/lucene/common-build.xml:1233: The following error occurred while executing this line:
/usr/home/hudson/hudson-slave/workspace/Lucene-Solr-Tests-4.x-Java7/lucene/common-build.xml:876: There were test failures: 326 suites, 1451 tests, 1 error, 1 failure, 34 ignored (6 assumptions)
Total time: 54 minutes 48 seconds
Build step 'Invoke Ant' marked build as failure
Archiving artifacts
Recording test results
Email was triggered for: Failure
Sending email for trigger: Failure
[JENKINS] Lucene-Solr-Tests-4.x-Java7 - Build # 1592 - Still
Failing
Posted by Apache Jenkins Server <je...@builds.apache.org>.
Build: https://builds.apache.org/job/Lucene-Solr-Tests-4.x-Java7/1592/
3 tests failed.
REGRESSION: org.apache.solr.cloud.FullSolrCloudDistribCmdsTest.testDistribSearch
Error Message:
Stack Trace:
java.lang.NullPointerException
at __randomizedtesting.SeedInfo.seed([C18C4FA2DDAD70E6:406AC1BAAAF210DA]:0)
at org.apache.solr.common.cloud.ZkCoreNodeProps.getBaseUrl(ZkCoreNodeProps.java:40)
at org.apache.solr.client.solrj.impl.CloudSolrServer.buildUrlMap(CloudSolrServer.java:406)
at org.apache.solr.client.solrj.impl.CloudSolrServer.directUpdate(CloudSolrServer.java:304)
at org.apache.solr.client.solrj.impl.CloudSolrServer.request(CloudSolrServer.java:498)
at org.apache.solr.client.solrj.request.AbstractUpdateRequest.process(AbstractUpdateRequest.java:117)
at org.apache.solr.cloud.AbstractFullDistribZkTestBase.index_specific(AbstractFullDistribZkTestBase.java:663)
at org.apache.solr.cloud.FullSolrCloudDistribCmdsTest.testThatCantForwardToLeaderFails(FullSolrCloudDistribCmdsTest.java:151)
at org.apache.solr.cloud.FullSolrCloudDistribCmdsTest.doTest(FullSolrCloudDistribCmdsTest.java:133)
at org.apache.solr.BaseDistributedSearchTestCase.testDistribSearch(BaseDistributedSearchTestCase.java:835)
at sun.reflect.NativeMethodAccessorImpl.invoke0(Native Method)
at sun.reflect.NativeMethodAccessorImpl.invoke(NativeMethodAccessorImpl.java:57)
at sun.reflect.DelegatingMethodAccessorImpl.invoke(DelegatingMethodAccessorImpl.java:43)
at java.lang.reflect.Method.invoke(Method.java:606)
at com.carrotsearch.randomizedtesting.RandomizedRunner.invoke(RandomizedRunner.java:1559)
at com.carrotsearch.randomizedtesting.RandomizedRunner.access$600(RandomizedRunner.java:79)
at com.carrotsearch.randomizedtesting.RandomizedRunner$6.evaluate(RandomizedRunner.java:737)
at com.carrotsearch.randomizedtesting.RandomizedRunner$7.evaluate(RandomizedRunner.java:773)
at com.carrotsearch.randomizedtesting.RandomizedRunner$8.evaluate(RandomizedRunner.java:787)
at com.carrotsearch.randomizedtesting.rules.SystemPropertiesRestoreRule$1.evaluate(SystemPropertiesRestoreRule.java:53)
at org.apache.lucene.util.TestRuleSetupTeardownChained$1.evaluate(TestRuleSetupTeardownChained.java:50)
at org.apache.lucene.util.TestRuleFieldCacheSanity$1.evaluate(TestRuleFieldCacheSanity.java:51)
at org.apache.lucene.util.AbstractBeforeAfterRule$1.evaluate(AbstractBeforeAfterRule.java:46)
at com.carrotsearch.randomizedtesting.rules.SystemPropertiesInvariantRule$1.evaluate(SystemPropertiesInvariantRule.java:55)
at org.apache.lucene.util.TestRuleThreadAndTestName$1.evaluate(TestRuleThreadAndTestName.java:49)
at org.apache.lucene.util.TestRuleIgnoreAfterMaxFailures$1.evaluate(TestRuleIgnoreAfterMaxFailures.java:70)
at org.apache.lucene.util.TestRuleMarkFailure$1.evaluate(TestRuleMarkFailure.java:48)
at com.carrotsearch.randomizedtesting.rules.StatementAdapter.evaluate(StatementAdapter.java:36)
at com.carrotsearch.randomizedtesting.ThreadLeakControl$StatementRunner.run(ThreadLeakControl.java:358)
at com.carrotsearch.randomizedtesting.ThreadLeakControl.forkTimeoutingTask(ThreadLeakControl.java:782)
at com.carrotsearch.randomizedtesting.ThreadLeakControl$3.evaluate(ThreadLeakControl.java:442)
at com.carrotsearch.randomizedtesting.RandomizedRunner.runSingleTest(RandomizedRunner.java:746)
at com.carrotsearch.randomizedtesting.RandomizedRunner$3.evaluate(RandomizedRunner.java:648)
at com.carrotsearch.randomizedtesting.RandomizedRunner$4.evaluate(RandomizedRunner.java:682)
at com.carrotsearch.randomizedtesting.RandomizedRunner$5.evaluate(RandomizedRunner.java:693)
at com.carrotsearch.randomizedtesting.rules.StatementAdapter.evaluate(StatementAdapter.java:36)
at com.carrotsearch.randomizedtesting.rules.SystemPropertiesRestoreRule$1.evaluate(SystemPropertiesRestoreRule.java:53)
at org.apache.lucene.util.AbstractBeforeAfterRule$1.evaluate(AbstractBeforeAfterRule.java:46)
at org.apache.lucene.util.TestRuleStoreClassName$1.evaluate(TestRuleStoreClassName.java:42)
at com.carrotsearch.randomizedtesting.rules.SystemPropertiesInvariantRule$1.evaluate(SystemPropertiesInvariantRule.java:55)
at com.carrotsearch.randomizedtesting.rules.NoShadowingOrOverridesOnMethodsRule$1.evaluate(NoShadowingOrOverridesOnMethodsRule.java:39)
at com.carrotsearch.randomizedtesting.rules.NoShadowingOrOverridesOnMethodsRule$1.evaluate(NoShadowingOrOverridesOnMethodsRule.java:39)
at com.carrotsearch.randomizedtesting.rules.StatementAdapter.evaluate(StatementAdapter.java:36)
at org.apache.lucene.util.TestRuleAssertionsRequired$1.evaluate(TestRuleAssertionsRequired.java:43)
at org.apache.lucene.util.TestRuleMarkFailure$1.evaluate(TestRuleMarkFailure.java:48)
at org.apache.lucene.util.TestRuleIgnoreAfterMaxFailures$1.evaluate(TestRuleIgnoreAfterMaxFailures.java:70)
at org.apache.lucene.util.TestRuleIgnoreTestSuites$1.evaluate(TestRuleIgnoreTestSuites.java:55)
at com.carrotsearch.randomizedtesting.rules.StatementAdapter.evaluate(StatementAdapter.java:36)
at com.carrotsearch.randomizedtesting.ThreadLeakControl$StatementRunner.run(ThreadLeakControl.java:358)
at java.lang.Thread.run(Thread.java:724)
FAILED: org.apache.solr.cloud.SyncSliceTest.testDistribSearch
Error Message:
expected:<5> but was:<4>
Stack Trace:
java.lang.AssertionError: expected:<5> but was:<4>
at __randomizedtesting.SeedInfo.seed([C18C4FA2DDAD70E6:406AC1BAAAF210DA]:0)
at org.junit.Assert.fail(Assert.java:93)
at org.junit.Assert.failNotEquals(Assert.java:647)
at org.junit.Assert.assertEquals(Assert.java:128)
at org.junit.Assert.assertEquals(Assert.java:472)
at org.junit.Assert.assertEquals(Assert.java:456)
at org.apache.solr.cloud.SyncSliceTest.doTest(SyncSliceTest.java:175)
at org.apache.solr.BaseDistributedSearchTestCase.testDistribSearch(BaseDistributedSearchTestCase.java:835)
at sun.reflect.NativeMethodAccessorImpl.invoke0(Native Method)
at sun.reflect.NativeMethodAccessorImpl.invoke(NativeMethodAccessorImpl.java:57)
at sun.reflect.DelegatingMethodAccessorImpl.invoke(DelegatingMethodAccessorImpl.java:43)
at java.lang.reflect.Method.invoke(Method.java:606)
at com.carrotsearch.randomizedtesting.RandomizedRunner.invoke(RandomizedRunner.java:1559)
at com.carrotsearch.randomizedtesting.RandomizedRunner.access$600(RandomizedRunner.java:79)
at com.carrotsearch.randomizedtesting.RandomizedRunner$6.evaluate(RandomizedRunner.java:737)
at com.carrotsearch.randomizedtesting.RandomizedRunner$7.evaluate(RandomizedRunner.java:773)
at com.carrotsearch.randomizedtesting.RandomizedRunner$8.evaluate(RandomizedRunner.java:787)
at com.carrotsearch.randomizedtesting.rules.SystemPropertiesRestoreRule$1.evaluate(SystemPropertiesRestoreRule.java:53)
at org.apache.lucene.util.TestRuleSetupTeardownChained$1.evaluate(TestRuleSetupTeardownChained.java:50)
at org.apache.lucene.util.TestRuleFieldCacheSanity$1.evaluate(TestRuleFieldCacheSanity.java:51)
at org.apache.lucene.util.AbstractBeforeAfterRule$1.evaluate(AbstractBeforeAfterRule.java:46)
at com.carrotsearch.randomizedtesting.rules.SystemPropertiesInvariantRule$1.evaluate(SystemPropertiesInvariantRule.java:55)
at org.apache.lucene.util.TestRuleThreadAndTestName$1.evaluate(TestRuleThreadAndTestName.java:49)
at org.apache.lucene.util.TestRuleIgnoreAfterMaxFailures$1.evaluate(TestRuleIgnoreAfterMaxFailures.java:70)
at org.apache.lucene.util.TestRuleMarkFailure$1.evaluate(TestRuleMarkFailure.java:48)
at com.carrotsearch.randomizedtesting.rules.StatementAdapter.evaluate(StatementAdapter.java:36)
at com.carrotsearch.randomizedtesting.ThreadLeakControl$StatementRunner.run(ThreadLeakControl.java:358)
at com.carrotsearch.randomizedtesting.ThreadLeakControl.forkTimeoutingTask(ThreadLeakControl.java:782)
at com.carrotsearch.randomizedtesting.ThreadLeakControl$3.evaluate(ThreadLeakControl.java:442)
at com.carrotsearch.randomizedtesting.RandomizedRunner.runSingleTest(RandomizedRunner.java:746)
at com.carrotsearch.randomizedtesting.RandomizedRunner$3.evaluate(RandomizedRunner.java:648)
at com.carrotsearch.randomizedtesting.RandomizedRunner$4.evaluate(RandomizedRunner.java:682)
at com.carrotsearch.randomizedtesting.RandomizedRunner$5.evaluate(RandomizedRunner.java:693)
at com.carrotsearch.randomizedtesting.rules.StatementAdapter.evaluate(StatementAdapter.java:36)
at com.carrotsearch.randomizedtesting.rules.SystemPropertiesRestoreRule$1.evaluate(SystemPropertiesRestoreRule.java:53)
at org.apache.lucene.util.AbstractBeforeAfterRule$1.evaluate(AbstractBeforeAfterRule.java:46)
at org.apache.lucene.util.TestRuleStoreClassName$1.evaluate(TestRuleStoreClassName.java:42)
at com.carrotsearch.randomizedtesting.rules.SystemPropertiesInvariantRule$1.evaluate(SystemPropertiesInvariantRule.java:55)
at com.carrotsearch.randomizedtesting.rules.NoShadowingOrOverridesOnMethodsRule$1.evaluate(NoShadowingOrOverridesOnMethodsRule.java:39)
at com.carrotsearch.randomizedtesting.rules.NoShadowingOrOverridesOnMethodsRule$1.evaluate(NoShadowingOrOverridesOnMethodsRule.java:39)
at com.carrotsearch.randomizedtesting.rules.StatementAdapter.evaluate(StatementAdapter.java:36)
at org.apache.lucene.util.TestRuleAssertionsRequired$1.evaluate(TestRuleAssertionsRequired.java:43)
at org.apache.lucene.util.TestRuleMarkFailure$1.evaluate(TestRuleMarkFailure.java:48)
at org.apache.lucene.util.TestRuleIgnoreAfterMaxFailures$1.evaluate(TestRuleIgnoreAfterMaxFailures.java:70)
at org.apache.lucene.util.TestRuleIgnoreTestSuites$1.evaluate(TestRuleIgnoreTestSuites.java:55)
at com.carrotsearch.randomizedtesting.rules.StatementAdapter.evaluate(StatementAdapter.java:36)
at com.carrotsearch.randomizedtesting.ThreadLeakControl$StatementRunner.run(ThreadLeakControl.java:358)
at java.lang.Thread.run(Thread.java:724)
FAILED: org.apache.solr.cloud.BasicDistributedZk2Test.testDistribSearch
Error Message:
Stack Trace:
java.lang.NullPointerException
at __randomizedtesting.SeedInfo.seed([C18C4FA2DDAD70E6:406AC1BAAAF210DA]:0)
at org.apache.solr.common.cloud.ZkCoreNodeProps.getBaseUrl(ZkCoreNodeProps.java:40)
at org.apache.solr.client.solrj.impl.CloudSolrServer.buildUrlMap(CloudSolrServer.java:406)
at org.apache.solr.client.solrj.impl.CloudSolrServer.directUpdate(CloudSolrServer.java:304)
at org.apache.solr.client.solrj.impl.CloudSolrServer.request(CloudSolrServer.java:498)
at org.apache.solr.client.solrj.request.AbstractUpdateRequest.process(AbstractUpdateRequest.java:117)
at org.apache.solr.client.solrj.SolrServer.commit(SolrServer.java:168)
at org.apache.solr.client.solrj.SolrServer.commit(SolrServer.java:146)
at org.apache.solr.cloud.AbstractFullDistribZkTestBase.commit(AbstractFullDistribZkTestBase.java:1517)
at org.apache.solr.cloud.BasicDistributedZk2Test.brindDownShardIndexSomeDocsAndRecover(BasicDistributedZk2Test.java:288)
at org.apache.solr.cloud.BasicDistributedZk2Test.doTest(BasicDistributedZk2Test.java:115)
at org.apache.solr.BaseDistributedSearchTestCase.testDistribSearch(BaseDistributedSearchTestCase.java:835)
at sun.reflect.NativeMethodAccessorImpl.invoke0(Native Method)
at sun.reflect.NativeMethodAccessorImpl.invoke(NativeMethodAccessorImpl.java:57)
at sun.reflect.DelegatingMethodAccessorImpl.invoke(DelegatingMethodAccessorImpl.java:43)
at java.lang.reflect.Method.invoke(Method.java:606)
at com.carrotsearch.randomizedtesting.RandomizedRunner.invoke(RandomizedRunner.java:1559)
at com.carrotsearch.randomizedtesting.RandomizedRunner.access$600(RandomizedRunner.java:79)
at com.carrotsearch.randomizedtesting.RandomizedRunner$6.evaluate(RandomizedRunner.java:737)
at com.carrotsearch.randomizedtesting.RandomizedRunner$7.evaluate(RandomizedRunner.java:773)
at com.carrotsearch.randomizedtesting.RandomizedRunner$8.evaluate(RandomizedRunner.java:787)
at com.carrotsearch.randomizedtesting.rules.SystemPropertiesRestoreRule$1.evaluate(SystemPropertiesRestoreRule.java:53)
at org.apache.lucene.util.TestRuleSetupTeardownChained$1.evaluate(TestRuleSetupTeardownChained.java:50)
at org.apache.lucene.util.TestRuleFieldCacheSanity$1.evaluate(TestRuleFieldCacheSanity.java:51)
at org.apache.lucene.util.AbstractBeforeAfterRule$1.evaluate(AbstractBeforeAfterRule.java:46)
at com.carrotsearch.randomizedtesting.rules.SystemPropertiesInvariantRule$1.evaluate(SystemPropertiesInvariantRule.java:55)
at org.apache.lucene.util.TestRuleThreadAndTestName$1.evaluate(TestRuleThreadAndTestName.java:49)
at org.apache.lucene.util.TestRuleIgnoreAfterMaxFailures$1.evaluate(TestRuleIgnoreAfterMaxFailures.java:70)
at org.apache.lucene.util.TestRuleMarkFailure$1.evaluate(TestRuleMarkFailure.java:48)
at com.carrotsearch.randomizedtesting.rules.StatementAdapter.evaluate(StatementAdapter.java:36)
at com.carrotsearch.randomizedtesting.ThreadLeakControl$StatementRunner.run(ThreadLeakControl.java:358)
at com.carrotsearch.randomizedtesting.ThreadLeakControl.forkTimeoutingTask(ThreadLeakControl.java:782)
at com.carrotsearch.randomizedtesting.ThreadLeakControl$3.evaluate(ThreadLeakControl.java:442)
at com.carrotsearch.randomizedtesting.RandomizedRunner.runSingleTest(RandomizedRunner.java:746)
at com.carrotsearch.randomizedtesting.RandomizedRunner$3.evaluate(RandomizedRunner.java:648)
at com.carrotsearch.randomizedtesting.RandomizedRunner$4.evaluate(RandomizedRunner.java:682)
at com.carrotsearch.randomizedtesting.RandomizedRunner$5.evaluate(RandomizedRunner.java:693)
at com.carrotsearch.randomizedtesting.rules.StatementAdapter.evaluate(StatementAdapter.java:36)
at com.carrotsearch.randomizedtesting.rules.SystemPropertiesRestoreRule$1.evaluate(SystemPropertiesRestoreRule.java:53)
at org.apache.lucene.util.AbstractBeforeAfterRule$1.evaluate(AbstractBeforeAfterRule.java:46)
at org.apache.lucene.util.TestRuleStoreClassName$1.evaluate(TestRuleStoreClassName.java:42)
at com.carrotsearch.randomizedtesting.rules.SystemPropertiesInvariantRule$1.evaluate(SystemPropertiesInvariantRule.java:55)
at com.carrotsearch.randomizedtesting.rules.NoShadowingOrOverridesOnMethodsRule$1.evaluate(NoShadowingOrOverridesOnMethodsRule.java:39)
at com.carrotsearch.randomizedtesting.rules.NoShadowingOrOverridesOnMethodsRule$1.evaluate(NoShadowingOrOverridesOnMethodsRule.java:39)
at com.carrotsearch.randomizedtesting.rules.StatementAdapter.evaluate(StatementAdapter.java:36)
at org.apache.lucene.util.TestRuleAssertionsRequired$1.evaluate(TestRuleAssertionsRequired.java:43)
at org.apache.lucene.util.TestRuleMarkFailure$1.evaluate(TestRuleMarkFailure.java:48)
at org.apache.lucene.util.TestRuleIgnoreAfterMaxFailures$1.evaluate(TestRuleIgnoreAfterMaxFailures.java:70)
at org.apache.lucene.util.TestRuleIgnoreTestSuites$1.evaluate(TestRuleIgnoreTestSuites.java:55)
at com.carrotsearch.randomizedtesting.rules.StatementAdapter.evaluate(StatementAdapter.java:36)
at com.carrotsearch.randomizedtesting.ThreadLeakControl$StatementRunner.run(ThreadLeakControl.java:358)
at java.lang.Thread.run(Thread.java:724)
Build Log:
[...truncated 9947 lines...]
[junit4] Suite: org.apache.solr.cloud.SyncSliceTest
[junit4] 2> 863321 T2289 oas.BaseDistributedSearchTestCase.initHostContext Setting hostContext system property: /_qp/fo
[junit4] 2> 863327 T2289 oas.SolrTestCaseJ4.setUp ###Starting testDistribSearch
[junit4] 2> Creating dataDir: /usr/home/hudson/hudson-slave/workspace/Lucene-Solr-Tests-4.x-Java7/solr/build/solr-core/test/J1/./solrtest-SyncSliceTest-1379175557455
[junit4] 2> 863329 T2289 oasc.ZkTestServer.run STARTING ZK TEST SERVER
[junit4] 2> 863330 T2290 oasc.ZkTestServer$ZKServerMain.runFromConfig Starting server
[junit4] 2> 863431 T2289 oasc.ZkTestServer.run start zk server on port:34991
[junit4] 2> 863432 T2289 oascc.ConnectionManager.waitForConnected Waiting for client to connect to ZooKeeper
[junit4] 2> 863438 T2296 oascc.ConnectionManager.process Watcher org.apache.solr.common.cloud.ConnectionManager@64cc733e name:ZooKeeperConnection Watcher:127.0.0.1:34991 got event WatchedEvent state:SyncConnected type:None path:null path:null type:None
[junit4] 2> 863438 T2289 oascc.ConnectionManager.waitForConnected Client is connected to ZooKeeper
[junit4] 2> 863438 T2289 oascc.SolrZkClient.makePath makePath: /solr
[junit4] 2> 863456 T2289 oascc.ConnectionManager.waitForConnected Waiting for client to connect to ZooKeeper
[junit4] 2> 863458 T2298 oascc.ConnectionManager.process Watcher org.apache.solr.common.cloud.ConnectionManager@ca50ade name:ZooKeeperConnection Watcher:127.0.0.1:34991/solr got event WatchedEvent state:SyncConnected type:None path:null path:null type:None
[junit4] 2> 863458 T2289 oascc.ConnectionManager.waitForConnected Client is connected to ZooKeeper
[junit4] 2> 863459 T2289 oascc.SolrZkClient.makePath makePath: /collections/collection1
[junit4] 2> 863469 T2289 oascc.SolrZkClient.makePath makePath: /collections/collection1/shards
[junit4] 2> 863471 T2289 oascc.SolrZkClient.makePath makePath: /collections/control_collection
[junit4] 2> 863474 T2289 oascc.SolrZkClient.makePath makePath: /collections/control_collection/shards
[junit4] 2> 863482 T2289 oasc.AbstractZkTestCase.putConfig put /usr/home/hudson/hudson-slave/workspace/Lucene-Solr-Tests-4.x-Java7/solr/build/solr-core/test-files/solr/collection1/conf/solrconfig-tlog.xml to /configs/conf1/solrconfig.xml
[junit4] 2> 863483 T2289 oascc.SolrZkClient.makePath makePath: /configs/conf1/solrconfig.xml
[junit4] 2> 863496 T2289 oasc.AbstractZkTestCase.putConfig put /usr/home/hudson/hudson-slave/workspace/Lucene-Solr-Tests-4.x-Java7/solr/build/solr-core/test-files/solr/collection1/conf/schema.xml to /configs/conf1/schema.xml
[junit4] 2> 863497 T2289 oascc.SolrZkClient.makePath makePath: /configs/conf1/schema.xml
[junit4] 2> 863601 T2289 oasc.AbstractZkTestCase.putConfig put /usr/home/hudson/hudson-slave/workspace/Lucene-Solr-Tests-4.x-Java7/solr/build/solr-core/test-files/solr/collection1/conf/solrconfig.snippet.randomindexconfig.xml to /configs/conf1/solrconfig.snippet.randomindexconfig.xml
[junit4] 2> 863602 T2289 oascc.SolrZkClient.makePath makePath: /configs/conf1/solrconfig.snippet.randomindexconfig.xml
[junit4] 2> 863605 T2289 oasc.AbstractZkTestCase.putConfig put /usr/home/hudson/hudson-slave/workspace/Lucene-Solr-Tests-4.x-Java7/solr/build/solr-core/test-files/solr/collection1/conf/stopwords.txt to /configs/conf1/stopwords.txt
[junit4] 2> 863606 T2289 oascc.SolrZkClient.makePath makePath: /configs/conf1/stopwords.txt
[junit4] 2> 863615 T2289 oasc.AbstractZkTestCase.putConfig put /usr/home/hudson/hudson-slave/workspace/Lucene-Solr-Tests-4.x-Java7/solr/build/solr-core/test-files/solr/collection1/conf/protwords.txt to /configs/conf1/protwords.txt
[junit4] 2> 863615 T2289 oascc.SolrZkClient.makePath makePath: /configs/conf1/protwords.txt
[junit4] 2> 863618 T2289 oasc.AbstractZkTestCase.putConfig put /usr/home/hudson/hudson-slave/workspace/Lucene-Solr-Tests-4.x-Java7/solr/build/solr-core/test-files/solr/collection1/conf/currency.xml to /configs/conf1/currency.xml
[junit4] 2> 863619 T2289 oascc.SolrZkClient.makePath makePath: /configs/conf1/currency.xml
[junit4] 2> 863621 T2289 oasc.AbstractZkTestCase.putConfig put /usr/home/hudson/hudson-slave/workspace/Lucene-Solr-Tests-4.x-Java7/solr/build/solr-core/test-files/solr/collection1/conf/open-exchange-rates.json to /configs/conf1/open-exchange-rates.json
[junit4] 2> 863622 T2289 oascc.SolrZkClient.makePath makePath: /configs/conf1/open-exchange-rates.json
[junit4] 2> 863625 T2289 oasc.AbstractZkTestCase.putConfig put /usr/home/hudson/hudson-slave/workspace/Lucene-Solr-Tests-4.x-Java7/solr/build/solr-core/test-files/solr/collection1/conf/mapping-ISOLatin1Accent.txt to /configs/conf1/mapping-ISOLatin1Accent.txt
[junit4] 2> 863625 T2289 oascc.SolrZkClient.makePath makePath: /configs/conf1/mapping-ISOLatin1Accent.txt
[junit4] 2> 863633 T2289 oasc.AbstractZkTestCase.putConfig put /usr/home/hudson/hudson-slave/workspace/Lucene-Solr-Tests-4.x-Java7/solr/build/solr-core/test-files/solr/collection1/conf/old_synonyms.txt to /configs/conf1/old_synonyms.txt
[junit4] 2> 863633 T2289 oascc.SolrZkClient.makePath makePath: /configs/conf1/old_synonyms.txt
[junit4] 2> 863636 T2289 oasc.AbstractZkTestCase.putConfig put /usr/home/hudson/hudson-slave/workspace/Lucene-Solr-Tests-4.x-Java7/solr/build/solr-core/test-files/solr/collection1/conf/synonyms.txt to /configs/conf1/synonyms.txt
[junit4] 2> 863637 T2289 oascc.SolrZkClient.makePath makePath: /configs/conf1/synonyms.txt
[junit4] 2> 863862 T2289 oejs.Server.doStart jetty-8.1.10.v20130312
[junit4] 2> 863868 T2289 oejs.AbstractConnector.doStart Started SocketConnector@127.0.0.1:?????
[junit4] 2> 863869 T2289 oass.SolrDispatchFilter.init SolrDispatchFilter.init()
[junit4] 2> 863869 T2289 oasc.SolrResourceLoader.locateSolrHome JNDI not configured for solr (NoInitialContextEx)
[junit4] 2> 863870 T2289 oasc.SolrResourceLoader.locateSolrHome using system property solr.solr.home: ../../../../../../../../../../../usr/home/hudson/hudson-slave/workspace/Lucene-Solr-Tests-4.x-Java7/solr/build/solr-core/test/J1/./org.apache.solr.cloud.SyncSliceTest-controljetty-1379175557774
[junit4] 2> 863870 T2289 oasc.SolrResourceLoader.<init> new SolrResourceLoader for directory: '../../../../../../../../../../../usr/home/hudson/hudson-slave/workspace/Lucene-Solr-Tests-4.x-Java7/solr/build/solr-core/test/J1/./org.apache.solr.cloud.SyncSliceTest-controljetty-1379175557774/'
[junit4] 2> 863913 T2289 oasc.ConfigSolr.fromFile Loading container configuration from /usr/home/hudson/hudson-slave/workspace/Lucene-Solr-Tests-4.x-Java7/solr/build/solr-core/test/J1/../../../../../../../../../../../usr/home/hudson/hudson-slave/workspace/Lucene-Solr-Tests-4.x-Java7/solr/build/solr-core/test/J1/./org.apache.solr.cloud.SyncSliceTest-controljetty-1379175557774/solr.xml
[junit4] 2> 864008 T2289 oasc.CoreContainer.<init> New CoreContainer 520314945
[junit4] 2> 864009 T2289 oasc.CoreContainer.load Loading cores into CoreContainer [instanceDir=../../../../../../../../../../../usr/home/hudson/hudson-slave/workspace/Lucene-Solr-Tests-4.x-Java7/solr/build/solr-core/test/J1/./org.apache.solr.cloud.SyncSliceTest-controljetty-1379175557774/]
[junit4] 2> 864011 T2289 oashc.HttpShardHandlerFactory.getParameter Setting socketTimeout to: 120000
[junit4] 2> 864011 T2289 oashc.HttpShardHandlerFactory.getParameter Setting urlScheme to: http://
[junit4] 2> 864012 T2289 oashc.HttpShardHandlerFactory.getParameter Setting connTimeout to: 15000
[junit4] 2> 864012 T2289 oashc.HttpShardHandlerFactory.getParameter Setting maxConnectionsPerHost to: 20
[junit4] 2> 864012 T2289 oashc.HttpShardHandlerFactory.getParameter Setting corePoolSize to: 0
[junit4] 2> 864013 T2289 oashc.HttpShardHandlerFactory.getParameter Setting maximumPoolSize to: 2147483647
[junit4] 2> 864013 T2289 oashc.HttpShardHandlerFactory.getParameter Setting maxThreadIdleTime to: 5
[junit4] 2> 864014 T2289 oashc.HttpShardHandlerFactory.getParameter Setting sizeOfQueue to: -1
[junit4] 2> 864014 T2289 oashc.HttpShardHandlerFactory.getParameter Setting fairnessPolicy to: false
[junit4] 2> 864015 T2289 oascsi.HttpClientUtil.createClient Creating new http client, config:maxConnectionsPerHost=20&maxConnections=10000&socketTimeout=120000&connTimeout=15000&retry=false
[junit4] 2> 864033 T2289 oasl.LogWatcher.createWatcher SLF4J impl is org.slf4j.impl.Log4jLoggerFactory
[junit4] 2> 864033 T2289 oasl.LogWatcher.newRegisteredLogWatcher Registering Log Listener [Log4j (org.slf4j.impl.Log4jLoggerFactory)]
[junit4] 2> 864034 T2289 oasc.ZkContainer.initZooKeeper Zookeeper client=127.0.0.1:34991/solr
[junit4] 2> 864035 T2289 oasc.ZkController.checkChrootPath zkHost includes chroot
[junit4] 2> 864036 T2289 oascc.ConnectionManager.waitForConnected Waiting for client to connect to ZooKeeper
[junit4] 2> 864039 T2309 oascc.ConnectionManager.process Watcher org.apache.solr.common.cloud.ConnectionManager@153f3c00 name:ZooKeeperConnection Watcher:127.0.0.1:34991 got event WatchedEvent state:SyncConnected type:None path:null path:null type:None
[junit4] 2> 864039 T2289 oascc.ConnectionManager.waitForConnected Client is connected to ZooKeeper
[junit4] 2> 864057 T2289 oascsi.HttpClientUtil.createClient Creating new http client, config:maxConnections=500&maxConnectionsPerHost=16&socketTimeout=120000&connTimeout=15000
[junit4] 2> 864070 T2289 oascc.ConnectionManager.waitForConnected Waiting for client to connect to ZooKeeper
[junit4] 2> 864072 T2311 oascc.ConnectionManager.process Watcher org.apache.solr.common.cloud.ConnectionManager@2ae303ba name:ZooKeeperConnection Watcher:127.0.0.1:34991/solr got event WatchedEvent state:SyncConnected type:None path:null path:null type:None
[junit4] 2> 864072 T2289 oascc.ConnectionManager.waitForConnected Client is connected to ZooKeeper
[junit4] 2> 864076 T2289 oascc.SolrZkClient.makePath makePath: /overseer/queue
[junit4] 2> 864080 T2289 oascc.SolrZkClient.makePath makePath: /overseer/collection-queue-work
[junit4] 2> 864088 T2289 oascc.SolrZkClient.makePath makePath: /live_nodes
[junit4] 2> 864090 T2289 oasc.ZkController.createEphemeralLiveNode Register node as live in ZooKeeper:/live_nodes/127.0.0.1:34994__qp%2Ffo
[junit4] 2> 864092 T2289 oascc.SolrZkClient.makePath makePath: /live_nodes/127.0.0.1:34994__qp%2Ffo
[junit4] 2> 864100 T2289 oascc.SolrZkClient.makePath makePath: /overseer_elect/election
[junit4] 2> 864112 T2289 oascc.SolrZkClient.makePath makePath: /overseer_elect/leader
[junit4] 2> 864119 T2289 oasc.Overseer.start Overseer (id=90385649333895171-127.0.0.1:34994__qp%2Ffo-n_0000000000) starting
[junit4] 2> 864125 T2289 oascc.SolrZkClient.makePath makePath: /overseer/queue-work
[junit4] 2> 864136 T2313 oasc.OverseerCollectionProcessor.run Process current queue of collection creations
[junit4] 2> 864137 T2289 oascc.SolrZkClient.makePath makePath: /clusterstate.json
[junit4] 2> 864139 T2289 oascc.SolrZkClient.makePath makePath: /aliases.json
[junit4] 2> 864147 T2289 oascc.ZkStateReader.createClusterStateWatchersAndUpdate Updating cluster state from ZooKeeper...
[junit4] 2> 864149 T2312 oasc.Overseer$ClusterStateUpdater.run Starting to work on the main queue
[junit4] 2> 864156 T2314 oasc.ZkController.publish publishing core=collection1 state=down
[junit4] 2> 864156 T2314 oasc.ZkController.publish numShards not found on descriptor - reading it from system property
[junit4] 2> 864158 T2314 oasc.ZkController.waitForCoreNodeName look for our core node name
[junit4] 2> 865655 T2312 oascc.ZkStateReader.updateClusterState Updating cloud state from ZooKeeper...
[junit4] 2> 865656 T2312 oasc.Overseer$ClusterStateUpdater.updateState Update state numShards=1 message={
[junit4] 2> "operation":"state",
[junit4] 2> "core_node_name":"core_node1",
[junit4] 2> "numShards":"1",
[junit4] 2> "shard":null,
[junit4] 2> "roles":null,
[junit4] 2> "state":"down",
[junit4] 2> "shard_state":"active",
[junit4] 2> "core":"collection1",
[junit4] 2> "collection":"control_collection",
[junit4] 2> "shard_range":null,
[junit4] 2> "node_name":"127.0.0.1:34994__qp%2Ffo",
[junit4] 2> "base_url":"http://127.0.0.1:34994/_qp/fo"}
[junit4] 2> 865656 T2312 oasc.Overseer$ClusterStateUpdater.createCollection Create collection control_collection with shards [shard1]
[junit4] 2> 865656 T2312 oasc.Overseer$ClusterStateUpdater.updateState Assigning new node to shard shard=shard1
[junit4] 2> 865676 T2311 oascc.ZkStateReader$2.process A cluster state change: WatchedEvent state:SyncConnected type:NodeDataChanged path:/clusterstate.json, has occurred - updating... (live nodes size: 1)
[junit4] 2> 866161 T2314 oasc.ZkController.waitForShardId waiting to find shard id in clusterstate for collection1
[junit4] 2> 866161 T2314 oasc.CoreContainer.create Creating SolrCore 'collection1' using instanceDir: ../../../../../../../../../../../usr/home/hudson/hudson-slave/workspace/Lucene-Solr-Tests-4.x-Java7/solr/build/solr-core/test/J1/./org.apache.solr.cloud.SyncSliceTest-controljetty-1379175557774/collection1
[junit4] 2> 866161 T2314 oasc.ZkController.createCollectionZkNode Check for collection zkNode:control_collection
[junit4] 2> 866162 T2314 oasc.ZkController.createCollectionZkNode Collection zkNode exists
[junit4] 2> 866163 T2314 oasc.ZkController.readConfigName Load collection config from:/collections/control_collection
[junit4] 2> 866164 T2314 oasc.SolrResourceLoader.<init> new SolrResourceLoader for directory: '../../../../../../../../../../../usr/home/hudson/hudson-slave/workspace/Lucene-Solr-Tests-4.x-Java7/solr/build/solr-core/test/J1/./org.apache.solr.cloud.SyncSliceTest-controljetty-1379175557774/collection1/'
[junit4] 2> 866166 T2314 oasc.SolrResourceLoader.replaceClassLoader Adding 'file:/usr/home/hudson/hudson-slave/workspace/Lucene-Solr-Tests-4.x-Java7/solr/build/solr-core/test/J1/org.apache.solr.cloud.SyncSliceTest-controljetty-1379175557774/collection1/lib/README' to classloader
[junit4] 2> 866167 T2314 oasc.SolrResourceLoader.replaceClassLoader Adding 'file:/usr/home/hudson/hudson-slave/workspace/Lucene-Solr-Tests-4.x-Java7/solr/build/solr-core/test/J1/org.apache.solr.cloud.SyncSliceTest-controljetty-1379175557774/collection1/lib/classes/' to classloader
[junit4] 2> 866233 T2314 oasc.SolrConfig.<init> Using Lucene MatchVersion: LUCENE_46
[junit4] 2> 866298 T2314 oasc.SolrConfig.<init> Loaded SolrConfig: solrconfig.xml
[junit4] 2> 866401 T2314 oass.IndexSchema.readSchema Reading Solr Schema from schema.xml
[junit4] 2> 866413 T2314 oass.IndexSchema.readSchema [null] Schema name=test
[junit4] 2> 867085 T2314 oass.ByteField.init WARN ByteField is deprecated and will be removed in 5.0. You should use TrieIntField instead.
[junit4] 2> 867085 T2314 oass.ShortField.init WARN ShortField is deprecated and will be removed in 5.0. You should use TrieIntField instead.
[junit4] 2> 867086 T2314 oass.OpenExchangeRatesOrgProvider.init Initialized with rates=open-exchange-rates.json, refreshInterval=1440.
[junit4] 2> 867099 T2314 oass.IndexSchema.readSchema default search field in schema is text
[junit4] 2> 867104 T2314 oass.IndexSchema.readSchema unique key field: id
[junit4] 2> 867118 T2314 oass.FileExchangeRateProvider.reload Reloading exchange rates from file currency.xml
[junit4] 2> 867124 T2314 oass.FileExchangeRateProvider.reload Reloading exchange rates from file currency.xml
[junit4] 2> 867128 T2314 oass.OpenExchangeRatesOrgProvider.reload Reloading exchange rates from open-exchange-rates.json
[junit4] 2> 867129 T2314 oass.OpenExchangeRatesOrgProvider$OpenExchangeRates.<init> WARN Unknown key IMPORTANT NOTE
[junit4] 2> 867130 T2314 oass.OpenExchangeRatesOrgProvider$OpenExchangeRates.<init> WARN Expected key, got STRING
[junit4] 2> 867130 T2314 oass.OpenExchangeRatesOrgProvider.reload Reloading exchange rates from open-exchange-rates.json
[junit4] 2> 867131 T2314 oass.OpenExchangeRatesOrgProvider$OpenExchangeRates.<init> WARN Unknown key IMPORTANT NOTE
[junit4] 2> 867131 T2314 oass.OpenExchangeRatesOrgProvider$OpenExchangeRates.<init> WARN Expected key, got STRING
[junit4] 2> 867132 T2314 oasc.SolrCore.initDirectoryFactory org.apache.solr.core.MockDirectoryFactory
[junit4] 2> 867132 T2314 oasc.SolrCore.<init> [collection1] Opening new SolrCore at ../../../../../../../../../../../usr/home/hudson/hudson-slave/workspace/Lucene-Solr-Tests-4.x-Java7/solr/build/solr-core/test/J1/./org.apache.solr.cloud.SyncSliceTest-controljetty-1379175557774/collection1/, dataDir=./org.apache.solr.cloud.SyncSliceTest-1379175557455/control/data/
[junit4] 2> 867132 T2314 oasc.JmxMonitoredMap.<init> JMX monitoring is enabled. Adding Solr mbeans to JMX Server: com.sun.jmx.mbeanserver.JmxMBeanServer@4b08e64d
[junit4] 2> 867133 T2314 oasc.CachingDirectoryFactory.get return new directory for ./org.apache.solr.cloud.SyncSliceTest-1379175557455/control/data
[junit4] 2> 867134 T2314 oasc.SolrCore.getNewIndexDir New index directory detected: old=null new=./org.apache.solr.cloud.SyncSliceTest-1379175557455/control/data/index/
[junit4] 2> 867134 T2314 oasc.SolrCore.initIndex WARN [collection1] Solr index directory './org.apache.solr.cloud.SyncSliceTest-1379175557455/control/data/index' doesn't exist. Creating new index...
[junit4] 2> 867134 T2314 oasc.CachingDirectoryFactory.get return new directory for ./org.apache.solr.cloud.SyncSliceTest-1379175557455/control/data/index
[junit4] 2> 867135 T2314 oasu.RandomMergePolicy.<init> RandomMergePolicy wrapping class org.apache.lucene.index.TieredMergePolicy: [TieredMergePolicy: maxMergeAtOnce=39, maxMergeAtOnceExplicit=34, maxMergedSegmentMB=32.349609375, floorSegmentMB=0.2421875, forceMergeDeletesPctAllowed=5.108076947987805, segmentsPerTier=48.0, maxCFSSegmentSizeMB=8.796093022207999E12, noCFSRatio=1.0
[junit4] 2> 867136 T2314 oasc.SolrDeletionPolicy.onCommit SolrDeletionPolicy.onCommit: commits: num=1
[junit4] 2> commit{dir=MockDirectoryWrapper(org.apache.lucene.store.RAMDirectory@5c9e654f lockFactory=org.apache.lucene.store.SingleInstanceLockFactory@3fc9a779),segFN=segments_1,generation=1}
[junit4] 2> 867136 T2314 oasc.SolrDeletionPolicy.updateCommits newest commit generation = 1
[junit4] 2> 867140 T2314 oasup.UpdateRequestProcessorChain.init creating updateRequestProcessorChain "nodistrib"
[junit4] 2> 867141 T2314 oasup.UpdateRequestProcessorChain.init creating updateRequestProcessorChain "dedupe"
[junit4] 2> 867141 T2314 oasup.UpdateRequestProcessorChain.init inserting DistributedUpdateProcessorFactory into updateRequestProcessorChain "dedupe"
[junit4] 2> 867141 T2314 oasup.UpdateRequestProcessorChain.init creating updateRequestProcessorChain "stored_sig"
[junit4] 2> 867142 T2314 oasup.UpdateRequestProcessorChain.init inserting DistributedUpdateProcessorFactory into updateRequestProcessorChain "stored_sig"
[junit4] 2> 867142 T2314 oasup.UpdateRequestProcessorChain.init creating updateRequestProcessorChain "distrib-dup-test-chain-explicit"
[junit4] 2> 867143 T2314 oasup.UpdateRequestProcessorChain.init creating updateRequestProcessorChain "distrib-dup-test-chain-implicit"
[junit4] 2> 867143 T2314 oasup.UpdateRequestProcessorChain.init inserting DistributedUpdateProcessorFactory into updateRequestProcessorChain "distrib-dup-test-chain-implicit"
[junit4] 2> 867143 T2314 oasc.SolrCore.loadUpdateProcessorChains no updateRequestProcessorChain defined as default, creating implicit default
[junit4] 2> 867144 T2314 oasc.RequestHandlers.initHandlersFromConfig created standard: solr.StandardRequestHandler
[junit4] 2> 867145 T2314 oasc.RequestHandlers.initHandlersFromConfig created /get: solr.RealTimeGetHandler
[junit4] 2> 867145 T2314 oasc.RequestHandlers.initHandlersFromConfig adding lazy requestHandler: solr.ReplicationHandler
[junit4] 2> 867145 T2314 oasc.RequestHandlers.initHandlersFromConfig created /replication: solr.ReplicationHandler
[junit4] 2> 867146 T2314 oasc.RequestHandlers.initHandlersFromConfig created /update: solr.UpdateRequestHandler
[junit4] 2> 867146 T2314 oasc.RequestHandlers.initHandlersFromConfig created /admin/: org.apache.solr.handler.admin.AdminHandlers
[junit4] 2> 867163 T2314 oashl.XMLLoader.init xsltCacheLifetimeSeconds=60
[junit4] 2> 867169 T2314 oasu.CommitTracker.<init> Hard AutoCommit: disabled
[junit4] 2> 867170 T2314 oasu.CommitTracker.<init> Soft AutoCommit: disabled
[junit4] 2> 867170 T2314 oasu.RandomMergePolicy.<init> RandomMergePolicy wrapping class org.apache.lucene.index.LogByteSizeMergePolicy: [LogByteSizeMergePolicy: minMergeSize=1677721, mergeFactor=26, maxMergeSize=2147483648, maxMergeSizeForForcedMerge=9223372036854775807, calibrateSizeByDeletes=false, maxMergeDocs=2147483647, maxCFSSegmentSizeMB=8.796093022207999E12, noCFSRatio=1.0]
[junit4] 2> 867171 T2314 oasc.SolrDeletionPolicy.onInit SolrDeletionPolicy.onInit: commits: num=1
[junit4] 2> commit{dir=MockDirectoryWrapper(org.apache.lucene.store.RAMDirectory@5c9e654f lockFactory=org.apache.lucene.store.SingleInstanceLockFactory@3fc9a779),segFN=segments_1,generation=1}
[junit4] 2> 867172 T2314 oasc.SolrDeletionPolicy.updateCommits newest commit generation = 1
[junit4] 2> 867172 T2314 oass.SolrIndexSearcher.<init> Opening Searcher@4b838d77 main
[junit4] 2> 867176 T2315 oasc.SolrCore.registerSearcher [collection1] Registered new searcher Searcher@4b838d77 main{StandardDirectoryReader(segments_1:1:nrt)}
[junit4] 2> 867176 T2314 oasc.CoreContainer.registerCore registering core: collection1
[junit4] 2> 867177 T2314 oasc.ZkController.register Register replica - core:collection1 address:http://127.0.0.1:34994/_qp/fo collection:control_collection shard:shard1
[junit4] 2> 867177 T2314 oascsi.HttpClientUtil.createClient Creating new http client, config:maxConnections=10000&maxConnectionsPerHost=20&connTimeout=15000&socketTimeout=30000&retry=false
[junit4] 2> 867190 T2314 oascc.SolrZkClient.makePath makePath: /collections/control_collection/leader_elect/shard1/election
[junit4] 2> 867211 T2314 oasc.ShardLeaderElectionContext.runLeaderProcess Running the leader process for shard shard1
[junit4] 2> 867214 T2314 oasc.ShardLeaderElectionContext.waitForReplicasToComeUp Enough replicas found to continue.
[junit4] 2> 867214 T2314 oasc.ShardLeaderElectionContext.runLeaderProcess I may be the new leader - try and sync
[junit4] 2> 867215 T2314 oasc.SyncStrategy.sync Sync replicas to http://127.0.0.1:34994/_qp/fo/collection1/
[junit4] 2> 867215 T2314 oasc.SyncStrategy.syncReplicas Sync Success - now sync replicas to me
[junit4] 2> 867215 T2314 oasc.SyncStrategy.syncToMe http://127.0.0.1:34994/_qp/fo/collection1/ has no replicas
[junit4] 2> 867215 T2314 oasc.ShardLeaderElectionContext.runLeaderProcess I am the new leader: http://127.0.0.1:34994/_qp/fo/collection1/ shard1
[junit4] 2> 867216 T2314 oascc.SolrZkClient.makePath makePath: /collections/control_collection/leaders/shard1
[junit4] 2> 868683 T2312 oascc.ZkStateReader.updateClusterState Updating cloud state from ZooKeeper...
[junit4] 2> 868701 T2311 oascc.ZkStateReader$2.process A cluster state change: WatchedEvent state:SyncConnected type:NodeDataChanged path:/clusterstate.json, has occurred - updating... (live nodes size: 1)
[junit4] 2> 868757 T2314 oasc.ZkController.register We are http://127.0.0.1:34994/_qp/fo/collection1/ and leader is http://127.0.0.1:34994/_qp/fo/collection1/
[junit4] 2> 868757 T2314 oasc.ZkController.register No LogReplay needed for core=collection1 baseURL=http://127.0.0.1:34994/_qp/fo
[junit4] 2> 868757 T2314 oasc.ZkController.checkRecovery I am the leader, no recovery necessary
[junit4] 2> 868758 T2314 oasc.ZkController.publish publishing core=collection1 state=active
[junit4] 2> 868758 T2314 oasc.ZkController.publish numShards not found on descriptor - reading it from system property
[junit4] 2> 868788 T2314 oascc.ZkStateReader.updateClusterState Updating cloud state from ZooKeeper...
[junit4] 2> 868789 T2289 oass.SolrDispatchFilter.init user.dir=/usr/home/hudson/hudson-slave/workspace/Lucene-Solr-Tests-4.x-Java7/solr/build/solr-core/test/J1
[junit4] 2> 868790 T2289 oass.SolrDispatchFilter.init SolrDispatchFilter.init() done
[junit4] 2> 868790 T2289 oascsi.HttpClientUtil.createClient Creating new http client, config:maxConnections=128&maxConnectionsPerHost=32&followRedirects=false
[junit4] 2> 868803 T2289 oascsi.HttpClientUtil.createClient Creating new http client, config:
[junit4] 2> 868805 T2289 oascc.ConnectionManager.waitForConnected Waiting for client to connect to ZooKeeper
[junit4] 2> 868808 T2318 oascc.ConnectionManager.process Watcher org.apache.solr.common.cloud.ConnectionManager@5b1cf549 name:ZooKeeperConnection Watcher:127.0.0.1:34991/solr got event WatchedEvent state:SyncConnected type:None path:null path:null type:None
[junit4] 2> 868808 T2289 oascc.ConnectionManager.waitForConnected Client is connected to ZooKeeper
[junit4] 2> 868811 T2289 oascc.ZkStateReader.createClusterStateWatchersAndUpdate Updating cluster state from ZooKeeper...
[junit4] 2> 868813 T2289 oasc.ChaosMonkey.monkeyLog monkey: init - expire sessions:true cause connection loss:true
[junit4] 2> 869097 T2289 oejs.Server.doStart jetty-8.1.10.v20130312
[junit4] 2> 869100 T2289 oejs.AbstractConnector.doStart Started SocketConnector@127.0.0.1:?????
[junit4] 2> 869101 T2289 oass.SolrDispatchFilter.init SolrDispatchFilter.init()
[junit4] 2> 869101 T2289 oasc.SolrResourceLoader.locateSolrHome JNDI not configured for solr (NoInitialContextEx)
[junit4] 2> 869102 T2289 oasc.SolrResourceLoader.locateSolrHome using system property solr.solr.home: ./org.apache.solr.cloud.SyncSliceTest-jetty1-1379175562941
[junit4] 2> 869102 T2289 oasc.SolrResourceLoader.<init> new SolrResourceLoader for directory: './org.apache.solr.cloud.SyncSliceTest-jetty1-1379175562941/'
[junit4] 2> 869144 T2289 oasc.ConfigSolr.fromFile Loading container configuration from /usr/home/hudson/hudson-slave/workspace/Lucene-Solr-Tests-4.x-Java7/solr/build/solr-core/test/J1/./org.apache.solr.cloud.SyncSliceTest-jetty1-1379175562941/solr.xml
[junit4] 2> 869236 T2289 oasc.CoreContainer.<init> New CoreContainer 2130314040
[junit4] 2> 869237 T2289 oasc.CoreContainer.load Loading cores into CoreContainer [instanceDir=./org.apache.solr.cloud.SyncSliceTest-jetty1-1379175562941/]
[junit4] 2> 869239 T2289 oashc.HttpShardHandlerFactory.getParameter Setting socketTimeout to: 120000
[junit4] 2> 869239 T2289 oashc.HttpShardHandlerFactory.getParameter Setting urlScheme to: http://
[junit4] 2> 869240 T2289 oashc.HttpShardHandlerFactory.getParameter Setting connTimeout to: 15000
[junit4] 2> 869240 T2289 oashc.HttpShardHandlerFactory.getParameter Setting maxConnectionsPerHost to: 20
[junit4] 2> 869240 T2289 oashc.HttpShardHandlerFactory.getParameter Setting corePoolSize to: 0
[junit4] 2> 869241 T2289 oashc.HttpShardHandlerFactory.getParameter Setting maximumPoolSize to: 2147483647
[junit4] 2> 869241 T2289 oashc.HttpShardHandlerFactory.getParameter Setting maxThreadIdleTime to: 5
[junit4] 2> 869242 T2289 oashc.HttpShardHandlerFactory.getParameter Setting sizeOfQueue to: -1
[junit4] 2> 869242 T2289 oashc.HttpShardHandlerFactory.getParameter Setting fairnessPolicy to: false
[junit4] 2> 869243 T2289 oascsi.HttpClientUtil.createClient Creating new http client, config:maxConnectionsPerHost=20&maxConnections=10000&socketTimeout=120000&connTimeout=15000&retry=false
[junit4] 2> 869258 T2289 oasl.LogWatcher.createWatcher SLF4J impl is org.slf4j.impl.Log4jLoggerFactory
[junit4] 2> 869259 T2289 oasl.LogWatcher.newRegisteredLogWatcher Registering Log Listener [Log4j (org.slf4j.impl.Log4jLoggerFactory)]
[junit4] 2> 869259 T2289 oasc.ZkContainer.initZooKeeper Zookeeper client=127.0.0.1:34991/solr
[junit4] 2> 869260 T2289 oasc.ZkController.checkChrootPath zkHost includes chroot
[junit4] 2> 869261 T2289 oascc.ConnectionManager.waitForConnected Waiting for client to connect to ZooKeeper
[junit4] 2> 869264 T2329 oascc.ConnectionManager.process Watcher org.apache.solr.common.cloud.ConnectionManager@491011ca name:ZooKeeperConnection Watcher:127.0.0.1:34991 got event WatchedEvent state:SyncConnected type:None path:null path:null type:None
[junit4] 2> 869265 T2289 oascc.ConnectionManager.waitForConnected Client is connected to ZooKeeper
[junit4] 2> 869283 T2289 oascsi.HttpClientUtil.createClient Creating new http client, config:maxConnections=500&maxConnectionsPerHost=16&socketTimeout=120000&connTimeout=15000
[junit4] 2> 869294 T2289 oascc.ConnectionManager.waitForConnected Waiting for client to connect to ZooKeeper
[junit4] 2> 869297 T2331 oascc.ConnectionManager.process Watcher org.apache.solr.common.cloud.ConnectionManager@1585ab7a name:ZooKeeperConnection Watcher:127.0.0.1:34991/solr got event WatchedEvent state:SyncConnected type:None path:null path:null type:None
[junit4] 2> 869297 T2289 oascc.ConnectionManager.waitForConnected Client is connected to ZooKeeper
[junit4] 2> 869308 T2289 oascc.ZkStateReader.createClusterStateWatchersAndUpdate Updating cluster state from ZooKeeper...
[junit4] 2> 870214 T2312 oascc.ZkStateReader.updateClusterState Updating cloud state from ZooKeeper...
[junit4] 2> 870215 T2312 oasc.Overseer$ClusterStateUpdater.updateState Update state numShards=1 message={
[junit4] 2> "operation":"state",
[junit4] 2> "core_node_name":"core_node1",
[junit4] 2> "numShards":"1",
[junit4] 2> "shard":"shard1",
[junit4] 2> "roles":null,
[junit4] 2> "state":"active",
[junit4] 2> "shard_state":"active",
[junit4] 2> "core":"collection1",
[junit4] 2> "collection":"control_collection",
[junit4] 2> "shard_range":null,
[junit4] 2> "node_name":"127.0.0.1:34994__qp%2Ffo",
[junit4] 2> "base_url":"http://127.0.0.1:34994/_qp/fo"}
[junit4] 2> 870232 T2311 oascc.ZkStateReader$2.process A cluster state change: WatchedEvent state:SyncConnected type:NodeDataChanged path:/clusterstate.json, has occurred - updating... (live nodes size: 1)
[junit4] 2> 870232 T2318 oascc.ZkStateReader$2.process A cluster state change: WatchedEvent state:SyncConnected type:NodeDataChanged path:/clusterstate.json, has occurred - updating... (live nodes size: 1)
[junit4] 2> 870232 T2331 oascc.ZkStateReader$2.process A cluster state change: WatchedEvent state:SyncConnected type:NodeDataChanged path:/clusterstate.json, has occurred - updating... (live nodes size: 1)
[junit4] 2> 870312 T2289 oasc.ZkController.createEphemeralLiveNode Register node as live in ZooKeeper:/live_nodes/127.0.0.1:48304__qp%2Ffo
[junit4] 2> 870314 T2289 oascc.SolrZkClient.makePath makePath: /live_nodes/127.0.0.1:48304__qp%2Ffo
[junit4] 2> 870317 T2331 oascc.ZkStateReader$2.process A cluster state change: WatchedEvent state:SyncConnected type:NodeChildrenChanged path:/live_nodes, has occurred - updating... (live nodes size: 1)
[junit4] 2> 870317 T2318 oascc.ZkStateReader$2.process A cluster state change: WatchedEvent state:SyncConnected type:NodeChildrenChanged path:/live_nodes, has occurred - updating... (live nodes size: 1)
[junit4] 2> 870317 T2311 oascc.ZkStateReader$3.process Updating live nodes... (2)
[junit4] 2> 870317 T2311 oascc.ZkStateReader$2.process A cluster state change: WatchedEvent state:SyncConnected type:NodeChildrenChanged path:/live_nodes, has occurred - updating... (live nodes size: 2)
[junit4] 2> 870318 T2331 oascc.ZkStateReader$3.process Updating live nodes... (2)
[junit4] 2> 870319 T2318 oascc.ZkStateReader$3.process Updating live nodes... (2)
[junit4] 2> 870332 T2332 oasc.ZkController.publish publishing core=collection1 state=down
[junit4] 2> 870333 T2332 oasc.ZkController.publish numShards not found on descriptor - reading it from system property
[junit4] 2> 870334 T2332 oasc.ZkController.waitForCoreNodeName look for our core node name
[junit4] 2> 871739 T2312 oascc.ZkStateReader.updateClusterState Updating cloud state from ZooKeeper...
[junit4] 2> 871740 T2312 oasc.Overseer$ClusterStateUpdater.updateState Update state numShards=1 message={
[junit4] 2> "operation":"state",
[junit4] 2> "core_node_name":"core_node1",
[junit4] 2> "numShards":"1",
[junit4] 2> "shard":null,
[junit4] 2> "roles":null,
[junit4] 2> "state":"down",
[junit4] 2> "shard_state":"active",
[junit4] 2> "core":"collection1",
[junit4] 2> "collection":"collection1",
[junit4] 2> "shard_range":null,
[junit4] 2> "node_name":"127.0.0.1:48304__qp%2Ffo",
[junit4] 2> "base_url":"http://127.0.0.1:48304/_qp/fo"}
[junit4] 2> 871740 T2312 oasc.Overseer$ClusterStateUpdater.createCollection Create collection collection1 with shards [shard1]
[junit4] 2> 871740 T2312 oasc.Overseer$ClusterStateUpdater.updateState Assigning new node to shard shard=shard1
[junit4] 2> 871758 T2311 oascc.ZkStateReader$2.process A cluster state change: WatchedEvent state:SyncConnected type:NodeDataChanged path:/clusterstate.json, has occurred - updating... (live nodes size: 2)
[junit4] 2> 871758 T2318 oascc.ZkStateReader$2.process A cluster state change: WatchedEvent state:SyncConnected type:NodeDataChanged path:/clusterstate.json, has occurred - updating... (live nodes size: 2)
[junit4] 2> 871758 T2331 oascc.ZkStateReader$2.process A cluster state change: WatchedEvent state:SyncConnected type:NodeDataChanged path:/clusterstate.json, has occurred - updating... (live nodes size: 2)
[junit4] 2> 872338 T2332 oasc.ZkController.waitForShardId waiting to find shard id in clusterstate for collection1
[junit4] 2> 872338 T2332 oasc.CoreContainer.create Creating SolrCore 'collection1' using instanceDir: ./org.apache.solr.cloud.SyncSliceTest-jetty1-1379175562941/collection1
[junit4] 2> 872338 T2332 oasc.ZkController.createCollectionZkNode Check for collection zkNode:collection1
[junit4] 2> 872339 T2332 oasc.ZkController.createCollectionZkNode Collection zkNode exists
[junit4] 2> 872340 T2332 oasc.ZkController.readConfigName Load collection config from:/collections/collection1
[junit4] 2> 872341 T2332 oasc.SolrResourceLoader.<init> new SolrResourceLoader for directory: './org.apache.solr.cloud.SyncSliceTest-jetty1-1379175562941/collection1/'
[junit4] 2> 872342 T2332 oasc.SolrResourceLoader.replaceClassLoader Adding 'file:/usr/home/hudson/hudson-slave/workspace/Lucene-Solr-Tests-4.x-Java7/solr/build/solr-core/test/J1/org.apache.solr.cloud.SyncSliceTest-jetty1-1379175562941/collection1/lib/classes/' to classloader
[junit4] 2> 872343 T2332 oasc.SolrResourceLoader.replaceClassLoader Adding 'file:/usr/home/hudson/hudson-slave/workspace/Lucene-Solr-Tests-4.x-Java7/solr/build/solr-core/test/J1/org.apache.solr.cloud.SyncSliceTest-jetty1-1379175562941/collection1/lib/README' to classloader
[junit4] 2> 872410 T2332 oasc.SolrConfig.<init> Using Lucene MatchVersion: LUCENE_46
[junit4] 2> 872474 T2332 oasc.SolrConfig.<init> Loaded SolrConfig: solrconfig.xml
[junit4] 2> 872577 T2332 oass.IndexSchema.readSchema Reading Solr Schema from schema.xml
[junit4] 2> 872589 T2332 oass.IndexSchema.readSchema [null] Schema name=test
[junit4] 2> 873259 T2332 oass.ByteField.init WARN ByteField is deprecated and will be removed in 5.0. You should use TrieIntField instead.
[junit4] 2> 873260 T2332 oass.ShortField.init WARN ShortField is deprecated and will be removed in 5.0. You should use TrieIntField instead.
[junit4] 2> 873261 T2332 oass.OpenExchangeRatesOrgProvider.init Initialized with rates=open-exchange-rates.json, refreshInterval=1440.
[junit4] 2> 873275 T2332 oass.IndexSchema.readSchema default search field in schema is text
[junit4] 2> 873279 T2332 oass.IndexSchema.readSchema unique key field: id
[junit4] 2> 873293 T2332 oass.FileExchangeRateProvider.reload Reloading exchange rates from file currency.xml
[junit4] 2> 873298 T2332 oass.FileExchangeRateProvider.reload Reloading exchange rates from file currency.xml
[junit4] 2> 873303 T2332 oass.OpenExchangeRatesOrgProvider.reload Reloading exchange rates from open-exchange-rates.json
[junit4] 2> 873304 T2332 oass.OpenExchangeRatesOrgProvider$OpenExchangeRates.<init> WARN Unknown key IMPORTANT NOTE
[junit4] 2> 873304 T2332 oass.OpenExchangeRatesOrgProvider$OpenExchangeRates.<init> WARN Expected key, got STRING
[junit4] 2> 873305 T2332 oass.OpenExchangeRatesOrgProvider.reload Reloading exchange rates from open-exchange-rates.json
[junit4] 2> 873306 T2332 oass.OpenExchangeRatesOrgProvider$OpenExchangeRates.<init> WARN Unknown key IMPORTANT NOTE
[junit4] 2> 873306 T2332 oass.OpenExchangeRatesOrgProvider$OpenExchangeRates.<init> WARN Expected key, got STRING
[junit4] 2> 873306 T2332 oasc.SolrCore.initDirectoryFactory org.apache.solr.core.MockDirectoryFactory
[junit4] 2> 873307 T2332 oasc.SolrCore.<init> [collection1] Opening new SolrCore at ./org.apache.solr.cloud.SyncSliceTest-jetty1-1379175562941/collection1/, dataDir=./org.apache.solr.cloud.SyncSliceTest-1379175557455/jetty1/
[junit4] 2> 873307 T2332 oasc.JmxMonitoredMap.<init> JMX monitoring is enabled. Adding Solr mbeans to JMX Server: com.sun.jmx.mbeanserver.JmxMBeanServer@4b08e64d
[junit4] 2> 873308 T2332 oasc.CachingDirectoryFactory.get return new directory for ./org.apache.solr.cloud.SyncSliceTest-1379175557455/jetty1
[junit4] 2> 873308 T2332 oasc.SolrCore.getNewIndexDir New index directory detected: old=null new=./org.apache.solr.cloud.SyncSliceTest-1379175557455/jetty1/index/
[junit4] 2> 873309 T2332 oasc.SolrCore.initIndex WARN [collection1] Solr index directory './org.apache.solr.cloud.SyncSliceTest-1379175557455/jetty1/index' doesn't exist. Creating new index...
[junit4] 2> 873309 T2332 oasc.CachingDirectoryFactory.get return new directory for ./org.apache.solr.cloud.SyncSliceTest-1379175557455/jetty1/index
[junit4] 2> 873309 T2332 oasu.RandomMergePolicy.<init> RandomMergePolicy wrapping class org.apache.lucene.index.TieredMergePolicy: [TieredMergePolicy: maxMergeAtOnce=39, maxMergeAtOnceExplicit=34, maxMergedSegmentMB=32.349609375, floorSegmentMB=0.2421875, forceMergeDeletesPctAllowed=5.108076947987805, segmentsPerTier=48.0, maxCFSSegmentSizeMB=8.796093022207999E12, noCFSRatio=1.0
[junit4] 2> 873310 T2332 oasc.SolrDeletionPolicy.onCommit SolrDeletionPolicy.onCommit: commits: num=1
[junit4] 2> commit{dir=MockDirectoryWrapper(org.apache.lucene.store.RAMDirectory@4775b87d lockFactory=org.apache.lucene.store.SingleInstanceLockFactory@22173320),segFN=segments_1,generation=1}
[junit4] 2> 873311 T2332 oasc.SolrDeletionPolicy.updateCommits newest commit generation = 1
[junit4] 2> 873315 T2332 oasup.UpdateRequestProcessorChain.init creating updateRequestProcessorChain "nodistrib"
[junit4] 2> 873316 T2332 oasup.UpdateRequestProcessorChain.init creating updateRequestProcessorChain "dedupe"
[junit4] 2> 873316 T2332 oasup.UpdateRequestProcessorChain.init inserting DistributedUpdateProcessorFactory into updateRequestProcessorChain "dedupe"
[junit4] 2> 873316 T2332 oasup.UpdateRequestProcessorChain.init creating updateRequestProcessorChain "stored_sig"
[junit4] 2> 873317 T2332 oasup.UpdateRequestProcessorChain.init inserting DistributedUpdateProcessorFactory into updateRequestProcessorChain "stored_sig"
[junit4] 2> 873317 T2332 oasup.UpdateRequestProcessorChain.init creating updateRequestProcessorChain "distrib-dup-test-chain-explicit"
[junit4] 2> 873317 T2332 oasup.UpdateRequestProcessorChain.init creating updateRequestProcessorChain "distrib-dup-test-chain-implicit"
[junit4] 2> 873318 T2332 oasup.UpdateRequestProcessorChain.init inserting DistributedUpdateProcessorFactory into updateRequestProcessorChain "distrib-dup-test-chain-implicit"
[junit4] 2> 873318 T2332 oasc.SolrCore.loadUpdateProcessorChains no updateRequestProcessorChain defined as default, creating implicit default
[junit4] 2> 873319 T2332 oasc.RequestHandlers.initHandlersFromConfig created standard: solr.StandardRequestHandler
[junit4] 2> 873320 T2332 oasc.RequestHandlers.initHandlersFromConfig created /get: solr.RealTimeGetHandler
[junit4] 2> 873320 T2332 oasc.RequestHandlers.initHandlersFromConfig adding lazy requestHandler: solr.ReplicationHandler
[junit4] 2> 873320 T2332 oasc.RequestHandlers.initHandlersFromConfig created /replication: solr.ReplicationHandler
[junit4] 2> 873321 T2332 oasc.RequestHandlers.initHandlersFromConfig created /update: solr.UpdateRequestHandler
[junit4] 2> 873322 T2332 oasc.RequestHandlers.initHandlersFromConfig created /admin/: org.apache.solr.handler.admin.AdminHandlers
[junit4] 2> 873337 T2332 oashl.XMLLoader.init xsltCacheLifetimeSeconds=60
[junit4] 2> 873342 T2332 oasu.CommitTracker.<init> Hard AutoCommit: disabled
[junit4] 2> 873342 T2332 oasu.CommitTracker.<init> Soft AutoCommit: disabled
[junit4] 2> 873343 T2332 oasu.RandomMergePolicy.<init> RandomMergePolicy wrapping class org.apache.lucene.index.LogByteSizeMergePolicy: [LogByteSizeMergePolicy: minMergeSize=1677721, mergeFactor=26, maxMergeSize=2147483648, maxMergeSizeForForcedMerge=9223372036854775807, calibrateSizeByDeletes=false, maxMergeDocs=2147483647, maxCFSSegmentSizeMB=8.796093022207999E12, noCFSRatio=1.0]
[junit4] 2> 873344 T2332 oasc.SolrDeletionPolicy.onInit SolrDeletionPolicy.onInit: commits: num=1
[junit4] 2> commit{dir=MockDirectoryWrapper(org.apache.lucene.store.RAMDirectory@4775b87d lockFactory=org.apache.lucene.store.SingleInstanceLockFactory@22173320),segFN=segments_1,generation=1}
[junit4] 2> 873344 T2332 oasc.SolrDeletionPolicy.updateCommits newest commit generation = 1
[junit4] 2> 873345 T2332 oass.SolrIndexSearcher.<init> Opening Searcher@7b48b420 main
[junit4] 2> 873349 T2333 oasc.SolrCore.registerSearcher [collection1] Registered new searcher Searcher@7b48b420 main{StandardDirectoryReader(segments_1:1:nrt)}
[junit4] 2> 873352 T2332 oasc.CoreContainer.registerCore registering core: collection1
[junit4] 2> 873352 T2332 oasc.ZkController.register Register replica - core:collection1 address:http://127.0.0.1:48304/_qp/fo collection:collection1 shard:shard1
[junit4] 2> 873352 T2332 oascsi.HttpClientUtil.createClient Creating new http client, config:maxConnections=10000&maxConnectionsPerHost=20&connTimeout=15000&socketTimeout=30000&retry=false
[junit4] 2> 873364 T2332 oascc.SolrZkClient.makePath makePath: /collections/collection1/leader_elect/shard1/election
[junit4] 2> 873382 T2332 oasc.ShardLeaderElectionContext.runLeaderProcess Running the leader process for shard shard1
[junit4] 2> 873385 T2332 oasc.ShardLeaderElectionContext.waitForReplicasToComeUp Enough replicas found to continue.
[junit4] 2> 873385 T2332 oasc.ShardLeaderElectionContext.runLeaderProcess I may be the new leader - try and sync
[junit4] 2> 873385 T2332 oasc.SyncStrategy.sync Sync replicas to http://127.0.0.1:48304/_qp/fo/collection1/
[junit4] 2> 873386 T2332 oasc.SyncStrategy.syncReplicas Sync Success - now sync replicas to me
[junit4] 2> 873386 T2332 oasc.SyncStrategy.syncToMe http://127.0.0.1:48304/_qp/fo/collection1/ has no replicas
[junit4] 2> 873386 T2332 oasc.ShardLeaderElectionContext.runLeaderProcess I am the new leader: http://127.0.0.1:48304/_qp/fo/collection1/ shard1
[junit4] 2> 873386 T2332 oascc.SolrZkClient.makePath makePath: /collections/collection1/leaders/shard1
[junit4] 2> 874765 T2312 oascc.ZkStateReader.updateClusterState Updating cloud state from ZooKeeper...
[junit4] 2> 874789 T2311 oascc.ZkStateReader$2.process A cluster state change: WatchedEvent state:SyncConnected type:NodeDataChanged path:/clusterstate.json, has occurred - updating... (live nodes size: 2)
[junit4] 2> 874789 T2331 oascc.ZkStateReader$2.process A cluster state change: WatchedEvent state:SyncConnected type:NodeDataChanged path:/clusterstate.json, has occurred - updating... (live nodes size: 2)
[junit4] 2> 874789 T2318 oascc.ZkStateReader$2.process A cluster state change: WatchedEvent state:SyncConnected type:NodeDataChanged path:/clusterstate.json, has occurred - updating... (live nodes size: 2)
[junit4] 2> 874826 T2332 oasc.ZkController.register We are http://127.0.0.1:48304/_qp/fo/collection1/ and leader is http://127.0.0.1:48304/_qp/fo/collection1/
[junit4] 2> 874826 T2332 oasc.ZkController.register No LogReplay needed for core=collection1 baseURL=http://127.0.0.1:48304/_qp/fo
[junit4] 2> 874826 T2332 oasc.ZkController.checkRecovery I am the leader, no recovery necessary
[junit4] 2> 874827 T2332 oasc.ZkController.publish publishing core=collection1 state=active
[junit4] 2> 874827 T2332 oasc.ZkController.publish numShards not found on descriptor - reading it from system property
[junit4] 2> 874831 T2332 oascc.ZkStateReader.updateClusterState Updating cloud state from ZooKeeper...
[junit4] 2> 874832 T2289 oass.SolrDispatchFilter.init user.dir=/usr/home/hudson/hudson-slave/workspace/Lucene-Solr-Tests-4.x-Java7/solr/build/solr-core/test/J1
[junit4] 2> 874833 T2289 oass.SolrDispatchFilter.init SolrDispatchFilter.init() done
[junit4] 2> 874834 T2289 oascsi.HttpClientUtil.createClient Creating new http client, config:maxConnections=128&maxConnectionsPerHost=32&followRedirects=false
[junit4] 2> 875133 T2289 oejs.Server.doStart jetty-8.1.10.v20130312
[junit4] 2> 875136 T2289 oejs.AbstractConnector.doStart Started SocketConnector@127.0.0.1:?????
[junit4] 2> 875137 T2289 oass.SolrDispatchFilter.init SolrDispatchFilter.init()
[junit4] 2> 875137 T2289 oasc.SolrResourceLoader.locateSolrHome JNDI not configured for solr (NoInitialContextEx)
[junit4] 2> 875138 T2289 oasc.SolrResourceLoader.locateSolrHome using system property solr.solr.home: ../../../../../../../../../../../usr/home/hudson/hudson-slave/workspace/Lucene-Solr-Tests-4.x-Java7/solr/build/solr-core/test/J1/./org.apache.solr.cloud.SyncSliceTest-jetty2-1379175568973
[junit4] 2> 875138 T2289 oasc.SolrResourceLoader.<init> new SolrResourceLoader for directory: '../../../../../../../../../../../usr/home/hudson/hudson-slave/workspace/Lucene-Solr-Tests-4.x-Java7/solr/build/solr-core/test/J1/./org.apache.solr.cloud.SyncSliceTest-jetty2-1379175568973/'
[junit4] 2> 875181 T2289 oasc.ConfigSolr.fromFile Loading container configuration from /usr/home/hudson/hudson-slave/workspace/Lucene-Solr-Tests-4.x-Java7/solr/build/solr-core/test/J1/../../../../../../../../../../../usr/home/hudson/hudson-slave/workspace/Lucene-Solr-Tests-4.x-Java7/solr/build/solr-core/test/J1/./org.apache.solr.cloud.SyncSliceTest-jetty2-1379175568973/solr.xml
[junit4] 2> 875276 T2289 oasc.CoreContainer.<init> New CoreContainer 524236912
[junit4] 2> 875277 T2289 oasc.CoreContainer.load Loading cores into CoreContainer [instanceDir=../../../../../../../../../../../usr/home/hudson/hudson-slave/workspace/Lucene-Solr-Tests-4.x-Java7/solr/build/solr-core/test/J1/./org.apache.solr.cloud.SyncSliceTest-jetty2-1379175568973/]
[junit4] 2> 875279 T2289 oashc.HttpShardHandlerFactory.getParameter Setting socketTimeout to: 120000
[junit4] 2> 875280 T2289 oashc.HttpShardHandlerFactory.getParameter Setting urlScheme to: http://
[junit4] 2> 875280 T2289 oashc.HttpShardHandlerFactory.getParameter Setting connTimeout to: 15000
[junit4] 2> 875281 T2289 oashc.HttpShardHandlerFactory.getParameter Setting maxConnectionsPerHost to: 20
[junit4] 2> 875281 T2289 oashc.HttpShardHandlerFactory.getParameter Setting corePoolSize to: 0
[junit4] 2> 875281 T2289 oashc.HttpShardHandlerFactory.getParameter Setting maximumPoolSize to: 2147483647
[junit4] 2> 875282 T2289 oashc.HttpShardHandlerFactory.getParameter Setting maxThreadIdleTime to: 5
[junit4] 2> 875282 T2289 oashc.HttpShardHandlerFactory.getParameter Setting sizeOfQueue to: -1
[junit4] 2> 875283 T2289 oashc.HttpShardHandlerFactory.getParameter Setting fairnessPolicy to: false
[junit4] 2> 875283 T2289 oascsi.HttpClientUtil.createClient Creating new http client, config:maxConnectionsPerHost=20&maxConnections=10000&socketTimeout=120000&connTimeout=15000&retry=false
[junit4] 2> 875301 T2289 oasl.LogWatcher.createWatcher SLF4J impl is org.slf4j.impl.Log4jLoggerFactory
[junit4] 2> 875301 T2289 oasl.LogWatcher.newRegisteredLogWatcher Registering Log Listener [Log4j (org.slf4j.impl.Log4jLoggerFactory)]
[junit4] 2> 875302 T2289 oasc.ZkContainer.initZooKeeper Zookeeper client=127.0.0.1:34991/solr
[junit4] 2> 875302 T2289 oasc.ZkController.checkChrootPath zkHost includes chroot
[junit4] 2> 875304 T2289 oascc.ConnectionManager.waitForConnected Waiting for client to connect to ZooKeeper
[junit4] 2> 875307 T2345 oascc.ConnectionManager.process Watcher org.apache.solr.common.cloud.ConnectionManager@662e57d8 name:ZooKeeperConnection Watcher:127.0.0.1:34991 got event WatchedEvent state:SyncConnected type:None path:null path:null type:None
[junit4] 2> 875307 T2289 oascc.ConnectionManager.waitForConnected Client is connected to ZooKeeper
[junit4] 2> 875323 T2289 oascsi.HttpClientUtil.createClient Creating new http client, config:maxConnections=500&maxConnectionsPerHost=16&socketTimeout=120000&connTimeout=15000
[junit4] 2> 875336 T2289 oascc.ConnectionManager.waitForConnected Waiting for client to connect to ZooKeeper
[junit4] 2> 875339 T2347 oascc.ConnectionManager.process Watcher org.apache.solr.common.cloud.ConnectionManager@2f04c3c9 name:ZooKeeperConnection Watcher:127.0.0.1:34991/solr got event WatchedEvent state:SyncConnected type:None path:null path:null type:None
[junit4] 2> 875339 T2289 oascc.ConnectionManager.waitForConnected Client is connected to ZooKeeper
[junit4] 2> 875345 T2289 oascc.ZkStateReader.createClusterStateWatchersAndUpdate Updating cluster state from ZooKeeper...
[junit4] 2> 876305 T2312 oascc.ZkStateReader.updateClusterState Updating cloud state from ZooKeeper...
[junit4] 2> 876306 T2312 oasc.Overseer$ClusterStateUpdater.updateState Update state numShards=1 message={
[junit4] 2> "operation":"state",
[junit4] 2> "core_node_name":"core_node1",
[junit4] 2> "numShards":"1",
[junit4] 2> "shard":"shard1",
[junit4] 2> "roles":null,
[junit4] 2> "state":"active",
[junit4] 2> "shard_state":"active",
[junit4] 2> "core":"collection1",
[junit4] 2> "collection":"collection1",
[junit4] 2> "shard_range":null,
[junit4] 2> "node_name":"127.0.0.1:48304__qp%2Ffo",
[junit4] 2> "base_url":"http://127.0.0.1:48304/_qp/fo"}
[junit4] 2> 876322 T2347 oascc.ZkStateReader$2.process A cluster state change: WatchedEvent state:SyncConnected type:NodeDataChanged path:/clusterstate.json, has occurred - updating... (live nodes size: 2)
[junit4] 2> 876322 T2311 oascc.ZkStateReader$2.process A cluster state change: WatchedEvent state:SyncConnected type:NodeDataChanged path:/clusterstate.json, has occurred - updating... (live nodes size: 2)
[junit4] 2> 876322 T2318 oascc.ZkStateReader$2.process A cluster state change: WatchedEvent state:SyncConnected type:NodeDataChanged path:/clusterstate.json, has occurred - updating... (live nodes size: 2)
[junit4] 2> 876322 T2331 oascc.ZkStateReader$2.process A cluster state change: WatchedEvent state:SyncConnected type:NodeDataChanged path:/clusterstate.json, has occurred - updating... (live nodes size: 2)
[junit4] 2> 876350 T2289 oasc.ZkController.createEphemeralLiveNode Register node as live in ZooKeeper:/live_nodes/127.0.0.1:41552__qp%2Ffo
[junit4] 2> 876352 T2289 oascc.SolrZkClient.makePath makePath: /live_nodes/127.0.0.1:41552__qp%2Ffo
[junit4] 2> 876355 T2347 oascc.ZkStateReader$2.process A cluster state change: WatchedEvent state:SyncConnected type:NodeChildrenChanged path:/live_nodes, has occurred - updating... (live nodes size: 2)
[junit4] 2> 876355 T2331 oascc.ZkStateReader$2.process A cluster state change: WatchedEvent state:SyncConnected type:NodeChildrenChanged path:/live_nodes, has occurred - updating... (live nodes size: 2)
[junit4] 2> 876355 T2311 oascc.ZkStateReader$3.process Updating live nodes... (3)
[junit4] 2> 876355 T2318 oascc.ZkStateReader$2.process A cluster state change: WatchedEvent state:SyncConnected type:NodeChildrenChanged path:/live_nodes, has occurred - updating... (live nodes size: 2)
[junit4] 2> 876356 T2311 oascc.ZkStateReader$2.process A cluster state change: WatchedEvent state:SyncConnected type:NodeChildrenChanged path:/live_nodes, has occurred - updating... (live nodes size: 3)
[junit4] 2> 876357 T2347 oascc.ZkStateReader$3.process Updating live nodes... (3)
[junit4] 2> 876362 T2331 oascc.ZkStateReader$3.process Updating live nodes... (3)
[junit4] 2> 876362 T2318 oascc.ZkStateReader$3.process Updating live nodes... (3)
[junit4] 2> 876370 T2348 oasc.ZkController.publish publishing core=collection1 state=down
[junit4] 2> 876370 T2348 oasc.ZkController.publish numShards not found on descriptor - reading it from system property
[junit4] 2> 876372 T2348 oasc.ZkController.waitForCoreNodeName look for our core node name
[junit4] 2> 877829 T2312 oascc.ZkStateReader.updateClusterState Updating cloud state from ZooKeeper...
[junit4] 2> 877830 T2312 oasc.Overseer$ClusterStateUpdater.updateState Update state numShards=1 message={
[junit4] 2> "operation":"state",
[junit4] 2> "core_node_name":"core_node2",
[junit4] 2> "numShards":"1",
[junit4] 2> "shard":null,
[junit4] 2> "roles":null,
[junit4] 2> "state":"down",
[junit4] 2> "shard_state":"active",
[junit4] 2> "core":"collection1",
[junit4] 2> "collection":"collection1",
[junit4] 2> "shard_range":null,
[junit4] 2> "node_name":"127.0.0.1:41552__qp%2Ffo",
[junit4] 2> "base_url":"http://127.0.0.1:41552/_qp/fo"}
[junit4] 2> 877830 T2312 oasc.Overseer$ClusterStateUpdater.updateState Collection already exists with numShards=1
[junit4] 2> 877830 T2312 oasc.Overseer$ClusterStateUpdater.updateState Assigning new node to shard shard=shard1
[junit4] 2> 877847 T2311 oascc.ZkStateReader$2.process A cluster state change: WatchedEvent state:SyncConnected type:NodeDataChanged path:/clusterstate.json, has occurred - updating... (live nodes size: 3)
[junit4] 2> 877847 T2347 oascc.ZkStateReader$2.process A cluster state change: WatchedEvent state:SyncConnected type:NodeDataChanged path:/clusterstate.json, has occurred - updating... (live nodes size: 3)
[junit4] 2> 877847 T2318 oascc.ZkStateReader$2.process A cluster state change: WatchedEvent state:SyncConnected type:NodeDataChanged path:/clusterstate.json, has occurred - updating... (live nodes size: 3)
[junit4] 2> 877847 T2331 oascc.ZkStateReader$2.process A cluster state change: WatchedEvent state:SyncConnected type:NodeDataChanged path:/clusterstate.json, has occurred - updating... (live nodes size: 3)
[junit4] 2> 878374 T2348 oasc.ZkController.waitForShardId waiting to find shard id in clusterstate for collection1
[junit4] 2> 878374 T2348 oasc.CoreContainer.create Creating SolrCore 'collection1' using instanceDir: ../../../../../../../../../../../usr/home/hudson/hudson-slave/workspace/Lucene-Solr-Tests-4.x-Java7/solr/build/solr-core/test/J1/./org.apache.solr.cloud.SyncSliceTest-jetty2-1379175568973/collection1
[junit4] 2> 878374 T2348 oasc.ZkController.createCollectionZkNode Check for collection zkNode:collection1
[junit4] 2> 878375 T2348 oasc.ZkController.createCollectionZkNode Collection zkNode exists
[junit4] 2> 878376 T2348 oasc.ZkController.readConfigName Load collection config from:/collections/collection1
[junit4] 2> 878377 T2348 oasc.SolrResourceLoader.<init> new SolrResourceLoader for directory: '../../../../../../../../../../../usr/home/hudson/hudson-slave/workspace/Lucene-Solr-Tests-4.x-Java7/solr/build/solr-core/test/J1/./org.apache.solr.cloud.SyncSliceTest-jetty2-1379175568973/collection1/'
[junit4] 2> 878379 T2348 oasc.SolrResourceLoader.replaceClassLoader Adding 'file:/usr/home/hudson/hudson-slave/workspace/Lucene-Solr-Tests-4.x-Java7/solr/build/solr-core/test/J1/org.apache.solr.cloud.SyncSliceTest-jetty2-1379175568973/collection1/lib/README' to classloader
[junit4] 2> 878380 T2348 oasc.SolrResourceLoader.replaceClassLoader Adding 'file:/usr/home/hudson/hudson-slave/workspace/Lucene-Solr-Tests-4.x-Java7/solr/build/solr-core/test/J1/org.apache.solr.cloud.SyncSliceTest-jetty2-1379175568973/collection1/lib/classes/' to classloader
[junit4] 2> 878449 T2348 oasc.SolrConfig.<init> Using Lucene MatchVersion: LUCENE_46
[junit4] 2> 878543 T2348 oasc.SolrConfig.<init> Loaded SolrConfig: solrconfig.xml
[junit4] 2> 878645 T2348 oass.IndexSchema.readSchema Reading Solr Schema from schema.xml
[junit4] 2> 878657 T2348 oass.IndexSchema.readSchema [null] Schema name=test
[junit4] 2> 879319 T2348 oass.ByteField.init WARN ByteField is deprecated and will be removed in 5.0. You should use TrieIntField instead.
[junit4] 2> 879320 T2348 oass.ShortField.init WARN ShortField is deprecated and will be removed in 5.0. You should use TrieIntField instead.
[junit4] 2> 879320 T2348 oass.OpenExchangeRatesOrgProvider.init Initialized with rates=open-exchange-rates.json, refreshInterval=1440.
[junit4] 2> 879329 T2348 oass.IndexSchema.readSchema default search field in schema is text
[junit4] 2> 879332 T2348 oass.IndexSchema.readSchema unique key field: id
[junit4] 2> 879345 T2348 oass.FileExchangeRateProvider.reload Reloading exchange rates from file currency.xml
[junit4] 2> 879349 T2348 oass.FileExchangeRateProvider.reload Reloading exchange rates from file currency.xml
[junit4] 2> 879353 T2348 oass.OpenExchangeRatesOrgProvider.reload Reloading exchange rates from open-exchange-rates.json
[junit4] 2> 879354 T2348 oass.OpenExchangeRatesOrgProvider$OpenExchangeRates.<init> WARN Unknown key IMPORTANT NOTE
[junit4] 2> 879354 T2348 oass.OpenExchangeRatesOrgProvider$OpenExchangeRates.<init> WARN Expected key, got STRING
[junit4] 2> 879354 T2348 oass.OpenExchangeRatesOrgProvider.reload Reloading exchange rates from open-exchange-rates.json
[junit4] 2> 879355 T2348 oass.OpenExchangeRatesOrgProvider$OpenExchangeRates.<init> WARN Unknown key IMPORTANT NOTE
[junit4] 2> 879355 T2348 oass.OpenExchangeRatesOrgProvider$OpenExchangeRates.<init> WARN Expected key, got STRING
[junit4] 2> 879356 T2348 oasc.SolrCore.initDirectoryFactory org.apache.solr.core.MockDirectoryFactory
[junit4] 2> 879356 T2348 oasc.SolrCore.<init> [collection1] Opening new SolrCore at ../../../../../../../../../../../usr/home/hudson/hudson-slave/workspace/Lucene-Solr-Tests-4.x-Java7/solr/build/solr-core/test/J1/./org.apache.solr.cloud.SyncSliceTest-jetty2-1379175568973/collection1/, dataDir=./org.apache.solr.cloud.SyncSliceTest-1379175557455/jetty2/
[junit4] 2> 879356 T2348 oasc.JmxMonitoredMap.<init> JMX monitoring is enabled. Adding Solr mbeans to JMX Server: com.sun.jmx.mbeanserver.JmxMBeanServer@4b08e64d
[junit4] 2> 879357 T2348 oasc.CachingDirectoryFactory.get return new directory for ./org.apache.solr.cloud.SyncSliceTest-1379175557455/jetty2
[junit4] 2> 879357 T2348 oasc.SolrCore.getNewIndexDir New index directory detected: old=null new=./org.apache.solr.cloud.SyncSliceTest-1379175557455/jetty2/index/
[junit4] 2> 879357 T2348 oasc.SolrCore.initIndex WARN [collection1] Solr index directory './org.apache.solr.cloud.SyncSliceTest-1379175557455/jetty2/index' doesn't exist. Creating new index...
[junit4] 2> 879358 T2348 oasc.CachingDirectoryFactory.get return new directory for ./org.apache.solr.cloud.SyncSliceTest-1379175557455/jetty2/index
[junit4] 2> 879358 T2348 oasu.RandomMergePolicy.<init> RandomMergePolicy wrapping class org.apache.lucene.index.TieredMergePolicy: [TieredMergePolicy: maxMergeAtOnce=39, maxMergeAtOnceExplicit=34, maxMergedSegmentMB=32.349609375, floorSegmentMB=0.2421875, forceMergeDeletesPctAllowed=5.108076947987805, segmentsPerTier=48.0, maxCFSSegmentSizeMB=8.796093022207999E12, noCFSRatio=1.0
[junit4] 2> 879359 T2348 oasc.SolrDeletionPolicy.onCommit SolrDeletionPolicy.onCommit: commits: num=1
[junit4] 2> commit{dir=MockDirectoryWrapper(org.apache.lucene.store.RAMDirectory@2ffacff1 lockFactory=org.apache.lucene.store.SingleInstanceLockFactory@58d8249d),segFN=segments_1,generation=1}
[junit4] 2> 879359 T2348 oasc.SolrDeletionPolicy.updateCommits newest commit generation = 1
[junit4] 2> 879363 T2348 oasup.UpdateRequestProcessorChain.init creating updateRequestProcessorChain "nodistrib"
[junit4] 2> 879363 T2348 oasup.UpdateRequestProcessorChain.init creating updateRequestProcessorChain "dedupe"
[junit4] 2> 879363 T2348 oasup.UpdateRequestProcessorChain.init inserting DistributedUpdateProcessorFactory into updateRequestProcessorChain "dedupe"
[junit4] 2> 879364 T2348 oasup.UpdateRequestProcessorChain.init creating updateRequestProcessorChain "stored_sig"
[junit4] 2> 879364 T2348 oasup.UpdateRequestProcessorChain.init inserting DistributedUpdateProcessorFactory into updateRequestProcessorChain "stored_sig"
[junit4] 2> 879364 T2348 oasup.UpdateRequestProcessorChain.init creating updateRequestProcessorChain "distrib-dup-test-chain-explicit"
[junit4] 2> 879364 T2348 oasup.UpdateRequestProcessorChain.init creating updateRequestProcessorChain "distrib-dup-test-chain-implicit"
[junit4] 2> 879365 T2348 oasup.UpdateRequestProcessorChain.init inserting DistributedUpdateProcessorFactory into updateRequestProcessorChain "distrib-dup-test-chain-implicit"
[junit4] 2> 879365 T2348 oasc.SolrCore.loadUpdateProcessorChains no updateRequestProcessorChain defined as default, creating implicit default
[junit4] 2> 879366 T2348 oasc.RequestHandlers.initHandlersFromConfig created standard: solr.StandardRequestHandler
[junit4] 2> 879366 T2348 oasc.RequestHandlers.initHandlersFromConfig created /get: solr.RealTimeGetHandler
[junit4] 2> 879366 T2348 oasc.RequestHandlers.initHandlersFromConfig adding lazy requestHandler: solr.ReplicationHandler
[junit4] 2> 879366 T2348 oasc.RequestHandlers.initHandlersFromConfig created /replication: solr.ReplicationHandler
[junit4] 2> 879367 T2348 oasc.RequestHandlers.initHandlersFromConfig created /update: solr.UpdateRequestHandler
[junit4] 2> 879367 T2348 oasc.RequestHandlers.initHandlersFromConfig created /admin/: org.apache.solr.handler.admin.AdminHandlers
[junit4] 2> 879378 T2348 oashl.XMLLoader.init xsltCacheLifetimeSeconds=60
[junit4] 2> 879382 T2348 oasu.CommitTracker.<init> Hard AutoCommit: disabled
[junit4] 2> 879382 T2348 oasu.CommitTracker.<init> Soft AutoCommit: disabled
[junit4] 2> 879383 T2348 oasu.RandomMergePolicy.<init> RandomMergePolicy wrapping class org.apache.lucene.index.LogByteSizeMergePolicy: [LogByteSizeMergePolicy: minMergeSize=1677721, mergeFactor=26, maxMergeSize=2147483648, maxMergeSizeForForcedMerge=9223372036854775807, calibrateSizeByDeletes=false, maxMergeDocs=2147483647, maxCFSSegmentSizeMB=8.796093022207999E12, noCFSRatio=1.0]
[junit4] 2> 879383 T2348 oasc.SolrDeletionPolicy.onInit SolrDeletionPolicy.onInit: commits: num=1
[junit4] 2> commit{dir=MockDirectoryWrapper(org.apache.lucene.store.RAMDirectory@2ffacff1 lockFactory=org.apache.lucene.store.SingleInstanceLockFactory@58d8249d),segFN=segments_1,generation=1}
[junit4] 2> 879384 T2348 oasc.SolrDeletionPolicy.updateCommits newest commit generation = 1
[junit4] 2> 879384 T2348 oass.SolrIndexSearcher.<init> Opening Searcher@52e1621e main
[junit4] 2> 879387 T2349 oasc.SolrCore.registerSearcher [collection1] Registered new searcher Searcher@52e1621e main{StandardDirectoryReader(segments_1:1:nrt)}
[junit4] 2> 879389 T2348 oasc.CoreContainer.registerCore registering core: collection1
[junit4] 2> 879390 T2348 oasc.ZkController.register Register replica - core:collection1 address:http://127.0.0.1:41552/_qp/fo collection:collection1 shard:shard1
[junit4] 2> 879390 T2348 oascsi.HttpClientUtil.createClient Creating new http client, config:maxConnections=10000&maxConnectionsPerHost=20&connTimeout=15000&socketTimeout=30000&retry=false
[junit4] 2> 879431 T2348 oasc.ZkController.register We are http://127.0.0.1:41552/_qp/fo/collection1/ and leader is http://127.0.0.1:48304/_qp/fo/collection1/
[junit4] 2> 879431 T2348 oasc.ZkController.register No LogReplay needed for core=collection1 baseURL=http://127.0.0.1:41552/_qp/fo
[junit4] 2> 879432 T2348 oasc.ZkController.checkRecovery Core needs to recover:collection1
[junit4] 2> 879432 T2348 oasu.DefaultSolrCoreState.doRecovery Running recovery - first canceling any ongoing recovery
[junit4] 2> ASYNC NEW_CORE C640 name=collection1 org.apache.solr.core.SolrCore@12cc2b41 url=http://127.0.0.1:41552/_qp/fo/collection1 node=127.0.0.1:41552__qp%2Ffo C640_STATE=coll:collection1 core:collection1 props:{state=down, core=collection1, node_name=127.0.0.1:41552__qp%2Ffo, base_url=http://127.0.0.1:41552/_qp/fo}
[junit4] 2> 879432 T2350 C640 P41552 oasc.RecoveryStrategy.run Starting recovery process. core=collection1 recoveringAfterStartup=true
[junit4] 2> 879433 T2348 oascc.ZkStateReader.updateClusterState Updating cloud state from ZooKeeper...
[junit4] 2> 879434 T2350 C640 P41552 oasc.RecoveryStrategy.doRecovery ###### startupVersions=[]
[junit4] 2> 879435 T2350 C640 P41552 oasc.ZkController.publish publishing core=collection1 state=recovering
[junit4] 2> 879435 T2350 C640 P41552 oasc.ZkController.publish numShards not found on descriptor - reading it from system property
[junit4] 2> 879435 T2289 oass.SolrDispatchFilter.init user.dir=/usr/home/hudson/hudson-slave/workspace/Lucene-Solr-Tests-4.x-Java7/solr/build/solr-core/test/J1
[junit4] 2> 879436 T2289 oass.SolrDispatchFilter.init SolrDispatchFilter.init() done
[junit4] 2> 879436 T2350 C640 P41552 oascsi.HttpClientUtil.createClient Creating new http client, config:maxConnections=128&maxConnectionsPerHost=32&followRedirects=false
[junit4] 2> 879436 T2289 oascsi.HttpClientUtil.createClient Creating new http client, config:maxConnections=128&maxConnectionsPerHost=32&followRedirects=false
[junit4] 2> 879453 T2321 oasha.CoreAdminHandler.handleWaitForStateAction Going to wait for coreNodeName: core_node2, state: recovering, checkLive: true, onlyIfLeader: true
[junit4] 2> 879632 T2289 oejs.Server.doStart jetty-8.1.10.v20130312
[junit4] 2> 879634 T2289 oejs.AbstractConnector.doStart Started SocketConnector@127.0.0.1:?????
[junit4] 2> 879635 T2289 oass.SolrDispatchFilter.init SolrDispatchFilter.init()
[junit4] 2> 879635 T2289 oasc.SolrResourceLoader.locateSolrHome JNDI not configured for solr (NoInitialContextEx)
[junit4] 2> 879636 T2289 oasc.SolrResourceLoader.locateSolrHome using system property solr.solr.home: ../../../../../../../../../../../usr/home/hudson/hudson-slave/workspace/Lucene-Solr-Tests-4.x-Java7/solr/build/solr-core/test/J1/./org.apache.solr.cloud.SyncSliceTest-jetty3-1379175573575
[junit4] 2> 879636 T2289 oasc.SolrResourceLoader.<init> new SolrResourceLoader for directory: '../../../../../../../../../../../usr/home/hudson/hudson-slave/workspace/Lucene-Solr-Tests-4.x-Java7/solr/build/solr-core/test/J1/./org.apache.solr.cloud.SyncSliceTest-jetty3-1379175573575/'
[junit4] 2> 879666 T2289 oasc.ConfigSolr.fromFile Loading container configuration from /usr/home/hudson/hudson-slave/workspace/Lucene-Solr-Tests-4.x-Java7/solr/build/solr-core/test/J1/../../../../../../../../../../../usr/home/hudson/hudson-slave/workspace/Lucene-Solr-Tests-4.x-Java7/solr/build/solr-core/test/J1/./org.apache.solr.cloud.SyncSliceTest-jetty3-1379175573575/solr.xml
[junit4] 2> 879729 T2289 oasc.CoreContainer.<init> New CoreContainer 1626004471
[junit4] 2> 879730 T2289 oasc.CoreContainer.load Loading cores into CoreContainer [instanceDir=../../../../../../../../../../../usr/home/hudson/hudson-slave/workspace/Lucene-Solr-Tests-4.x-Java7/solr/build/solr-core/test/J1/./org.apache.solr.cloud.SyncSliceTest-jetty3-1379175573575/]
[junit4] 2> 879731 T2289 oashc.HttpShardHandlerFactory.getParameter Setting socketTimeout to: 120000
[junit4] 2> 879731 T2289 oashc.HttpShardHandlerFactory.getParameter Setting urlScheme to: http://
[junit4] 2> 879732 T2289 oashc.HttpShardHandlerFactory.getParameter Setting connTimeout to: 15000
[junit4] 2> 879732 T2289 oashc.HttpShardHandlerFactory.getParameter Setting maxConnectionsPerHost to: 20
[junit4] 2> 879732 T2289 oashc.HttpShardHandlerFactory.getParameter Setting corePoolSize to: 0
[junit4] 2> 879733 T2289 oashc.HttpShardHandlerFactory.getParameter Setting maximumPoolSize to: 2147483647
[junit4] 2> 879733 T2289 oashc.HttpShardHandlerFactory.getParameter Setting maxThreadIdleTime to: 5
[junit4] 2> 879733 T2289 oashc.HttpShardHandlerFactory.getParameter Setting sizeOfQueue to: -1
[junit4] 2> 879734 T2289 oashc.HttpShardHandlerFactory.getParameter Setting fairnessPolicy to: false
[junit4] 2> 879734 T2289 oascsi.HttpClientUtil.createClient Creating new http client, config:maxConnectionsPerHost=20&maxConnections=10000&socketTimeout=120000&connTimeout=15000&retry=false
[junit4] 2> 879745 T2289 oasl.LogWatcher.createWatcher SLF4J impl is org.slf4j.impl.Log4jLoggerFactory
[junit4] 2> 879746 T2289 oasl.LogWatcher.newRegisteredLogWatcher Registering Log Listener [Log4j (org.slf4j.impl.Log4jLoggerFactory)]
[junit4] 2> 879746 T2289 oasc.ZkContainer.initZooKeeper Zookeeper client=127.0.0.1:34991/solr
[junit4] 2> 879747 T2289 oasc.ZkController.checkChrootPath zkHost includes chroot
[junit4] 2> 879747 T2289 oascc.ConnectionManager.waitForConnected Waiting for client to connect to ZooKeeper
[junit4] 2> 879751 T2362 oascc.ConnectionManager.process Watcher org.apache.solr.common.cloud.ConnectionManager@19aa9fff name:ZooKeeperConnection Watcher:127.0.0.1:34991 got event WatchedEvent state:SyncConnected type:None path:null path:null type:None
[junit4] 2> 879751 T2289 oascc.ConnectionManager.waitForConnected Client is connected to ZooKeeper
[junit4] 2> 879776 T2289 oascsi.HttpClientUtil.createClient Creating new http client, config:maxConnections=500&maxConnectionsPerHost=16&socketTimeout=120000&connTimeout=15000
[junit4] 2> 879788 T2289 oascc.ConnectionManager.waitForConnected Waiting for client to connect to ZooKeeper
[junit4] 2> 879791 T2364 oascc.ConnectionManager.process Watcher org.apache.solr.common.cloud.ConnectionManager@74605dd name:ZooKeeperConnection Watcher:127.0.0.1:34991/solr got event WatchedEvent state:SyncConnected type:None path:null path:null type:None
[junit4] 2> 879791 T2289 oascc.ConnectionManager.waitForConnected Client is connected to ZooKeeper
[junit4] 2> 879803 T2289 oascc.ZkStateReader.createClusterStateWatchersAndUpdate Updating cluster state from ZooKeeper...
[junit4] 2> 880807 T2289 oasc.ZkController.createEphemeralLiveNode Register node as live in ZooKeeper:/live_nodes/127.0.0.1:29505__qp%2Ffo
[junit4] 2> 880816 T2289 oascc.SolrZkClient.makePath makePath: /live_nodes/127.0.0.1:29505__qp%2Ffo
[junit4] 2> 880820 T2318 oascc.ZkStateReader$2.process A cluster state change: WatchedEvent state:SyncConnected type:NodeChildrenChanged path:/live_nodes, has occurred - updating... (live nodes size: 3)
[junit4] 2> 880820 T2331 oascc.ZkStateReader$2.process A cluster state change: WatchedEvent state:SyncConnected type:NodeChildrenChanged path:/live_nodes, has occurred - updating... (live nodes size: 3)
[junit4] 2> 880821 T2311 oascc.ZkStateReader$3.process Updating live nodes... (4)
[junit4] 2> 880820 T2347 oascc.ZkStateReader$2.process A cluster state change: WatchedEvent state:SyncConnected type:NodeChildrenChanged path:/live_nodes, has occurred - updating... (live nodes size: 3)
[junit4] 2> 880821 T2311 oascc.ZkStateReader$2.process A cluster state change: WatchedEvent state:SyncConnected type:NodeChildrenChanged path:/live_nodes, has occurred - updating... (live nodes size: 4)
[junit4] 2> 880821 T2364 oascc.ZkStateReader$3.process Updating live nodes... (4)
[junit4] 2> 880822 T2318 oascc.ZkStateReader$3.process Updating live nodes... (4)
[junit4] 2> 880834 T2331 oascc.ZkStateReader$3.process Updating live nodes... (4)
[junit4] 2> 880834 T2347 oascc.ZkStateReader$3.process Updating live nodes... (4)
[junit4] 2> 880841 T2365 oasc.ZkController.publish publishing core=collection1 state=down
[junit4] 2> 880841 T2365 oasc.ZkController.publish numShards not found on descriptor - reading it from system property
[junit4] 2> 880842 T2365 oasc.ZkController.waitForCoreNodeName look for our core node name
[junit4] 2> 880853 T2312 oascc.ZkStateReader.updateClusterState Updating cloud state from ZooKeeper...
[junit4] 2> 880854 T2312 oasc.Overseer$ClusterStateUpdater.updateState Update state numShards=1 message={
[junit4] 2> "operation":"state",
[junit4] 2> "core_node_name":"core_node2",
[junit4] 2> "numShards":"1",
[junit4] 2> "shard":"shard1",
[junit4] 2> "roles":null,
[junit4] 2> "state":"recovering",
[junit4] 2> "shard_state":"active",
[junit4] 2> "core":"collection1",
[junit4] 2> "collection":"collection1",
[junit4] 2> "shard_range":null,
[junit4] 2> "node_name":"127.0.0.1:41552__qp%2Ffo",
[junit4] 2> "base_url":"http://127.0.0.1:41552/_qp/fo"}
[junit4] 2> 880858 T2312 oasc.Overseer$ClusterStateUpdater.updateState Update state numShards=1 message={
[junit4] 2> "operation":"state",
[junit4] 2> "core_node_name":"core_node3",
[junit4] 2> "numShards":"1",
[junit4] 2> "shard":n
[...truncated too long message...]
LeaderElectionContext.runLeaderProcess Sync was not a success but no one else is active! I am the leader
[junit4] 2> 1649415 T2689 oasc.ShardLeaderElectionContext.runLeaderProcess I am the new leader: http://127.0.0.1:46093/collection1/ shard1
[junit4] 2> 1649415 T2689 oasc.SolrCore.close [collection1] CLOSING SolrCore org.apache.solr.core.SolrCore@af5e5e5
[junit4] 2> 1649416 T2689 oasu.DirectUpdateHandler2.close closing DirectUpdateHandler2{commits=10,autocommits=0,soft autocommits=0,optimizes=0,rollbacks=0,expungeDeletes=0,docsPending=0,adds=0,deletesById=0,deletesByQuery=0,errors=0,cumulative_adds=52,cumulative_deletesById=3,cumulative_deletesByQuery=2,cumulative_errors=0}
[junit4] 2> 1649417 T2689 oasu.SolrCoreState.decrefSolrCoreState Closing SolrCoreState
[junit4] 2> 1649417 T2689 oasu.DefaultSolrCoreState.closeIndexWriter SolrCoreState ref count has reached 0 - closing IndexWriter
[junit4] 2> 1649417 T2689 oasu.DefaultSolrCoreState.closeIndexWriter closing IndexWriter with IndexWriterCloser
[junit4] 2> 1649419 T2689 oasc.SolrCore.closeSearcher [collection1] Closing main searcher on request.
[junit4] 2> 1649419 T2689 oasc.CachingDirectoryFactory.close Closing MockDirectoryFactory - 2 directories currently being tracked
[junit4] 2> 1649419 T2689 oasc.CachingDirectoryFactory.closeCacheValue looking to close ./org.apache.solr.cloud.FullSolrCloudDistribCmdsTest-1379176274186/jetty3 [CachedDir<<refCount=0;path=./org.apache.solr.cloud.FullSolrCloudDistribCmdsTest-1379176274186/jetty3;done=false>>]
[junit4] 2> 1649420 T2689 oasc.CachingDirectoryFactory.close Closing directory: ./org.apache.solr.cloud.FullSolrCloudDistribCmdsTest-1379176274186/jetty3
[junit4] 2> 1649420 T2689 oasc.CachingDirectoryFactory.closeCacheValue looking to close ./org.apache.solr.cloud.FullSolrCloudDistribCmdsTest-1379176274186/jetty3/index [CachedDir<<refCount=0;path=./org.apache.solr.cloud.FullSolrCloudDistribCmdsTest-1379176274186/jetty3/index;done=false>>]
[junit4] 2> 1649420 T2689 oasc.CachingDirectoryFactory.close Closing directory: ./org.apache.solr.cloud.FullSolrCloudDistribCmdsTest-1379176274186/jetty3/index
[junit4] 2> 1649421 T2689 oascc.SolrZkClient.makePath makePath: /collections/collection1/leaders/shard1
[junit4] 2> 1649421 T2689 oasc.SolrException.log ERROR There was a problem trying to register as the leader:org.apache.zookeeper.KeeperException$SessionExpiredException: KeeperErrorCode = Session expired for /collections
[junit4] 2> at org.apache.zookeeper.KeeperException.create(KeeperException.java:127)
[junit4] 2> at org.apache.zookeeper.KeeperException.create(KeeperException.java:51)
[junit4] 2> at org.apache.zookeeper.ZooKeeper.exists(ZooKeeper.java:1041)
[junit4] 2> at org.apache.solr.common.cloud.SolrZkClient$3.execute(SolrZkClient.java:184)
[junit4] 2> at org.apache.solr.common.cloud.SolrZkClient$3.execute(SolrZkClient.java:181)
[junit4] 2> at org.apache.solr.common.cloud.ZkCmdExecutor.retryOperation(ZkCmdExecutor.java:65)
[junit4] 2> at org.apache.solr.common.cloud.SolrZkClient.exists(SolrZkClient.java:181)
[junit4] 2> at org.apache.solr.common.cloud.SolrZkClient.makePath(SolrZkClient.java:392)
[junit4] 2> at org.apache.solr.common.cloud.SolrZkClient.makePath(SolrZkClient.java:361)
[junit4] 2> at org.apache.solr.common.cloud.SolrZkClient.makePath(SolrZkClient.java:348)
[junit4] 2> at org.apache.solr.cloud.ShardLeaderElectionContextBase.runLeaderProcess(ElectionContext.java:95)
[junit4] 2> at org.apache.solr.cloud.ShardLeaderElectionContext.runLeaderProcess(ElectionContext.java:255)
[junit4] 2> at org.apache.solr.cloud.LeaderElector.runIamLeaderProcess(LeaderElector.java:156)
[junit4] 2> at org.apache.solr.cloud.LeaderElector.checkIfIamLeader(LeaderElector.java:100)
[junit4] 2> at org.apache.solr.cloud.LeaderElector.access$000(LeaderElector.java:55)
[junit4] 2> at org.apache.solr.cloud.LeaderElector$1.process(LeaderElector.java:129)
[junit4] 2> at org.apache.zookeeper.ClientCnxn$EventThread.processEvent(ClientCnxn.java:519)
[junit4] 2> at org.apache.zookeeper.ClientCnxn$EventThread.run(ClientCnxn.java:495)
[junit4] 2>
[junit4] 2> 1649422 T2689 oasc.LeaderElector$1.process WARN org.apache.zookeeper.KeeperException$SessionExpiredException: KeeperErrorCode = Session expired for /collections/collection1/leader_elect/shard1/election/90385696305512458-core_node3-n_0000000001
[junit4] 2> at org.apache.zookeeper.KeeperException.create(KeeperException.java:127)
[junit4] 2> at org.apache.zookeeper.KeeperException.create(KeeperException.java:51)
[junit4] 2> at org.apache.zookeeper.ZooKeeper.delete(ZooKeeper.java:873)
[junit4] 2> at org.apache.solr.common.cloud.SolrZkClient$2.execute(SolrZkClient.java:152)
[junit4] 2> at org.apache.solr.common.cloud.SolrZkClient$2.execute(SolrZkClient.java:149)
[junit4] 2> at org.apache.solr.common.cloud.ZkCmdExecutor.retryOperation(ZkCmdExecutor.java:65)
[junit4] 2> at org.apache.solr.common.cloud.SolrZkClient.delete(SolrZkClient.java:149)
[junit4] 2> at org.apache.solr.cloud.ElectionContext.cancelElection(ElectionContext.java:63)
[junit4] 2> at org.apache.solr.cloud.ShardLeaderElectionContext.runLeaderProcess(ElectionContext.java:258)
[junit4] 2> at org.apache.solr.cloud.LeaderElector.runIamLeaderProcess(LeaderElector.java:156)
[junit4] 2> at org.apache.solr.cloud.LeaderElector.checkIfIamLeader(LeaderElector.java:100)
[junit4] 2> at org.apache.solr.cloud.LeaderElector.access$000(LeaderElector.java:55)
[junit4] 2> at org.apache.solr.cloud.LeaderElector$1.process(LeaderElector.java:129)
[junit4] 2> at org.apache.zookeeper.ClientCnxn$EventThread.processEvent(ClientCnxn.java:519)
[junit4] 2> at org.apache.zookeeper.ClientCnxn$EventThread.run(ClientCnxn.java:495)
[junit4] 2>
[junit4] 2> 1649422 T2689 oascc.ZkStateReader$2.process A cluster state change: WatchedEvent state:SyncConnected type:NodeChildrenChanged path:/live_nodes, has occurred - updating... (live nodes size: 5)
[junit4] 2> 1649423 T2689 oascc.ZkStateReader$2.process WARN ZooKeeper watch triggered, but Solr cannot talk to ZK
[junit4] 2> 1649423 T2689 oascc.ZkStateReader$3.process WARN ZooKeeper watch triggered, but Solr cannot talk to ZK
[junit4] 2> NOTE: test params are: codec=Appending, sim=RandomSimilarityProvider(queryNorm=true,coord=no): {}, locale=sr_RS_#Latn, timezone=Asia/Bahrain
[junit4] 2> NOTE: FreeBSD 9.1-RELEASE-p3 amd64/Oracle Corporation 1.7.0_25 (64-bit)/cpus=16,threads=3,free=317462856,total=533725184
[junit4] 2> NOTE: All tests run in this JVM: [ExternalFileFieldSortTest, SliceStateUpdateTest, TestRemoteStreaming, TestSolrXMLSerializer, SolrPluginUtilsTest, TestCloudManagedSchemaAddField, TestAnalyzedSuggestions, AutoCommitTest, TestManagedSchemaFieldResource, TestSearchPerf, RegexBoostProcessorTest, BadIndexSchemaTest, RAMDirectoryFactoryTest, DocValuesTest, TestDistributedSearch, TestBadConfig, TestRecovery, StressHdfsTest, TestUniqueKeyFieldResource, TestCodecSupport, TestQueryTypes, UniqFieldsUpdateProcessorFactoryTest, MultiTermTest, CurrencyFieldOpenExchangeTest, CSVRequestHandlerTest, SolrInfoMBeanTest, PluginInfoTest, TestSchemaResource, TestJoin, TestMergePolicyConfig, SolrCoreTest, TestBM25SimilarityFactory, TestFoldingMultitermQuery, SolrTestCaseJ4Test, TestCSVLoader, DeleteShardTest, TestJmxIntegration, WordBreakSolrSpellCheckerTest, SortByFunctionTest, AddSchemaFieldsUpdateProcessorFactoryTest, SynonymTokenizerTest, FileUtilsTest, TestZkChroot, CachingDirectoryFactoryTest, ClusterStateTest, TestStressRecovery, TestOmitPositions, TestCloudManagedSchema, TestNonNRTOpen, BadComponentTest, TestPartialUpdateDeduplication, HdfsRecoveryZkTest, TestCollationField, ShowFileRequestHandlerTest, TestUpdate, CoreContainerCoreInitFailuresTest, TestQuerySenderListener, InfoHandlerTest, OutputWriterTest, TestDFRSimilarityFactory, CollectionsAPIDistributedZkTest, TestNumberUtils, HdfsLockFactoryTest, TestReloadAndDeleteDocs, HardAutoCommitTest, PreAnalyzedUpdateProcessorTest, TestSolrJ, TestFieldCollectionResource, ChaosMonkeyNothingIsSafeTest, TestSuggestSpellingConverter, SolrCoreCheckLockOnStartupTest, TestValueSourceCache, XmlUpdateRequestHandlerTest, MinimalSchemaTest, BasicZkTest, FieldMutatingUpdateProcessorTest, TestRandomDVFaceting, UnloadDistributedZkTest, LeaderElectionIntegrationTest, OpenCloseCoreStressTest, FullSolrCloudDistribCmdsTest]
[junit4] Completed on J0 in 69.73s, 1 test, 1 error <<< FAILURES!
[...truncated 463 lines...]
BUILD FAILED
/usr/home/hudson/hudson-slave/workspace/Lucene-Solr-Tests-4.x-Java7/build.xml:402: The following error occurred while executing this line:
/usr/home/hudson/hudson-slave/workspace/Lucene-Solr-Tests-4.x-Java7/build.xml:382: The following error occurred while executing this line:
/usr/home/hudson/hudson-slave/workspace/Lucene-Solr-Tests-4.x-Java7/build.xml:39: The following error occurred while executing this line:
/usr/home/hudson/hudson-slave/workspace/Lucene-Solr-Tests-4.x-Java7/solr/build.xml:189: The following error occurred while executing this line:
/usr/home/hudson/hudson-slave/workspace/Lucene-Solr-Tests-4.x-Java7/solr/common-build.xml:455: The following error occurred while executing this line:
/usr/home/hudson/hudson-slave/workspace/Lucene-Solr-Tests-4.x-Java7/lucene/common-build.xml:1233: The following error occurred while executing this line:
/usr/home/hudson/hudson-slave/workspace/Lucene-Solr-Tests-4.x-Java7/lucene/common-build.xml:876: There were test failures: 326 suites, 1451 tests, 2 errors, 1 failure, 34 ignored (6 assumptions)
Total time: 55 minutes 45 seconds
Build step 'Invoke Ant' marked build as failure
Archiving artifacts
Recording test results
Email was triggered for: Failure
Sending email for trigger: Failure