You are viewing a plain text version of this content. The canonical link for it is here.
Posted to dev@pulsar.apache.org by Apache Jenkins Server <je...@builds.apache.org> on 2018/01/08 08:30:11 UTC
Build failed in Jenkins: pulsar-master #214
See <https://builds.apache.org/job/pulsar-master/214/display/redirect?page=changes>
Changes:
[mmerli] Expose sequenceId in message (#1026)
[mmerli] Standardize the unit tests to use TestNG methods only (#1032)
[mmerli] Add optional key/value metadata to consumers. (#1031)
------------------------------------------
[...truncated 381.12 KB...]
Step 4/15 : RUN apt-get -y install postgresql python sudo nginx supervisor
---> Running in 74d5d14d2145
Reading package lists...
Building dependency tree...
Reading state information...
python is already the newest version.
python set to manually installed.
The following extra packages will be installed:
bsd-mailx cron exim4 exim4-base exim4-config exim4-daemon-light
init-system-helpers liblockfile-bin liblockfile1 libpopt0 locales logrotate
lsb-release nginx-common nginx-full postgresql-9.4 postgresql-client-9.4
postgresql-client-common postgresql-common psmisc python-meld3
python-pkg-resources ssl-cert
Suggested packages:
anacron checksecurity mail-reader eximon4 exim4-doc-html exim4-doc-info
spf-tools-perl swaks lsb fcgiwrap nginx-doc postgresql-doc oidentd
ident-server locales-all postgresql-doc-9.4 python-distribute
python-distribute-doc openssl-blacklist
Recommended packages:
mailx
The following NEW packages will be installed:
bsd-mailx cron exim4 exim4-base exim4-config exim4-daemon-light
init-system-helpers liblockfile-bin liblockfile1 libpopt0 locales logrotate
lsb-release nginx nginx-common nginx-full postgresql postgresql-9.4
postgresql-client-9.4 postgresql-client-common postgresql-common psmisc
python-meld3 python-pkg-resources ssl-cert sudo supervisor
0 upgraded, 27 newly installed, 0 to remove and 2 not upgraded.
Need to get 13.5 MB of archives.
After this operation, 52.1 MB of additional disk space will be used.
Get:1 http://deb.debian.org/debian/ jessie/main init-system-helpers all 1.22 [14.0 kB]
Get:2 http://deb.debian.org/debian/ jessie/main cron amd64 3.0pl1-127+deb8u1 [94.0 kB]
Get:3 http://deb.debian.org/debian/ jessie/main libpopt0 amd64 1.16-10 [49.2 kB]
Get:4 http://deb.debian.org/debian/ jessie/main liblockfile-bin amd64 1.09-6 [18.9 kB]
Get:5 http://deb.debian.org/debian/ jessie/main liblockfile1 amd64 1.09-6 [15.8 kB]
Get:6 http://deb.debian.org/debian/ jessie/main logrotate amd64 3.8.7-1+b1 [52.2 kB]
Get:7 http://deb.debian.org/debian/ jessie/main exim4-config all 4.84.2-2+deb8u4 [502 kB]
Get:8 http://deb.debian.org/debian/ jessie/main exim4-base amd64 4.84.2-2+deb8u4 [1049 kB]
Get:9 http://deb.debian.org/debian/ jessie/main exim4-daemon-light amd64 4.84.2-2+deb8u4 [632 kB]
Get:10 http://deb.debian.org/debian/ jessie/main bsd-mailx amd64 8.1.2-0.20141216cvs-2 [81.7 kB]
Get:11 http://deb.debian.org/debian/ jessie/main exim4 all 4.84.2-2+deb8u4 [8584 B]
Get:12 http://deb.debian.org/debian/ jessie/main locales all 2.19-18+deb8u10 [3930 kB]
Get:13 http://deb.debian.org/debian/ jessie/main lsb-release all 4.1+Debian13+nmu1 [26.5 kB]
Get:14 http://deb.debian.org/debian/ jessie/main nginx-common all 1.6.2-5+deb8u5 [88.0 kB]
Get:15 http://deb.debian.org/debian/ jessie/main nginx-full amd64 1.6.2-5+deb8u5 [430 kB]
Get:16 http://deb.debian.org/debian/ jessie/main nginx all 1.6.2-5+deb8u5 [72.6 kB]
Get:17 http://deb.debian.org/debian/ jessie/main postgresql-client-common all 165+deb8u3 [73.8 kB]
Get:18 http://deb.debian.org/debian/ jessie/main postgresql-client-9.4 amd64 9.4.15-0+deb8u1 [1086 kB]
Get:19 http://deb.debian.org/debian/ jessie/main ssl-cert all 1.0.35 [20.9 kB]
Get:20 http://deb.debian.org/debian/ jessie/main postgresql-common all 165+deb8u3 [203 kB]
Get:21 http://deb.debian.org/debian/ jessie/main postgresql-9.4 amd64 9.4.15-0+deb8u1 [3704 kB]
Get:22 http://deb.debian.org/debian/ jessie/main postgresql all 9.4+165+deb8u3 [52.4 kB]
Get:23 http://deb.debian.org/debian/ jessie/main psmisc amd64 22.21-2 [119 kB]
Get:24 http://deb.debian.org/debian/ jessie/main python-pkg-resources all 5.5.1-1 [64.4 kB]
Get:25 http://deb.debian.org/debian/ jessie/main sudo amd64 1.8.10p3-1+deb8u5 [854 kB]
Get:26 http://deb.debian.org/debian/ jessie/main python-meld3 amd64 1.0.0-1 [37.0 kB]
Get:27 http://deb.debian.org/debian/ jessie/main supervisor all 3.0r1-1+deb8u1 [267 kB]
debconf: delaying package configuration, since apt-utils is not installed
Fetched 13.5 MB in 4s (2959 kB/s)
Selecting previously unselected package init-system-helpers.
(Reading database ... (Reading database ... 5%(Reading database ... 10%(Reading database ... 15%(Reading database ... 20%(Reading database ... 25%(Reading database ... 30%(Reading database ... 35%(Reading database ... 40%(Reading database ... 45%(Reading database ... 50%(Reading database ... 55%(Reading database ... 60%(Reading database ... 65%(Reading database ... 70%(Reading database ... 75%(Reading database ... 80%(Reading database ... 85%(Reading database ... 90%(Reading database ... 95%(Reading database ... 100%(Reading database ... 21636 files and directories currently installed.)
Preparing to unpack .../init-system-helpers_1.22_all.deb ...
Unpacking init-system-helpers (1.22) ...
Selecting previously unselected package cron.
Preparing to unpack .../cron_3.0pl1-127+deb8u1_amd64.deb ...
Unpacking cron (3.0pl1-127+deb8u1) ...
Selecting previously unselected package libpopt0:amd64.
Preparing to unpack .../libpopt0_1.16-10_amd64.deb ...
Unpacking libpopt0:amd64 (1.16-10) ...
Selecting previously unselected package liblockfile-bin.
Preparing to unpack .../liblockfile-bin_1.09-6_amd64.deb ...
Unpacking liblockfile-bin (1.09-6) ...
Selecting previously unselected package liblockfile1:amd64.
Preparing to unpack .../liblockfile1_1.09-6_amd64.deb ...
Unpacking liblockfile1:amd64 (1.09-6) ...
Selecting previously unselected package logrotate.
Preparing to unpack .../logrotate_3.8.7-1+b1_amd64.deb ...
Unpacking logrotate (3.8.7-1+b1) ...
Selecting previously unselected package exim4-config.
Preparing to unpack .../exim4-config_4.84.2-2+deb8u4_all.deb ...
Unpacking exim4-config (4.84.2-2+deb8u4) ...
Selecting previously unselected package exim4-base.
Preparing to unpack .../exim4-base_4.84.2-2+deb8u4_amd64.deb ...
Unpacking exim4-base (4.84.2-2+deb8u4) ...
Selecting previously unselected package exim4-daemon-light.
Preparing to unpack .../exim4-daemon-light_4.84.2-2+deb8u4_amd64.deb ...
Unpacking exim4-daemon-light (4.84.2-2+deb8u4) ...
Selecting previously unselected package bsd-mailx.
Preparing to unpack .../bsd-mailx_8.1.2-0.20141216cvs-2_amd64.deb ...
Unpacking bsd-mailx (8.1.2-0.20141216cvs-2) ...
Selecting previously unselected package exim4.
Preparing to unpack .../exim4_4.84.2-2+deb8u4_all.deb ...
Unpacking exim4 (4.84.2-2+deb8u4) ...
Selecting previously unselected package locales.
Preparing to unpack .../locales_2.19-18+deb8u10_all.deb ...
Unpacking locales (2.19-18+deb8u10) ...
Selecting previously unselected package lsb-release.
Preparing to unpack .../lsb-release_4.1+Debian13+nmu1_all.deb ...
Unpacking lsb-release (4.1+Debian13+nmu1) ...
Selecting previously unselected package nginx-common.
Preparing to unpack .../nginx-common_1.6.2-5+deb8u5_all.deb ...
Unpacking nginx-common (1.6.2-5+deb8u5) ...
Selecting previously unselected package nginx-full.
Preparing to unpack .../nginx-full_1.6.2-5+deb8u5_amd64.deb ...
Unpacking nginx-full (1.6.2-5+deb8u5) ...
Selecting previously unselected package nginx.
Preparing to unpack .../nginx_1.6.2-5+deb8u5_all.deb ...
Unpacking nginx (1.6.2-5+deb8u5) ...
Selecting previously unselected package postgresql-client-common.
Preparing to unpack .../postgresql-client-common_165+deb8u3_all.deb ...
Unpacking postgresql-client-common (165+deb8u3) ...
Selecting previously unselected package postgresql-client-9.4.
Preparing to unpack .../postgresql-client-9.4_9.4.15-0+deb8u1_amd64.deb ...
Unpacking postgresql-client-9.4 (9.4.15-0+deb8u1) ...
Selecting previously unselected package ssl-cert.
Preparing to unpack .../ssl-cert_1.0.35_all.deb ...
Unpacking ssl-cert (1.0.35) ...
Selecting previously unselected package postgresql-common.
Preparing to unpack .../postgresql-common_165+deb8u3_all.deb ...
Adding 'diversion of /usr/bin/pg_config to /usr/bin/pg_config.libpq-dev by postgresql-common'
Unpacking postgresql-common (165+deb8u3) ...
Selecting previously unselected package postgresql-9.4.
Preparing to unpack .../postgresql-9.4_9.4.15-0+deb8u1_amd64.deb ...
Unpacking postgresql-9.4 (9.4.15-0+deb8u1) ...
Selecting previously unselected package postgresql.
Preparing to unpack .../postgresql_9.4+165+deb8u3_all.deb ...
Unpacking postgresql (9.4+165+deb8u3) ...
Selecting previously unselected package psmisc.
Preparing to unpack .../psmisc_22.21-2_amd64.deb ...
Unpacking psmisc (22.21-2) ...
Selecting previously unselected package python-pkg-resources.
Preparing to unpack .../python-pkg-resources_5.5.1-1_all.deb ...
Unpacking python-pkg-resources (5.5.1-1) ...
Selecting previously unselected package sudo.
Preparing to unpack .../sudo_1.8.10p3-1+deb8u5_amd64.deb ...
Unpacking sudo (1.8.10p3-1+deb8u5) ...
Selecting previously unselected package python-meld3.
Preparing to unpack .../python-meld3_1.0.0-1_amd64.deb ...
Unpacking python-meld3 (1.0.0-1) ...
Selecting previously unselected package supervisor.
Preparing to unpack .../supervisor_3.0r1-1+deb8u1_all.deb ...
Unpacking supervisor (3.0r1-1+deb8u1) ...
Processing triggers for systemd (215-17+deb8u7) ...
Setting up init-system-helpers (1.22) ...
Setting up cron (3.0pl1-127+deb8u1) ...
Adding group `crontab' (GID 108) ...
Done.
update-rc.d: warning: start and stop actions are no longer supported; falling back to defaults
invoke-rc.d: policy-rc.d denied execution of start.
Setting up libpopt0:amd64 (1.16-10) ...
Setting up liblockfile-bin (1.09-6) ...
Setting up liblockfile1:amd64 (1.09-6) ...
Setting up logrotate (3.8.7-1+b1) ...
Setting up exim4-config (4.84.2-2+deb8u4) ...
debconf: unable to initialize frontend: Dialog
debconf: (TERM is not set, so the dialog frontend is not usable.)
debconf: falling back to frontend: Readline
Adding system-user for exim (v4)
Setting up exim4-base (4.84.2-2+deb8u4) ...
debconf: unable to initialize frontend: Dialog
debconf: (TERM is not set, so the dialog frontend is not usable.)
debconf: falling back to frontend: Readline
exim: DB upgrade, deleting hints-db
Setting up exim4-daemon-light (4.84.2-2+deb8u4) ...
debconf: unable to initialize frontend: Dialog
debconf: (TERM is not set, so the dialog frontend is not usable.)
debconf: falling back to frontend: Readline
invoke-rc.d: policy-rc.d denied execution of start.
Setting up bsd-mailx (8.1.2-0.20141216cvs-2) ...
update-alternatives: using /usr/bin/bsd-mailx to provide /usr/bin/mailx (mailx) in auto mode
Setting up exim4 (4.84.2-2+deb8u4) ...
debconf: unable to initialize frontend: Dialog
debconf: (TERM is not set, so the dialog frontend is not usable.)
debconf: falling back to frontend: Readline
Setting up locales (2.19-18+deb8u10) ...
debconf: unable to initialize frontend: Dialog
debconf: (TERM is not set, so the dialog frontend is not usable.)
debconf: falling back to frontend: Readline
Generating locales (this might take a while)...
Generation complete.
Setting up lsb-release (4.1+Debian13+nmu1) ...
Setting up nginx-common (1.6.2-5+deb8u5) ...
debconf: unable to initialize frontend: Dialog
debconf: (TERM is not set, so the dialog frontend is not usable.)
debconf: falling back to frontend: Readline
Setting up nginx-full (1.6.2-5+deb8u5) ...
invoke-rc.d: policy-rc.d denied execution of start.
Setting up nginx (1.6.2-5+deb8u5) ...
Setting up postgresql-client-common (165+deb8u3) ...
Setting up postgresql-client-9.4 (9.4.15-0+deb8u1) ...
update-alternatives: using /usr/share/postgresql/9.4/man/man1/psql.1.gz to provide /usr/share/man/man1/psql.1.gz (psql.1.gz) in auto mode
Setting up ssl-cert (1.0.35) ...
debconf: unable to initialize frontend: Dialog
debconf: (TERM is not set, so the dialog frontend is not usable.)
debconf: falling back to frontend: Readline
Setting up postgresql-common (165+deb8u3) ...
debconf: unable to initialize frontend: Dialog
debconf: (TERM is not set, so the dialog frontend is not usable.)
debconf: falling back to frontend: Readline
Adding user postgres to group ssl-cert
Creating config file /etc/postgresql-common/createcluster.conf with new version
Creating config file /etc/logrotate.d/postgresql-common with new version
Building PostgreSQL dictionaries from installed myspell/hunspell packages...
Removing obsolete dictionary files:
invoke-rc.d: policy-rc.d denied execution of start.
Setting up postgresql-9.4 (9.4.15-0+deb8u1) ...
Creating new cluster 9.4/main ...
config /etc/postgresql/9.4/main
data /var/lib/postgresql/9.4/main
locale C
port 5432
update-alternatives: using /usr/share/postgresql/9.4/man/man1/postmaster.1.gz to provide /usr/share/man/man1/postmaster.1.gz (postmaster.1.gz) in auto mode
invoke-rc.d: policy-rc.d denied execution of start.
Setting up postgresql (9.4+165+deb8u3) ...
Setting up psmisc (22.21-2) ...
Setting up python-pkg-resources (5.5.1-1) ...
Setting up sudo (1.8.10p3-1+deb8u5) ...
Setting up python-meld3 (1.0.0-1) ...
Setting up supervisor (3.0r1-1+deb8u1) ...
invoke-rc.d: policy-rc.d denied execution of start.
Processing triggers for systemd (215-17+deb8u7) ...
Processing triggers for libc-bin (2.19-18+deb8u10) ...
---> e55b0302968d
Removing intermediate container 74d5d14d2145
Step 5/15 : RUN pip install uwsgi Django psycopg2 pytz requests
---> Running in 3f118ce794a8
Collecting uwsgi
Downloading uwsgi-2.0.15.tar.gz (795kB)
Collecting Django
Downloading Django-2.0.tar.gz (8.0MB)
Complete output from command python setup.py egg_info:
Traceback (most recent call last):
File "<string>", line 1, in <module>
File "/tmp/pip-build-5VOZ6v/Django/setup.py", line 32, in <module>
version = __import__('django').get_version()
File "django/__init__.py", line 1, in <module>
from django.utils.version import get_version
File "django/utils/version.py", line 61, in <module>
@functools.lru_cache()
AttributeError: 'module' object has no attribute 'lru_cache'
----------------------------------------
Command "python setup.py egg_info" failed with error code 1 in /tmp/pip-build-5VOZ6v/Django/
The command '/bin/sh -c pip install uwsgi Django psycopg2 pytz requests' returned a non-zero code: 1
Error: Failed to create Docker image for pulsar-dashboard
Build step 'Execute shell' marked build as failure
Not sending mail to unregistered user github@alasdairhodge.co.uk
Not sending mail to unregistered user y.shiga.91+yush1ga@gmail.com
Jenkins build is unstable: pulsar-master #218
Posted by Apache Jenkins Server <je...@builds.apache.org>.
See <https://builds.apache.org/job/pulsar-master/218/display/redirect?page=changes>
Build failed in Jenkins: pulsar-master #217
Posted by Apache Jenkins Server <je...@builds.apache.org>.
See <https://builds.apache.org/job/pulsar-master/217/display/redirect?page=changes>
Changes:
[mmerli] Add NoSuchEntryException as not-recoverable error for cursor-recovery
[rdhabalia] Revert "Enable usage of KQueue in MacOS (#1036)" (#1045)
[mmerli] RawReader allows futures to be cancelled (#1043)
[nkurihar] Fix format of Athenz auth parameters written in document (#1055)
[mmerli] fixing imports that mistakenly use jersey.packaged.* (#1057)
[mmerli] Populate message properties after building a message (#1054)
[massakam] Add subscription auth mode by prefix (#899)
[hrsakai] Added setting for anonymous user role (#820)
[massakam] Issue 1061: Consumers in failover subscription stops consuming after
------------------------------------------
[...truncated 336.26 KB...]
[36/90] DestinationNameTest.testEmptyClusterName (22 ms)
[37/90] DestinationNameTest.testExtraSlashes (21 ms)
[38/90] DestinationNameTest.testIllegalCharacters (21 ms)
[39/90] DestinationNameTest.testIllegalUrl (21 ms)
[40/90] DestinationNameTest.testEmptyString (21 ms)
[41/90] DestinationNameTest.testExtraArguments (21 ms)
[42/90] ZTSClientTest.testZTSClient (21 ms)
[43/90] LoggerTest.testLogger (26 ms)
[44/90] ClientDeduplicationTest.testProducerSequenceAfterReconnect (202 ms)
[45/90] BatchMessageTest.testBatchSizeInBytes (5094 ms)
[46/90] ConsumerStatsTest.testAsyncCallOnPartitionedTopic (6124 ms)
[47/90] BasicEndToEndTest.testProduceConsume (83 ms)
[48/90] BasicEndToEndTest.testLookupThrottling (30 ms)
[49/90] BasicEndToEndTest.testNonExistingTopic (28 ms)
[50/90] BasicEndToEndTest.testNonPersistentTopic (27 ms)
[51/90] BasicEndToEndTest.testSingleClientMultipleSubscriptions (68 ms)
[52/90] ClientDeduplicationTest.testProducerDeduplication (2125 ms)
[53/90] BasicEndToEndTest.testProduceAndConsumeAfterClientClose (102 ms)
[54/90] BasicEndToEndTest.testIamSoFancyCharactersInTopicName (48 ms)
[55/90] BasicEndToEndTest.testSubscribeCloseUnsubscribeSherpaScenario (61 ms)
[56/90] BasicEndToEndTest.testInvalidUrlPassed (25 ms)
[57/90] BasicEndToEndTest.testMultipleClientsMultipleSubscriptions (2067 ms)
[58/90] BasicEndToEndTest.testPartitionedProducerConsumer (1112 ms)
[59/90] BasicEndToEndTest.testMessageTooBig (85 ms)
[60/90] BasicEndToEndTest.testCompressionLZ4 (78 ms)
[61/90] BasicEndToEndTest.testCompressionZLib (65 ms)
[62/90] BasicEndToEndTest.testConfigurationFile (27 ms)
[63/90] BasicEndToEndTest.testPartitionedProducerConsumerSubscriptionName (1062 ms)
[64/90] BasicEndToEndTest.testNamespaceName (27 ms)
[65/90] BasicEndToEndTest.testConsumerClose (51 ms)
[66/90] BasicEndToEndTest.testSinglePartitionRoutingPolicy (1115 ms)
[67/90] BasicEndToEndTest.testBatchMessages (5310 ms)
[68/90] BasicEndToEndTest.testRoundRobinRoutingPolicy (1147 ms)
[69/90] BasicEndToEndTest.testDuplicateConsumerCreationOnPartitionedTopic (3079 ms)
[70/90] BasicEndToEndTest.testResendViaSendCallback (3539 ms)
[71/90] BatchMessageTest.testCumulativeAck (15112 ms)
[72/90] BasicEndToEndTest.testProduceMessageSize (75 ms)
[73/90] BatchMessageTest.testMixedAck (15086 ms)
[74/90] AuthPluginTest.testCreate (23 ms)
[75/90] BasicEndToEndTest.testMessageListener (6120 ms)
[76/90] AuthPluginTest.testAthenz (36 ms)
[77/90] AuthPluginTest.testDisable (25 ms)
[78/90] MessageIdTest.testSerialization (27 ms)
[79/90] ClientTest.testChecksumComputation (24 ms)
[80/90] ClientTest.testSwHwChecksum (24 ms)
[81/90] ProducerTest.producerNotInitialized (24 ms)
[82/90] BatchMessageTest.testSmallReceiverQueueSize (20259 ms)
[83/90] BatchMessageTest.testProducerTimeout (21135 ms)
[84/90] AuthPluginTest.testTls (5928 ms)
[85/90] BatchMessageTest.testPermits (20115 ms)
[86/90] BatchMessageTest.testIndividualAck (25120 ms)
[87/90] BasicEndToEndTest.testStatsLatencies (11095 ms)
[88/90] BatchMessageTest.testPartitionedTopics (33660 ms)
[89/90] BasicEndToEndTest.testMessageListenerPause (59308 ms)
[90/90] BasicEndToEndTest.testHandlerReconnectionLogic (63591 ms)
---- Running Python unit tests
.03:32:00.522 [0x7f0f26dfe700] INFO /pulsar/pulsar-client-cpp/lib/ConnectionPool.cc(64) - Created connection for pulsar://localhost:8885
03:32:00.523 [0x7f0f1bb6f700] INFO /pulsar/pulsar-client-cpp/lib/ClientConnection.cc(267) - [127.0.0.1:51071 -> 127.0.0.1:8885] Connected to broker
03:32:00.526 [0x7f0f1bb6f700] INFO /pulsar/pulsar-client-cpp/lib/HandlerBase.cc(58) - [persistent://sample/standalone/ns/my-python-topic-listener, my-sub, 0] Getting connection from pool
03:32:00.562 [0x7f0f1bb6f700] INFO /pulsar/pulsar-client-cpp/lib/ConsumerImpl.cc(172) - [persistent://sample/standalone/ns/my-python-topic-listener, my-sub, 0] Created consumer on broker [127.0.0.1:51071 -> 127.0.0.1:8885]
03:32:00.564 [0x7f0f1bb6f700] INFO /pulsar/pulsar-client-cpp/lib/HandlerBase.cc(58) - [persistent://sample/standalone/ns/my-python-topic-listener, ] Getting connection from pool
03:32:00.568 [0x7f0f1bb6f700] INFO /pulsar/pulsar-client-cpp/lib/ProducerImpl.cc(139) - [persistent://sample/standalone/ns/my-python-topic-listener, ] Created producer on broker [127.0.0.1:51071 -> 127.0.0.1:8885]
Got message: Message(prod=standalone-0-66, seq=0, publish_time=1516159920568, payload_size=7, msg_id=(147,0,-1), props={})
Got message: Message(prod=standalone-0-66, seq=1, publish_time=1516159920581, payload_size=7, msg_id=(147,1,-1), props={})
Got message: Message(prod=standalone-0-66, seq=2, publish_time=1516159920583, payload_size=7, msg_id=(147,2,-1), props={})
03:32:00.685 [0x7f0f1bb6f700] INFO /pulsar/pulsar-client-cpp/lib/ProducerImpl.cc(444) - [persistent://sample/standalone/ns/my-python-topic-listener, standalone-0-66] Closed producer
03:32:00.686 [0x7f0f1bb6f700] INFO /pulsar/pulsar-client-cpp/lib/ConsumerImpl.cc(724) - [persistent://sample/standalone/ns/my-python-topic-listener, my-sub, 0] Closed consumer 0
..03:32:00.687 [0x7f0f26dfe700] INFO /pulsar/pulsar-client-cpp/lib/ConnectionPool.cc(64) - Created connection for pulsar://localhost:8885
03:32:00.687 [0x7f0f1a95b700] INFO /pulsar/pulsar-client-cpp/lib/ClientConnection.cc(267) - [127.0.0.1:51072 -> 127.0.0.1:8885] Connected to broker
03:32:00.689 [0x7f0f1a95b700] INFO /pulsar/pulsar-client-cpp/lib/HandlerBase.cc(58) - [persistent://sample/standalone/ns/my-python-topic-producer-consumer, my-sub, 0] Getting connection from pool
03:32:00.721 [0x7f0f1a95b700] INFO /pulsar/pulsar-client-cpp/lib/ConsumerImpl.cc(172) - [persistent://sample/standalone/ns/my-python-topic-producer-consumer, my-sub, 0] Created consumer on broker [127.0.0.1:51072 -> 127.0.0.1:8885]
03:32:00.725 [0x7f0f1a95b700] INFO /pulsar/pulsar-client-cpp/lib/HandlerBase.cc(58) - [persistent://sample/standalone/ns/my-python-topic-producer-consumer, ] Getting connection from pool
03:32:00.727 [0x7f0f1a95b700] INFO /pulsar/pulsar-client-cpp/lib/ProducerImpl.cc(139) - [persistent://sample/standalone/ns/my-python-topic-producer-consumer, ] Created producer on broker [127.0.0.1:51072 -> 127.0.0.1:8885]
03:32:00.835 [0x7f0f1a95b700] INFO /pulsar/pulsar-client-cpp/lib/ProducerImpl.cc(444) - [persistent://sample/standalone/ns/my-python-topic-producer-consumer, standalone-0-67] Closed producer
03:32:00.836 [0x7f0f1a95b700] INFO /pulsar/pulsar-client-cpp/lib/ConsumerImpl.cc(724) - [persistent://sample/standalone/ns/my-python-topic-producer-consumer, my-sub, 0] Closed consumer 0
.03:32:00.850 [0x7f0f26dfe700] INFO /pulsar/pulsar-client-cpp/lib/ConnectionPool.cc(64) - Created connection for pulsar://localhost:8885
03:32:00.850 [0x7f0f19959700] INFO /pulsar/pulsar-client-cpp/lib/ClientConnection.cc(267) - [127.0.0.1:51074 -> 127.0.0.1:8885] Connected to broker
03:32:00.853 [0x7f0f19959700] INFO /pulsar/pulsar-client-cpp/lib/HandlerBase.cc(58) - [persistent://sample/standalone/ns1/my-python-test-producer-deduplication-1516159920.85, my-producer-name] Getting connection from pool
03:32:00.874 [0x7f0f19959700] INFO /pulsar/pulsar-client-cpp/lib/ProducerImpl.cc(139) - [persistent://sample/standalone/ns1/my-python-test-producer-deduplication-1516159920.85, my-producer-name] Created producer on broker [127.0.0.1:51074 -> 127.0.0.1:8885]
03:32:00.876 [0x7f0f19959700] INFO /pulsar/pulsar-client-cpp/lib/HandlerBase.cc(58) - [persistent://sample/standalone/ns1/my-python-test-producer-deduplication-1516159920.85, my-sub, 0] Getting connection from pool
03:32:00.885 [0x7f0f19959700] INFO /pulsar/pulsar-client-cpp/lib/ConsumerImpl.cc(172) - [persistent://sample/standalone/ns1/my-python-test-producer-deduplication-1516159920.85, my-sub, 0] Created consumer on broker [127.0.0.1:51074 -> 127.0.0.1:8885]
03:32:01.899 [0x7f0f19959700] INFO /pulsar/pulsar-client-cpp/lib/ProducerImpl.cc(444) - [persistent://sample/standalone/ns1/my-python-test-producer-deduplication-1516159920.85, my-producer-name] Closed producer
03:32:01.900 [0x7f0f19959700] INFO /pulsar/pulsar-client-cpp/lib/HandlerBase.cc(58) - [persistent://sample/standalone/ns1/my-python-test-producer-deduplication-1516159920.85, my-producer-name] Getting connection from pool
03:32:01.903 [0x7f0f19959700] INFO /pulsar/pulsar-client-cpp/lib/ProducerImpl.cc(139) - [persistent://sample/standalone/ns1/my-python-test-producer-deduplication-1516159920.85, my-producer-name] Created producer on broker [127.0.0.1:51074 -> 127.0.0.1:8885]
.03:32:02.905 [0x7f0f26dfe700] INFO /pulsar/pulsar-client-cpp/lib/ConnectionPool.cc(64) - Created connection for pulsar://localhost:8885
03:32:02.906 [0x7f0f03fff700] INFO /pulsar/pulsar-client-cpp/lib/ClientConnection.cc(267) - [127.0.0.1:51075 -> 127.0.0.1:8885] Connected to broker
03:32:02.911 [0x7f0f03fff700] INFO /pulsar/pulsar-client-cpp/lib/HandlerBase.cc(58) - [persistent://sample/standalone/ns/my-python-topic, ] Getting connection from pool
03:32:02.919 [0x7f0f03fff700] INFO /pulsar/pulsar-client-cpp/lib/ProducerImpl.cc(139) - [persistent://sample/standalone/ns/my-python-topic, ] Created producer on broker [127.0.0.1:51075 -> 127.0.0.1:8885]
03:32:03.020 [0x7f0f03fff700] INFO /pulsar/pulsar-client-cpp/lib/ProducerImpl.cc(444) - [persistent://sample/standalone/ns/my-python-topic, standalone-0-68] Closed producer
.03:32:03.031 [0x7f0f26dfe700] INFO /pulsar/pulsar-client-cpp/lib/ConnectionPool.cc(64) - Created connection for pulsar://localhost:8885
03:32:03.033 [0x7f0f037fe700] INFO /pulsar/pulsar-client-cpp/lib/ClientConnection.cc(267) - [127.0.0.1:51077 -> 127.0.0.1:8885] Connected to broker
03:32:03.036 [0x7f0f037fe700] INFO /pulsar/pulsar-client-cpp/lib/HandlerBase.cc(58) - [persistent://sample/standalone/ns1/my-python-test-producer-sequence-after-reconnection-1516159923.03, my-producer-name] Getting connection from pool
03:32:03.054 [0x7f0f037fe700] INFO /pulsar/pulsar-client-cpp/lib/ProducerImpl.cc(139) - [persistent://sample/standalone/ns1/my-python-test-producer-sequence-after-reconnection-1516159923.03, my-producer-name] Created producer on broker [127.0.0.1:51077 -> 127.0.0.1:8885]
03:32:03.080 [0x7f0f037fe700] INFO /pulsar/pulsar-client-cpp/lib/ProducerImpl.cc(444) - [persistent://sample/standalone/ns1/my-python-test-producer-sequence-after-reconnection-1516159923.03, my-producer-name] Closed producer
03:32:03.082 [0x7f0f037fe700] INFO /pulsar/pulsar-client-cpp/lib/HandlerBase.cc(58) - [persistent://sample/standalone/ns1/my-python-test-producer-sequence-after-reconnection-1516159923.03, my-producer-name] Getting connection from pool
03:32:03.084 [0x7f0f037fe700] INFO /pulsar/pulsar-client-cpp/lib/ProducerImpl.cc(139) - [persistent://sample/standalone/ns1/my-python-test-producer-sequence-after-reconnection-1516159923.03, my-producer-name] Created producer on broker [127.0.0.1:51077 -> 127.0.0.1:8885]
.03:32:03.104 [0x7f0f26dfe700] INFO /pulsar/pulsar-client-cpp/lib/ConnectionPool.cc(64) - Created connection for pulsar://localhost:8885
03:32:03.105 [0x7f0f037fe700] INFO /pulsar/pulsar-client-cpp/lib/ClientConnection.cc(267) - [127.0.0.1:51078 -> 127.0.0.1:8885] Connected to broker
03:32:03.107 [0x7f0f037fe700] INFO /pulsar/pulsar-client-cpp/lib/HandlerBase.cc(58) - [persistent://sample/standalone/ns/my-python-topic-reader-on-last-message, ] Getting connection from pool
03:32:03.124 [0x7f0f037fe700] INFO /pulsar/pulsar-client-cpp/lib/ProducerImpl.cc(139) - [persistent://sample/standalone/ns/my-python-topic-reader-on-last-message, ] Created producer on broker [127.0.0.1:51078 -> 127.0.0.1:8885]
03:32:03.144 [0x7f0f037fe700] INFO /pulsar/pulsar-client-cpp/lib/HandlerBase.cc(58) - [persistent://sample/standalone/ns/my-python-topic-reader-on-last-message, reader-82a4cb, 0] Getting connection from pool
03:32:03.146 [0x7f0f037fe700] INFO /pulsar/pulsar-client-cpp/lib/ConsumerImpl.cc(172) - [persistent://sample/standalone/ns/my-python-topic-reader-on-last-message, reader-82a4cb, 0] Created consumer on broker [127.0.0.1:51078 -> 127.0.0.1:8885]
03:32:03.173 [0x7f0f037fe700] INFO /pulsar/pulsar-client-cpp/lib/ConsumerImpl.cc(724) - [persistent://sample/standalone/ns/my-python-topic-reader-on-last-message, reader-82a4cb, 0] Closed consumer 0
03:32:03.173 [0x7f0f037fe700] INFO /pulsar/pulsar-client-cpp/lib/ProducerImpl.cc(444) - [persistent://sample/standalone/ns/my-python-topic-reader-on-last-message, standalone-0-69] Closed producer
.03:32:03.174 [0x7f0f26dfe700] INFO /pulsar/pulsar-client-cpp/lib/ConnectionPool.cc(64) - Created connection for pulsar://localhost:8885
03:32:03.175 [0x7f0f01ffb700] INFO /pulsar/pulsar-client-cpp/lib/ClientConnection.cc(267) - [127.0.0.1:51079 -> 127.0.0.1:8885] Connected to broker
03:32:03.179 [0x7f0f01ffb700] INFO /pulsar/pulsar-client-cpp/lib/HandlerBase.cc(58) - [persistent://sample/standalone/ns/my-python-topic-reader-on-specific-message, ] Getting connection from pool
03:32:03.189 [0x7f0f01ffb700] INFO /pulsar/pulsar-client-cpp/lib/ProducerImpl.cc(139) - [persistent://sample/standalone/ns/my-python-topic-reader-on-specific-message, ] Created producer on broker [127.0.0.1:51079 -> 127.0.0.1:8885]
03:32:03.209 [0x7f0f01ffb700] INFO /pulsar/pulsar-client-cpp/lib/HandlerBase.cc(58) - [persistent://sample/standalone/ns/my-python-topic-reader-on-specific-message, reader-3f92e2, 0] Getting connection from pool
03:32:03.211 [0x7f0f01ffb700] INFO /pulsar/pulsar-client-cpp/lib/ConsumerImpl.cc(172) - [persistent://sample/standalone/ns/my-python-topic-reader-on-specific-message, reader-3f92e2, 0] Created consumer on broker [127.0.0.1:51079 -> 127.0.0.1:8885]
03:32:03.213 [0x7f0f01ffb700] INFO /pulsar/pulsar-client-cpp/lib/HandlerBase.cc(58) - [persistent://sample/standalone/ns/my-python-topic-reader-on-specific-message, reader-3b1afe, 1] Getting connection from pool
03:32:03.215 [0x7f0f01ffb700] INFO /pulsar/pulsar-client-cpp/lib/ConsumerImpl.cc(172) - [persistent://sample/standalone/ns/my-python-topic-reader-on-specific-message, reader-3b1afe, 1] Created consumer on broker [127.0.0.1:51079 -> 127.0.0.1:8885]
03:32:03.217 [0x7f0f01ffb700] INFO /pulsar/pulsar-client-cpp/lib/ConsumerImpl.cc(724) - [persistent://sample/standalone/ns/my-python-topic-reader-on-specific-message, reader-3f92e2, 0] Closed consumer 0
03:32:03.218 [0x7f0f01ffb700] INFO /pulsar/pulsar-client-cpp/lib/ConsumerImpl.cc(724) - [persistent://sample/standalone/ns/my-python-topic-reader-on-specific-message, reader-3b1afe, 1] Closed consumer 1
03:32:03.218 [0x7f0f01ffb700] INFO /pulsar/pulsar-client-cpp/lib/ProducerImpl.cc(444) - [persistent://sample/standalone/ns/my-python-topic-reader-on-specific-message, standalone-0-70] Closed producer
.03:32:03.219 [0x7f0f26dfe700] INFO /pulsar/pulsar-client-cpp/lib/ConnectionPool.cc(64) - Created connection for pulsar://localhost:8885
03:32:03.219 [0x7f0f00ff9700] INFO /pulsar/pulsar-client-cpp/lib/ClientConnection.cc(267) - [127.0.0.1:51080 -> 127.0.0.1:8885] Connected to broker
03:32:03.221 [0x7f0f00ff9700] INFO /pulsar/pulsar-client-cpp/lib/BatchMessageContainer.cc(41) - { BatchContainer [size = 0] [batchSizeInBytes_ = 0] [maxAllowedMessageBatchSizeInBytes_ = 131072] [maxAllowedNumMessagesInBatch_ = 1000] [topicName = persistent://sample/standalone/ns/my-python-topic-reader-on-specific-message-with-batches] [producerName_ = ] [batchSizeInBytes_ = 0] [numberOfBatchesSent = 0] [averageBatchSize = 0]} BatchMessageContainer constructed
03:32:03.221 [0x7f0f00ff9700] INFO /pulsar/pulsar-client-cpp/lib/HandlerBase.cc(58) - [persistent://sample/standalone/ns/my-python-topic-reader-on-specific-message-with-batches, ] Getting connection from pool
03:32:03.236 [0x7f0f00ff9700] INFO /pulsar/pulsar-client-cpp/lib/ProducerImpl.cc(139) - [persistent://sample/standalone/ns/my-python-topic-reader-on-specific-message-with-batches, ] Created producer on broker [127.0.0.1:51080 -> 127.0.0.1:8885]
03:32:04.241 [0x7f0f00ff9700] INFO /pulsar/pulsar-client-cpp/lib/HandlerBase.cc(58) - [persistent://sample/standalone/ns/my-python-topic-reader-on-specific-message-with-batches, reader-4efc2c, 0] Getting connection from pool
03:32:04.243 [0x7f0f00ff9700] INFO /pulsar/pulsar-client-cpp/lib/ConsumerImpl.cc(172) - [persistent://sample/standalone/ns/my-python-topic-reader-on-specific-message-with-batches, reader-4efc2c, 0] Created consumer on broker [127.0.0.1:51080 -> 127.0.0.1:8885]
03:32:04.245 [0x7f0f00ff9700] INFO /pulsar/pulsar-client-cpp/lib/HandlerBase.cc(58) - [persistent://sample/standalone/ns/my-python-topic-reader-on-specific-message-with-batches, reader-89a152, 1] Getting connection from pool
03:32:04.246 [0x7f0f00ff9700] INFO /pulsar/pulsar-client-cpp/lib/ConsumerImpl.cc(172) - [persistent://sample/standalone/ns/my-python-topic-reader-on-specific-message-with-batches, reader-89a152, 1] Created consumer on broker [127.0.0.1:51080 -> 127.0.0.1:8885]
03:32:04.247 [0x7f0f00ff9700] INFO /pulsar/pulsar-client-cpp/lib/ConsumerImpl.cc(724) - [persistent://sample/standalone/ns/my-python-topic-reader-on-specific-message-with-batches, reader-4efc2c, 0] Closed consumer 0
03:32:04.247 [0x7f0f00ff9700] INFO /pulsar/pulsar-client-cpp/lib/ConsumerImpl.cc(724) - [persistent://sample/standalone/ns/my-python-topic-reader-on-specific-message-with-batches, reader-89a152, 1] Closed consumer 1
03:32:04.248 [0x7f0f00ff9700] INFO /pulsar/pulsar-client-cpp/lib/ProducerImpl.cc(444) - [persistent://sample/standalone/ns/my-python-topic-reader-on-specific-message-with-batches, standalone-0-71] Closed producer
.03:32:04.248 [0x7f0f26dfe700] INFO /pulsar/pulsar-client-cpp/lib/ConnectionPool.cc(64) - Created connection for pulsar://localhost:8885
03:32:04.249 [0x7f0efaffd700] INFO /pulsar/pulsar-client-cpp/lib/ClientConnection.cc(267) - [127.0.0.1:51085 -> 127.0.0.1:8885] Connected to broker
03:32:04.250 [0x7f0efaffd700] INFO /pulsar/pulsar-client-cpp/lib/HandlerBase.cc(58) - [persistent://sample/standalone/ns/my-python-topic-reader-simple, reader-8e81af, 0] Getting connection from pool
03:32:04.260 [0x7f0efaffd700] INFO /pulsar/pulsar-client-cpp/lib/ConsumerImpl.cc(172) - [persistent://sample/standalone/ns/my-python-topic-reader-simple, reader-8e81af, 0] Created consumer on broker [127.0.0.1:51085 -> 127.0.0.1:8885]
03:32:04.265 [0x7f0efaffd700] INFO /pulsar/pulsar-client-cpp/lib/HandlerBase.cc(58) - [persistent://sample/standalone/ns/my-python-topic-reader-simple, ] Getting connection from pool
03:32:04.267 [0x7f0efaffd700] INFO /pulsar/pulsar-client-cpp/lib/ProducerImpl.cc(139) - [persistent://sample/standalone/ns/my-python-topic-reader-simple, ] Created producer on broker [127.0.0.1:51085 -> 127.0.0.1:8885]
03:32:04.373 [0x7f0efaffd700] INFO /pulsar/pulsar-client-cpp/lib/ConsumerImpl.cc(724) - [persistent://sample/standalone/ns/my-python-topic-reader-simple, reader-8e81af, 0] Closed consumer 0
03:32:04.373 [0x7f0efaffd700] INFO /pulsar/pulsar-client-cpp/lib/ProducerImpl.cc(444) - [persistent://sample/standalone/ns/my-python-topic-reader-simple, standalone-0-72] Closed producer
.03:32:04.374 [0x7f0f26dfe700] INFO /pulsar/pulsar-client-cpp/lib/ConnectionPool.cc(64) - Created connection for pulsar://localhost:8885
03:32:04.374 [0x7f0ef9ffb700] INFO /pulsar/pulsar-client-cpp/lib/ClientConnection.cc(267) - [127.0.0.1:51086 -> 127.0.0.1:8885] Connected to broker
03:32:04.377 [0x7f0ef9ffb700] INFO /pulsar/pulsar-client-cpp/lib/HandlerBase.cc(58) - [persistent://sample/standalone/ns/my-python-topic, ] Getting connection from pool
03:32:04.380 [0x7f0ef9ffb700] INFO /pulsar/pulsar-client-cpp/lib/ProducerImpl.cc(139) - [persistent://sample/standalone/ns/my-python-topic, ] Created producer on broker [127.0.0.1:51086 -> 127.0.0.1:8885]
03:32:04.383 [0x7f0ef9ffb700] INFO /pulsar/pulsar-client-cpp/lib/ProducerImpl.cc(444) - [persistent://sample/standalone/ns/my-python-topic, standalone-0-73] Closed producer
.
----------------------------------------------------------------------
Ran 12 tests in 3.863s
OK
03:32:04.387 [0x7f0f26dfe700] WARN /pulsar/pulsar-client-cpp/lib/ConsumerImpl.cc(89) - [persistent://sample/standalone/ns1/my-python-test-producer-deduplication-1516159920.85, my-sub, 0] Destroyed consumer which was not properly closed
[pulsar-master] $ /bin/bash -xe /tmp/jenkins2855905435125822955.sh
+ echo 'Building Docker images'
Building Docker images
+ docker/build.sh
Pulsar version: 1.22.0-incubating-SNAPSHOT
Using Pulsar binary package at <https://builds.apache.org/job/pulsar-master/ws/all/target/apache-pulsar-1.22.0-incubating-SNAPSHOT-bin.tar.gz>
Sending build context to Docker daemon 49.26MB
Step 1/11 : FROM openjdk:8-jdk
---> 7c57090325cc
Step 2/11 : RUN apt-get update && apt-get install -y netcat dnsutils
---> Using cache
---> 22852f0da085
Step 3/11 : ARG VERSION
---> Using cache
---> 2d6aed7b8914
Step 4/11 : ADD apache-pulsar-${VERSION}-bin.tar.gz /
---> ebb1f50782bb
Removing intermediate container 44189afc1d22
Step 5/11 : RUN mv /apache-pulsar-${VERSION} /pulsar
---> Running in 57d2bf18ace4
---> 8a802f8b9d43
Removing intermediate container 57d2bf18ace4
Step 6/11 : COPY scripts/apply-config-from-env.py /pulsar/bin
---> fd6ab49f976e
Removing intermediate container 6c8099c30a85
Step 7/11 : COPY scripts/generate-zookeeper-config.sh /pulsar/bin
---> 966661cccf19
Removing intermediate container d52d3c5c7558
Step 8/11 : COPY scripts/pulsar-zookeeper-ruok.sh /pulsar/bin
---> 1a89c6d4c72e
Removing intermediate container 1c6a690f922e
Step 9/11 : WORKDIR /pulsar
---> 4c8635a2b6a7
Removing intermediate container 47a2bbb76da4
Step 10/11 : VOLUME /pulsar/conf /pulsar/data
---> Running in f20282cf14a5
---> 0f7c4bebc22a
Removing intermediate container f20282cf14a5
Step 11/11 : ENV PULSAR_ROOT_LOGGER INFO,CONSOLE
---> Running in a70deb2d7a35
---> 0dc791e275dc
Removing intermediate container a70deb2d7a35
Successfully built 0dc791e275dc
Successfully tagged pulsar:latest
Sending build context to Docker daemon 206.3kB
Step 1/7 : FROM grafana/grafana:4.3.1
---> 2cdb407c0fa4
Step 2/7 : COPY grafana.ini /etc/grafana/grafana.ini
---> Using cache
---> e4c67b2b13fc
Step 3/7 : COPY dashboards/* /var/lib/grafana/dashboards/
---> Using cache
---> 94643c785835
Step 4/7 : COPY start.sh /start.sh
---> Using cache
---> 419077f5c536
Step 5/7 : EXPOSE 3000
---> Using cache
---> 7b64b83f7181
Step 6/7 : ENV PROMETHEUS_URL http://prometheus:9090
---> Using cache
---> 8f1305a4b09d
Step 7/7 : ENTRYPOINT /start.sh
---> Using cache
---> 3ddf2beebbf1
Successfully built 3ddf2beebbf1
Successfully tagged pulsar-grafana:latest
Sending build context to Docker daemon 137.2kB
Step 1/15 : FROM python:2.7
---> 9e92c8430ba0
Step 2/15 : MAINTAINER Pulsar
---> Using cache
---> f6c598815f79
Step 3/15 : RUN apt-get update
---> Using cache
---> 2aad68c293df
Step 4/15 : RUN apt-get -y install postgresql python sudo nginx supervisor
---> Using cache
---> bbf44cc0dd51
Step 5/15 : RUN pip install uwsgi Django psycopg2 pytz requests
---> Running in d97b29d7b955
Collecting uwsgi
Downloading uwsgi-2.0.15.tar.gz (795kB)
Collecting Django
Downloading Django-2.0.tar.gz (8.0MB)
Complete output from command python setup.py egg_info:
Traceback (most recent call last):
File "<string>", line 1, in <module>
File "/tmp/pip-build-vsYydS/Django/setup.py", line 32, in <module>
version = __import__('django').get_version()
File "django/__init__.py", line 1, in <module>
from django.utils.version import get_version
File "django/utils/version.py", line 61, in <module>
@functools.lru_cache()
AttributeError: 'module' object has no attribute 'lru_cache'
----------------------------------------
Command "python setup.py egg_info" failed with error code 1 in /tmp/pip-build-vsYydS/Django/
The command '/bin/sh -c pip install uwsgi Django psycopg2 pytz requests' returned a non-zero code: 1
Error: Failed to create Docker image for pulsar-dashboard
Build step 'Execute shell' marked build as failure
Not sending mail to unregistered user github@alasdairhodge.co.uk
Not sending mail to unregistered user y.shiga.91+yush1ga@gmail.com
Build failed in Jenkins: pulsar-master #216
Posted by Apache Jenkins Server <je...@builds.apache.org>.
See <https://builds.apache.org/job/pulsar-master/216/display/redirect?page=changes>
Changes:
[rdhabalia] Issue 1024: Message Router should take `numPartitions` as parameter in
------------------------------------------
[...truncated 373.23 KB...]
Step 4/15 : RUN apt-get -y install postgresql python sudo nginx supervisor
---> Running in 8c61389a7cb1
Reading package lists...
Building dependency tree...
Reading state information...
python is already the newest version.
python set to manually installed.
The following extra packages will be installed:
bsd-mailx cron exim4 exim4-base exim4-config exim4-daemon-light
init-system-helpers liblockfile-bin liblockfile1 libpopt0 locales logrotate
lsb-release nginx-common nginx-full postgresql-9.4 postgresql-client-9.4
postgresql-client-common postgresql-common psmisc python-meld3
python-pkg-resources ssl-cert
Suggested packages:
anacron checksecurity mail-reader eximon4 exim4-doc-html exim4-doc-info
spf-tools-perl swaks lsb fcgiwrap nginx-doc postgresql-doc oidentd
ident-server locales-all postgresql-doc-9.4 python-distribute
python-distribute-doc openssl-blacklist
Recommended packages:
mailx
The following NEW packages will be installed:
bsd-mailx cron exim4 exim4-base exim4-config exim4-daemon-light
init-system-helpers liblockfile-bin liblockfile1 libpopt0 locales logrotate
lsb-release nginx nginx-common nginx-full postgresql postgresql-9.4
postgresql-client-9.4 postgresql-client-common postgresql-common psmisc
python-meld3 python-pkg-resources ssl-cert sudo supervisor
0 upgraded, 27 newly installed, 0 to remove and 8 not upgraded.
Need to get 13.5 MB of archives.
After this operation, 52.1 MB of additional disk space will be used.
Get:1 http://deb.debian.org/debian/ jessie/main init-system-helpers all 1.22 [14.0 kB]
Get:2 http://deb.debian.org/debian/ jessie/main cron amd64 3.0pl1-127+deb8u1 [94.0 kB]
Get:3 http://deb.debian.org/debian/ jessie/main libpopt0 amd64 1.16-10 [49.2 kB]
Get:4 http://deb.debian.org/debian/ jessie/main liblockfile-bin amd64 1.09-6 [18.9 kB]
Get:5 http://deb.debian.org/debian/ jessie/main liblockfile1 amd64 1.09-6 [15.8 kB]
Get:6 http://deb.debian.org/debian/ jessie/main logrotate amd64 3.8.7-1+b1 [52.2 kB]
Get:7 http://deb.debian.org/debian/ jessie/main exim4-config all 4.84.2-2+deb8u4 [502 kB]
Get:8 http://deb.debian.org/debian/ jessie/main exim4-base amd64 4.84.2-2+deb8u4 [1049 kB]
Get:9 http://deb.debian.org/debian/ jessie/main exim4-daemon-light amd64 4.84.2-2+deb8u4 [632 kB]
Get:10 http://deb.debian.org/debian/ jessie/main bsd-mailx amd64 8.1.2-0.20141216cvs-2 [81.7 kB]
Get:11 http://deb.debian.org/debian/ jessie/main exim4 all 4.84.2-2+deb8u4 [8584 B]
Get:12 http://deb.debian.org/debian/ jessie/main locales all 2.19-18+deb8u10 [3930 kB]
Get:13 http://deb.debian.org/debian/ jessie/main lsb-release all 4.1+Debian13+nmu1 [26.5 kB]
Get:14 http://deb.debian.org/debian/ jessie/main nginx-common all 1.6.2-5+deb8u5 [88.0 kB]
Get:15 http://deb.debian.org/debian/ jessie/main nginx-full amd64 1.6.2-5+deb8u5 [430 kB]
Get:16 http://deb.debian.org/debian/ jessie/main nginx all 1.6.2-5+deb8u5 [72.6 kB]
Get:17 http://deb.debian.org/debian/ jessie/main postgresql-client-common all 165+deb8u3 [73.8 kB]
Get:18 http://deb.debian.org/debian/ jessie/main postgresql-client-9.4 amd64 9.4.15-0+deb8u1 [1086 kB]
Get:19 http://deb.debian.org/debian/ jessie/main ssl-cert all 1.0.35 [20.9 kB]
Get:20 http://deb.debian.org/debian/ jessie/main postgresql-common all 165+deb8u3 [203 kB]
Get:21 http://deb.debian.org/debian/ jessie/main postgresql-9.4 amd64 9.4.15-0+deb8u1 [3704 kB]
Get:22 http://deb.debian.org/debian/ jessie/main postgresql all 9.4+165+deb8u3 [52.4 kB]
Get:23 http://deb.debian.org/debian/ jessie/main psmisc amd64 22.21-2 [119 kB]
Get:24 http://deb.debian.org/debian/ jessie/main python-pkg-resources all 5.5.1-1 [64.4 kB]
Get:25 http://deb.debian.org/debian/ jessie/main sudo amd64 1.8.10p3-1+deb8u5 [854 kB]
Get:26 http://deb.debian.org/debian/ jessie/main python-meld3 amd64 1.0.0-1 [37.0 kB]
Get:27 http://deb.debian.org/debian/ jessie/main supervisor all 3.0r1-1+deb8u1 [267 kB]
debconf: delaying package configuration, since apt-utils is not installed
Fetched 13.5 MB in 4s (3336 kB/s)
Selecting previously unselected package init-system-helpers.
(Reading database ... (Reading database ... 5%(Reading database ... 10%(Reading database ... 15%(Reading database ... 20%(Reading database ... 25%(Reading database ... 30%(Reading database ... 35%(Reading database ... 40%(Reading database ... 45%(Reading database ... 50%(Reading database ... 55%(Reading database ... 60%(Reading database ... 65%(Reading database ... 70%(Reading database ... 75%(Reading database ... 80%(Reading database ... 85%(Reading database ... 90%(Reading database ... 95%(Reading database ... 100%(Reading database ... 21636 files and directories currently installed.)
Preparing to unpack .../init-system-helpers_1.22_all.deb ...
Unpacking init-system-helpers (1.22) ...
Selecting previously unselected package cron.
Preparing to unpack .../cron_3.0pl1-127+deb8u1_amd64.deb ...
Unpacking cron (3.0pl1-127+deb8u1) ...
Selecting previously unselected package libpopt0:amd64.
Preparing to unpack .../libpopt0_1.16-10_amd64.deb ...
Unpacking libpopt0:amd64 (1.16-10) ...
Selecting previously unselected package liblockfile-bin.
Preparing to unpack .../liblockfile-bin_1.09-6_amd64.deb ...
Unpacking liblockfile-bin (1.09-6) ...
Selecting previously unselected package liblockfile1:amd64.
Preparing to unpack .../liblockfile1_1.09-6_amd64.deb ...
Unpacking liblockfile1:amd64 (1.09-6) ...
Selecting previously unselected package logrotate.
Preparing to unpack .../logrotate_3.8.7-1+b1_amd64.deb ...
Unpacking logrotate (3.8.7-1+b1) ...
Selecting previously unselected package exim4-config.
Preparing to unpack .../exim4-config_4.84.2-2+deb8u4_all.deb ...
Unpacking exim4-config (4.84.2-2+deb8u4) ...
Selecting previously unselected package exim4-base.
Preparing to unpack .../exim4-base_4.84.2-2+deb8u4_amd64.deb ...
Unpacking exim4-base (4.84.2-2+deb8u4) ...
Selecting previously unselected package exim4-daemon-light.
Preparing to unpack .../exim4-daemon-light_4.84.2-2+deb8u4_amd64.deb ...
Unpacking exim4-daemon-light (4.84.2-2+deb8u4) ...
Selecting previously unselected package bsd-mailx.
Preparing to unpack .../bsd-mailx_8.1.2-0.20141216cvs-2_amd64.deb ...
Unpacking bsd-mailx (8.1.2-0.20141216cvs-2) ...
Selecting previously unselected package exim4.
Preparing to unpack .../exim4_4.84.2-2+deb8u4_all.deb ...
Unpacking exim4 (4.84.2-2+deb8u4) ...
Selecting previously unselected package locales.
Preparing to unpack .../locales_2.19-18+deb8u10_all.deb ...
Unpacking locales (2.19-18+deb8u10) ...
Selecting previously unselected package lsb-release.
Preparing to unpack .../lsb-release_4.1+Debian13+nmu1_all.deb ...
Unpacking lsb-release (4.1+Debian13+nmu1) ...
Selecting previously unselected package nginx-common.
Preparing to unpack .../nginx-common_1.6.2-5+deb8u5_all.deb ...
Unpacking nginx-common (1.6.2-5+deb8u5) ...
Selecting previously unselected package nginx-full.
Preparing to unpack .../nginx-full_1.6.2-5+deb8u5_amd64.deb ...
Unpacking nginx-full (1.6.2-5+deb8u5) ...
Selecting previously unselected package nginx.
Preparing to unpack .../nginx_1.6.2-5+deb8u5_all.deb ...
Unpacking nginx (1.6.2-5+deb8u5) ...
Selecting previously unselected package postgresql-client-common.
Preparing to unpack .../postgresql-client-common_165+deb8u3_all.deb ...
Unpacking postgresql-client-common (165+deb8u3) ...
Selecting previously unselected package postgresql-client-9.4.
Preparing to unpack .../postgresql-client-9.4_9.4.15-0+deb8u1_amd64.deb ...
Unpacking postgresql-client-9.4 (9.4.15-0+deb8u1) ...
Selecting previously unselected package ssl-cert.
Preparing to unpack .../ssl-cert_1.0.35_all.deb ...
Unpacking ssl-cert (1.0.35) ...
Selecting previously unselected package postgresql-common.
Preparing to unpack .../postgresql-common_165+deb8u3_all.deb ...
Adding 'diversion of /usr/bin/pg_config to /usr/bin/pg_config.libpq-dev by postgresql-common'
Unpacking postgresql-common (165+deb8u3) ...
Selecting previously unselected package postgresql-9.4.
Preparing to unpack .../postgresql-9.4_9.4.15-0+deb8u1_amd64.deb ...
Unpacking postgresql-9.4 (9.4.15-0+deb8u1) ...
Selecting previously unselected package postgresql.
Preparing to unpack .../postgresql_9.4+165+deb8u3_all.deb ...
Unpacking postgresql (9.4+165+deb8u3) ...
Selecting previously unselected package psmisc.
Preparing to unpack .../psmisc_22.21-2_amd64.deb ...
Unpacking psmisc (22.21-2) ...
Selecting previously unselected package python-pkg-resources.
Preparing to unpack .../python-pkg-resources_5.5.1-1_all.deb ...
Unpacking python-pkg-resources (5.5.1-1) ...
Selecting previously unselected package sudo.
Preparing to unpack .../sudo_1.8.10p3-1+deb8u5_amd64.deb ...
Unpacking sudo (1.8.10p3-1+deb8u5) ...
Selecting previously unselected package python-meld3.
Preparing to unpack .../python-meld3_1.0.0-1_amd64.deb ...
Unpacking python-meld3 (1.0.0-1) ...
Selecting previously unselected package supervisor.
Preparing to unpack .../supervisor_3.0r1-1+deb8u1_all.deb ...
Unpacking supervisor (3.0r1-1+deb8u1) ...
Processing triggers for systemd (215-17+deb8u7) ...
Setting up init-system-helpers (1.22) ...
Setting up cron (3.0pl1-127+deb8u1) ...
Adding group `crontab' (GID 108) ...
Done.
update-rc.d: warning: start and stop actions are no longer supported; falling back to defaults
invoke-rc.d: policy-rc.d denied execution of start.
Setting up libpopt0:amd64 (1.16-10) ...
Setting up liblockfile-bin (1.09-6) ...
Setting up liblockfile1:amd64 (1.09-6) ...
Setting up logrotate (3.8.7-1+b1) ...
Setting up exim4-config (4.84.2-2+deb8u4) ...
debconf: unable to initialize frontend: Dialog
debconf: (TERM is not set, so the dialog frontend is not usable.)
debconf: falling back to frontend: Readline
Adding system-user for exim (v4)
Setting up exim4-base (4.84.2-2+deb8u4) ...
debconf: unable to initialize frontend: Dialog
debconf: (TERM is not set, so the dialog frontend is not usable.)
debconf: falling back to frontend: Readline
exim: DB upgrade, deleting hints-db
Setting up exim4-daemon-light (4.84.2-2+deb8u4) ...
debconf: unable to initialize frontend: Dialog
debconf: (TERM is not set, so the dialog frontend is not usable.)
debconf: falling back to frontend: Readline
invoke-rc.d: policy-rc.d denied execution of start.
Setting up bsd-mailx (8.1.2-0.20141216cvs-2) ...
update-alternatives: using /usr/bin/bsd-mailx to provide /usr/bin/mailx (mailx) in auto mode
Setting up exim4 (4.84.2-2+deb8u4) ...
debconf: unable to initialize frontend: Dialog
debconf: (TERM is not set, so the dialog frontend is not usable.)
debconf: falling back to frontend: Readline
Setting up locales (2.19-18+deb8u10) ...
debconf: unable to initialize frontend: Dialog
debconf: (TERM is not set, so the dialog frontend is not usable.)
debconf: falling back to frontend: Readline
Generating locales (this might take a while)...
Generation complete.
Setting up lsb-release (4.1+Debian13+nmu1) ...
Setting up nginx-common (1.6.2-5+deb8u5) ...
debconf: unable to initialize frontend: Dialog
debconf: (TERM is not set, so the dialog frontend is not usable.)
debconf: falling back to frontend: Readline
Setting up nginx-full (1.6.2-5+deb8u5) ...
invoke-rc.d: policy-rc.d denied execution of start.
Setting up nginx (1.6.2-5+deb8u5) ...
Setting up postgresql-client-common (165+deb8u3) ...
Setting up postgresql-client-9.4 (9.4.15-0+deb8u1) ...
update-alternatives: using /usr/share/postgresql/9.4/man/man1/psql.1.gz to provide /usr/share/man/man1/psql.1.gz (psql.1.gz) in auto mode
Setting up ssl-cert (1.0.35) ...
debconf: unable to initialize frontend: Dialog
debconf: (TERM is not set, so the dialog frontend is not usable.)
debconf: falling back to frontend: Readline
Setting up postgresql-common (165+deb8u3) ...
debconf: unable to initialize frontend: Dialog
debconf: (TERM is not set, so the dialog frontend is not usable.)
debconf: falling back to frontend: Readline
Adding user postgres to group ssl-cert
Creating config file /etc/postgresql-common/createcluster.conf with new version
Creating config file /etc/logrotate.d/postgresql-common with new version
Building PostgreSQL dictionaries from installed myspell/hunspell packages...
Removing obsolete dictionary files:
invoke-rc.d: policy-rc.d denied execution of start.
Setting up postgresql-9.4 (9.4.15-0+deb8u1) ...
Creating new cluster 9.4/main ...
config /etc/postgresql/9.4/main
data /var/lib/postgresql/9.4/main
locale C
port 5432
update-alternatives: using /usr/share/postgresql/9.4/man/man1/postmaster.1.gz to provide /usr/share/man/man1/postmaster.1.gz (postmaster.1.gz) in auto mode
invoke-rc.d: policy-rc.d denied execution of start.
Setting up postgresql (9.4+165+deb8u3) ...
Setting up psmisc (22.21-2) ...
Setting up python-pkg-resources (5.5.1-1) ...
Setting up sudo (1.8.10p3-1+deb8u5) ...
Setting up python-meld3 (1.0.0-1) ...
Setting up supervisor (3.0r1-1+deb8u1) ...
invoke-rc.d: policy-rc.d denied execution of start.
Processing triggers for systemd (215-17+deb8u7) ...
Processing triggers for libc-bin (2.19-18+deb8u10) ...
---> bbf44cc0dd51
Removing intermediate container 8c61389a7cb1
Step 5/15 : RUN pip install uwsgi Django psycopg2 pytz requests
---> Running in 1729239ae080
Collecting uwsgi
Downloading uwsgi-2.0.15.tar.gz (795kB)
Collecting Django
Downloading Django-2.0.tar.gz (8.0MB)
Complete output from command python setup.py egg_info:
Traceback (most recent call last):
File "<string>", line 1, in <module>
File "/tmp/pip-build-lMnmL0/Django/setup.py", line 32, in <module>
version = __import__('django').get_version()
File "django/__init__.py", line 1, in <module>
from django.utils.version import get_version
File "django/utils/version.py", line 61, in <module>
@functools.lru_cache()
AttributeError: 'module' object has no attribute 'lru_cache'
----------------------------------------
Command "python setup.py egg_info" failed with error code 1 in /tmp/pip-build-lMnmL0/Django/
The command '/bin/sh -c pip install uwsgi Django psycopg2 pytz requests' returned a non-zero code: 1
Error: Failed to create Docker image for pulsar-dashboard
Build step 'Execute shell' marked build as failure
Not sending mail to unregistered user github@alasdairhodge.co.uk
Not sending mail to unregistered user y.shiga.91+yush1ga@gmail.com
Build failed in Jenkins: pulsar-master #215
Posted by Apache Jenkins Server <je...@builds.apache.org>.
See <https://builds.apache.org/job/pulsar-master/215/display/redirect?page=changes>
Changes:
[github] Bookies pods in kubernetes need to use hostPort (#1035)
[github] Enable usage of KQueue in MacOS (#1036)
------------------------------------------
[...truncated 328.16 KB...]
[MethodUtil@66cfe465] info register aspect org.apache.pulsar.zookeeper.ZooKeeperServerAspect
[MethodUtil@66cfe465] info register aspect org.apache.pulsar.broker.zookeeper.aspectj.ClientCnxnAspect
[MethodUtil@579dae26] info AspectJ Weaver Version 1.8.9 built on Monday Mar 14, 2016 at 21:18:16 GMT
[MethodUtil@579dae26] info register classloader sun.reflect.misc.MethodUtil@579dae26
[MethodUtil@579dae26] info using configuration file:/pulsar/pulsar-client-cpp/pulsar-dist/lib/org.apache.pulsar-pulsar-zookeeper-1.22.0-incubating-SNAPSHOT.jar!/META-INF/aop.xml
[MethodUtil@579dae26] info using configuration file:/pulsar/pulsar-client-cpp/pulsar-dist/lib/org.apache.pulsar-pulsar-broker-1.22.0-incubating-SNAPSHOT.jar!/META-INF/aop.xml
[MethodUtil@579dae26] info register aspect org.apache.pulsar.zookeeper.FinalRequestProcessorAspect
[MethodUtil@579dae26] info register aspect org.apache.pulsar.zookeeper.ZooKeeperServerAspect
[MethodUtil@579dae26] info register aspect org.apache.pulsar.broker.zookeeper.aspectj.ClientCnxnAspect
---- Run unit tests in parallel
[0/90] Running tests...
[1/90] DestinationNameTest.testDestinationName (33 ms)
[2/90] DestinationNameTest.testDestinationNameWithSlashes (33 ms)
[3/90] DestinationNameTest.testLookup (35 ms)
[4/90] DestinationNameTest.testEmptyClusterName (35 ms)
[5/90] DestinationNameTest.testExtraSlashes (36 ms)
[6/90] DestinationNameTest.testIllegalCharacters (38 ms)
[7/90] DestinationNameTest.testIllegalUrl (35 ms)
[8/90] DestinationNameTest.testEmptyString (43 ms)
[9/90] DestinationNameTest.testExtraArguments (41 ms)
[10/90] AuthPluginTest.testCreate (42 ms)
[11/90] BackoffTest.mandatoryStopTestNegativeTest (41 ms)
[12/90] BackoffTest.basicTest (35 ms)
[13/90] BackoffTest.maxTest (33 ms)
[14/90] BackoffTest.mandatoryStopTest (33 ms)
[15/90] AuthPluginTest.testAthenz (62 ms)
[16/90] BackoffTest.ignoringMandatoryStopTest (33 ms)
[17/90] AuthPluginTest.testDisable (64 ms)
[18/90] BasicEndToEndTest.testNonExistingTopic (35 ms)
[19/90] BasicEndToEndTest.testLookupThrottling (134 ms)
[20/90] BackoffTest.firstBackoffTimerTest (359 ms)
[21/90] BasicEndToEndTest.testInvalidUrlPassed (35 ms)
[22/90] BasicEndToEndTest.testPartitionedProducerConsumer (117 ms)
log4cxx: Could not read configuration file [log4cxx.conf].
Note: Google Test filter = BasicEndToEndTest.testPartitionedProducerConsumer
[==========] Running 1 test from 1 test case.
[----------] Global test environment set-up.
[----------] 1 test from BasicEndToEndTest
[ RUN ] BasicEndToEndTest.testPartitionedProducerConsumer
log4cxx: No appender could be found for logger (pulsar./pulsar/pulsar-client-cpp/lib/ClientImpl.cc).
log4cxx: Please initialize the log4cxx system properly.
{"reason":"Property does not exist"}/pulsar/pulsar-client-cpp/tests/BasicEndToEndTest.cc:402: Failure
Value of: res != 204 && res != 409
Actual: true
Expected: false
[ FAILED ] BasicEndToEndTest.testPartitionedProducerConsumer (82 ms)
[----------] 1 test from BasicEndToEndTest (82 ms total)
[----------] Global test environment tear-down
[==========] 1 test from 1 test case ran. (82 ms total)
[ PASSED ] 0 tests.
[ FAILED ] 1 test, listed below:
[ FAILED ] BasicEndToEndTest.testPartitionedProducerConsumer
1 FAILED TEST
[22/90] BasicEndToEndTest.testPartitionedProducerConsumer returned/aborted with exit code 1 (117 ms)
[23/90] BasicEndToEndTest.testPartitionedProducerConsumerSubscriptionName (72 ms)
log4cxx: Could not read configuration file [log4cxx.conf].
Note: Google Test filter = BasicEndToEndTest.testPartitionedProducerConsumerSubscriptionName
[==========] Running 1 test from 1 test case.
[----------] Global test environment set-up.
[----------] 1 test from BasicEndToEndTest
[ RUN ] BasicEndToEndTest.testPartitionedProducerConsumerSubscriptionName
log4cxx: No appender could be found for logger (pulsar./pulsar/pulsar-client-cpp/lib/ClientImpl.cc).
log4cxx: Please initialize the log4cxx system properly.
{"reason":"Property does not exist"}/pulsar/pulsar-client-cpp/tests/BasicEndToEndTest.cc:442: Failure
Value of: res != 204 && res != 409
Actual: true
Expected: false
[ FAILED ] BasicEndToEndTest.testPartitionedProducerConsumerSubscriptionName (32 ms)
[----------] 1 test from BasicEndToEndTest (32 ms total)
[----------] Global test environment tear-down
[==========] 1 test from 1 test case ran. (32 ms total)
[ PASSED ] 0 tests.
[ FAILED ] 1 test, listed below:
[ FAILED ] BasicEndToEndTest.testPartitionedProducerConsumerSubscriptionName
1 FAILED TEST
[23/90] BasicEndToEndTest.testPartitionedProducerConsumerSubscriptionName returned/aborted with exit code 1 (72 ms)
[24/90] BasicEndToEndTest.testMessageTooBig (550 ms)
[25/90] BasicEndToEndTest.testIamSoFancyCharactersInTopicName (1101 ms)
[26/90] BasicEndToEndTest.testSingleClientMultipleSubscriptions (1148 ms)
[27/90] BasicEndToEndTest.testNonPersistentTopic (1148 ms)
[28/90] BasicEndToEndTest.testConfigurationFile (28 ms)
[29/90] BasicEndToEndTest.testSinglePartitionRoutingPolicy (55 ms)
log4cxx: Could not read configuration file [log4cxx.conf].
Note: Google Test filter = BasicEndToEndTest.testSinglePartitionRoutingPolicy
[==========] Running 1 test from 1 test case.
[----------] Global test environment set-up.
[----------] 1 test from BasicEndToEndTest
[ RUN ] BasicEndToEndTest.testSinglePartitionRoutingPolicy
log4cxx: No appender could be found for logger (pulsar./pulsar/pulsar-client-cpp/lib/ClientImpl.cc).
log4cxx: Please initialize the log4cxx system properly.
{"reason":"Property does not exist"}/pulsar/pulsar-client-cpp/tests/BasicEndToEndTest.cc:586: Failure
Value of: res != 204 && res != 409
Actual: true
Expected: false
[ FAILED ] BasicEndToEndTest.testSinglePartitionRoutingPolicy (25 ms)
[----------] 1 test from BasicEndToEndTest (25 ms total)
[----------] Global test environment tear-down
[==========] 1 test from 1 test case ran. (25 ms total)
[ PASSED ] 0 tests.
[ FAILED ] 1 test, listed below:
[ FAILED ] BasicEndToEndTest.testSinglePartitionRoutingPolicy
1 FAILED TEST
[29/90] BasicEndToEndTest.testSinglePartitionRoutingPolicy returned/aborted with exit code 1 (55 ms)
[30/90] BasicEndToEndTest.testNamespaceName (34 ms)
[31/90] BasicEndToEndTest.testSubscribeCloseUnsubscribeSherpaScenario (1099 ms)
[32/90] BasicEndToEndTest.testDuplicateConsumerCreationOnPartitionedTopic (62 ms)
log4cxx: Could not read configuration file [log4cxx.conf].
Note: Google Test filter = BasicEndToEndTest.testDuplicateConsumerCreationOnPartitionedTopic
[==========] Running 1 test from 1 test case.
[----------] Global test environment set-up.
[----------] 1 test from BasicEndToEndTest
[ RUN ] BasicEndToEndTest.testDuplicateConsumerCreationOnPartitionedTopic
log4cxx: No appender could be found for logger (pulsar./pulsar/pulsar-client-cpp/lib/ClientImpl.cc).
log4cxx: Please initialize the log4cxx system properly.
{"reason":"Property does not exist"}/pulsar/pulsar-client-cpp/tests/BasicEndToEndTest.cc:648: Failure
Value of: res != 204 && res != 409
Actual: true
Expected: false
[ FAILED ] BasicEndToEndTest.testDuplicateConsumerCreationOnPartitionedTopic (28 ms)
[----------] 1 test from BasicEndToEndTest (28 ms total)
[----------] Global test environment tear-down
[==========] 1 test from 1 test case ran. (28 ms total)
[ PASSED ] 0 tests.
[ FAILED ] 1 test, listed below:
[ FAILED ] BasicEndToEndTest.testDuplicateConsumerCreationOnPartitionedTopic
1 FAILED TEST
[32/90] BasicEndToEndTest.testDuplicateConsumerCreationOnPartitionedTopic returned/aborted with exit code 1 (62 ms)
[33/90] BasicEndToEndTest.testProduceConsume (1309 ms)
[34/90] BasicEndToEndTest.testRoundRobinRoutingPolicy (72 ms)
log4cxx: Could not read configuration file [log4cxx.conf].
Note: Google Test filter = BasicEndToEndTest.testRoundRobinRoutingPolicy
[==========] Running 1 test from 1 test case.
[----------] Global test environment set-up.
[----------] 1 test from BasicEndToEndTest
[ RUN ] BasicEndToEndTest.testRoundRobinRoutingPolicy
log4cxx: No appender could be found for logger (pulsar./pulsar/pulsar-client-cpp/lib/ClientImpl.cc).
log4cxx: Please initialize the log4cxx system properly.
{"reason":"Property does not exist"}/pulsar/pulsar-client-cpp/tests/BasicEndToEndTest.cc:699: Failure
Value of: res != 204 && res != 409
Actual: true
Expected: false
[ FAILED ] BasicEndToEndTest.testRoundRobinRoutingPolicy (34 ms)
[----------] 1 test from BasicEndToEndTest (34 ms total)
[----------] Global test environment tear-down
[==========] 1 test from 1 test case ran. (35 ms total)
[ PASSED ] 0 tests.
[ FAILED ] 1 test, listed below:
[ FAILED ] BasicEndToEndTest.testRoundRobinRoutingPolicy
1 FAILED TEST
[34/90] BasicEndToEndTest.testRoundRobinRoutingPolicy returned/aborted with exit code 1 (72 ms)
[35/90] BasicEndToEndTest.testMessageListener (74 ms)
log4cxx: Could not read configuration file [log4cxx.conf].
Note: Google Test filter = BasicEndToEndTest.testMessageListener
[==========] Running 1 test from 1 test case.
[----------] Global test environment set-up.
[----------] 1 test from BasicEndToEndTest
[ RUN ] BasicEndToEndTest.testMessageListener
log4cxx: No appender could be found for logger (pulsar./pulsar/pulsar-client-cpp/lib/ClientImpl.cc).
log4cxx: Please initialize the log4cxx system properly.
{"reason":"Property does not exist"}/pulsar/pulsar-client-cpp/tests/BasicEndToEndTest.cc:764: Failure
Value of: res != 204 && res != 409
Actual: true
Expected: false
[ FAILED ] BasicEndToEndTest.testMessageListener (34 ms)
[----------] 1 test from BasicEndToEndTest (34 ms total)
[----------] Global test environment tear-down
[==========] 1 test from 1 test case ran. (34 ms total)
[ PASSED ] 0 tests.
[ FAILED ] 1 test, listed below:
[ FAILED ] BasicEndToEndTest.testMessageListener
1 FAILED TEST
[35/90] BasicEndToEndTest.testMessageListener returned/aborted with exit code 1 (74 ms)
[36/90] BasicEndToEndTest.testCompressionZLib (333 ms)
[37/90] BasicEndToEndTest.testConsumerClose (268 ms)
[38/90] BasicEndToEndTest.testCompressionLZ4 (403 ms)
[39/90] BasicEndToEndTest.testProduceAndConsumeAfterClientClose (1514 ms)
[40/90] BasicEndToEndTest.testProduceMessageSize (525 ms)
[41/90] LoggerTest.testLogger (73 ms)
[42/90] ConsumerTest.consumerNotInitialized (44 ms)
[43/90] ProducerTest.producerNotInitialized (47 ms)
[44/90] NamespaceNameTest.testNamespaceName (46 ms)
[45/90] UrlTest.testUrl (50 ms)
[46/90] ClientTest.testChecksumComputation (44 ms)
[47/90] ClientTest.testSwHwChecksum (33 ms)
[48/90] ClientDeduplicationTest.testProducerSequenceAfterReconnect (901 ms)
[49/90] BinaryLookupServiceTest.basicLookup (94 ms)
[50/90] ConsumerStatsTest.testFailure (467 ms)
[51/90] BasicEndToEndTest.testMultipleClientsMultipleSubscriptions (3200 ms)
[52/90] ClientDeduplicationTest.testProducerDeduplication (2786 ms)
[53/90] MessageIdTest.testSerialization (36 ms)
[54/90] ReaderTest.testSimpleReader (172 ms)
[55/90] ReaderTest.testReaderAfterMessagesWerePublished (110 ms)
[56/90] ReaderTest.testMultipleReaders (78 ms)
[57/90] ReaderTest.testReaderOnLastMessage (86 ms)
[58/90] ReaderTest.testReaderOnSpecificMessage (75 ms)
[59/90] BasicEndToEndTest.testResendViaSendCallback (3937 ms)
[60/90] BlockingQueueTest.testBasic (23 ms)
[61/90] BlockingQueueTest.testQueueOperations (23 ms)
[62/90] BlockingQueueTest.testBlockingProducer (23 ms)
[63/90] BlockingQueueTest.testBlockingConsumer (23 ms)
[64/90] ReaderTest.testReaderOnSpecificMessageWithBatches (1069 ms)
[65/90] BlockingQueueTest.testReservedSpot (23 ms)
[66/90] BatchMessageTest.testProducerConfig (24 ms)
[67/90] ConsumerStatsTest.testBacklogInfo (3957 ms)
[68/90] AuthPluginTest.testTls (6493 ms)
[69/90] BasicEndToEndTest.testBatchMessages (7193 ms)
[70/90] ConsumerStatsTest.testCachingMechanism (4297 ms)
[71/90] BlockingQueueTest.testTimeout (3024 ms)
[72/90] ConsumerStatsTest.testAsyncCallOnPartitionedTopic (6100 ms)
[73/90] BatchMessageTest.testBatchSizeInBytes (5074 ms)
[74/90] BasicEndToEndTest.testStatsLatencies (11749 ms)
[75/90] MessageTest.testMessageContents (23 ms)
[76/90] MessageTest.testAllocatedContents (22 ms)
[77/90] MessageTest.testProperties (22 ms)
[78/90] ZTSClientTest.testZTSClient (23 ms)
[79/90] LatchTest.testCountDown (75 ms)
[80/90] LatchTest.testLatchCount (73 ms)
[81/90] LatchTest.testTimedWait (126 ms)
[82/90] BatchMessageTest.testCumulativeAck (15088 ms)
[83/90] BatchMessageTest.testMixedAck (15073 ms)
[84/90] BatchMessageTest.testSmallReceiverQueueSize (20245 ms)
[85/90] BatchMessageTest.testProducerTimeout (21067 ms)
[86/90] BatchMessageTest.testPermits (20111 ms)
[87/90] BatchMessageTest.testIndividualAck (25099 ms)
[88/90] BatchMessageTest.testPartitionedTopics (33766 ms)
[89/90] BasicEndToEndTest.testMessageListenerPause (57999 ms)
[90/90] BasicEndToEndTest.testHandlerReconnectionLogic (64265 ms)
FAILED TESTS (6/90):
117 ms: ./main BasicEndToEndTest.testPartitionedProducerConsumer
72 ms: ./main BasicEndToEndTest.testPartitionedProducerConsumerSubscriptionName
55 ms: ./main BasicEndToEndTest.testSinglePartitionRoutingPolicy
62 ms: ./main BasicEndToEndTest.testDuplicateConsumerCreationOnPartitionedTopic
72 ms: ./main BasicEndToEndTest.testRoundRobinRoutingPolicy
74 ms: ./main BasicEndToEndTest.testMessageListener
Build step 'Execute shell' marked build as failure
Not sending mail to unregistered user github@alasdairhodge.co.uk
Not sending mail to unregistered user y.shiga.91+yush1ga@gmail.com