You are viewing a plain text version of this content. The canonical link for it is here.
Posted to builds@cassandra.apache.org by Apache Jenkins Server <je...@builds.apache.org> on 2025/03/22 08:03:11 UTC

Build complete: Cassandra-trunk #2078 [UNSTABLE] ea4ff0e9663f8de01a56ac6b9e9ffc2bc363dc5e

-------------------------------------------------------------------------------
  Build Cassandra-trunk #2078 Still Unstable
  URL: https://ci-cassandra.apache.org/job/Cassandra-trunk/2078/
  -------------------------------------------------------------------------------
  Changes:
  No changes

  -------------------------------------------------------------------------------
  Failed Tests:
  7 tests failed.
FAILED:  dtest-latest.cdc_test.TestCDC.Tests / dtest-latest jdk17 25/64 / test_insertion_and_commitlog_behavior_after_reaching_cdc_total_space
FAILED:  dtest-upgrade-novnode-large.upgrade_tests.upgrade_through_versions_test.TestProtoV5Upgrade_AllVersions_RandomPartitioner_EndsAt_Trunk_HEAD.Tests / dtest-upgrade-novnode-large jdk11 25/32 / test_parallel_upgrade
FAILED:  dtest-upgrade-novnode-large.upgrade_tests.upgrade_through_versions_test.TestUpgrade_indev_4_1_x_To_indev_trunk.Tests / dtest-upgrade-novnode-large jdk11 25/32 / test_parallel_upgrade_with_internode_ssl
FAILED:  dtest.counter_test.TestCounters.Tests / dtest jdk11 7/64 / test_counter_node_down
FAILED:  org.apache.cassandra.db.commitlog.CommitLogSegmentManagerCDCTest.Tests / test-latest jdk11 13/16 / testSegmentFlaggingWithNonblockingOnCreation-cassandra.testtag_IS_UNDEFINED
FAILED:  org.apache.cassandra.fuzz.sai.MultiNodeSAITest.Tests / jvm-dtest jdk17 9/12 / indexOnlySaiTest-cassandra.testtag_IS_UNDEFINED
FAILED:  org.apache.cassandra.fuzz.sai.MultiNodeSAITest.Tests / jvm-dtest jdk11 9/12 / indexOnlySaiTest-cassandra.testtag_IS_UNDEFINED

  -------------------------------------------------------------------------------
  For complete test report and logs see https://nightlies.apache.org/cassandra/Cassandra-trunk/2078/