You are viewing a plain text version of this content. The canonical link for it is here.
Posted to issues@trafodion.apache.org by "Alice Chen (JIRA)" <ji...@apache.org> on 2015/07/22 20:17:36 UTC

[jira] [Created] (TRAFODION-627) LP Bug: 1370134 - Phoenix test failure in ArithmeticQueryTest.testDecimalUpsertSelect

Alice Chen created TRAFODION-627:
------------------------------------

             Summary: LP Bug: 1370134 - Phoenix test failure in ArithmeticQueryTest.testDecimalUpsertSelect
                 Key: TRAFODION-627
                 URL: https://issues.apache.org/jira/browse/TRAFODION-627
             Project: Apache Trafodion
          Issue Type: Bug
          Components: dtm
            Reporter: Christopher Sheedy
            Assignee: Atanu Mishra
             Fix For: 1.1 (pre-incubation)


Change https://review.trafodion.org/#/c/424/ failed in the phoenix_test-cdh4.4 test with

Tests run: 4, Failures: 1, Errors: 0, Skipped: 0, Time elapsed: 101.153 sec <<< FAILURE! - in test.java.com.hp.phoenix.end2end.ArithmeticQueryTest
testDecimalUpsertSelect(test.java.com.hp.phoenix.end2end.ArithmeticQueryTest)  Time elapsed: 30.465 sec  <<< FAILURE!
java.lang.AssertionError: expected:<100.12> but was:<100.34>
	at org.junit.Assert.fail(Assert.java:88)
	at org.junit.Assert.failNotEquals(Assert.java:743)
	at org.junit.Assert.assertEquals(Assert.java:118)
	at org.junit.Assert.assertEquals(Assert.java:144)
	at test.java.com.hp.phoenix.end2end.ArithmeticQueryTest.testDecimalUpsertSelect(ArithmeticQueryTest.java:226)

. . .
Results :

Failed tests:
  ArithmeticQueryTest.testDecimalUpsertSelect:226 expected:<100.12> but was:<100.34>

Tests run: 375, Failures: 1, Errors: 0, Skipped: 0

The logs are saved at http://logs.trafodion.org/24/424/3/check-full/phoenix_test-cdh4.4/0a7b7f7/



--
This message was sent by Atlassian JIRA
(v6.3.4#6332)