You are viewing a plain text version of this content. The canonical link for it is here.
Posted to dev@poi.apache.org by Apache Jenkins Server <je...@builds.apache.org> on 2021/08/08 16:33:48 UTC
Jenkins build is still unstable: POI » POI-DSL-1.16 #432
See <https://ci-builds.apache.org/job/POI/job/POI-DSL-1.16/432/display/redirect?page=changes>
---------------------------------------------------------------------
To unsubscribe, e-mail: dev-unsubscribe@poi.apache.org
For additional commands, e-mail: dev-help@poi.apache.org
Jenkins build is back to normal : POI » POI-DSL-1.16 #435
Posted by Apache Jenkins Server <je...@builds.apache.org>.
See <https://ci-builds.apache.org/job/POI/job/POI-DSL-1.16/435/display/redirect?page=changes>
---------------------------------------------------------------------
To unsubscribe, e-mail: dev-unsubscribe@poi.apache.org
For additional commands, e-mail: dev-help@poi.apache.org
Build failed in Jenkins: POI » POI-DSL-1.16 #434
Posted by Apache Jenkins Server <je...@builds.apache.org>.
See <https://ci-builds.apache.org/job/POI/job/POI-DSL-1.16/434/display/redirect?page=changes>
Changes:
[PJ Fanning] fix broken test case
[Andreas Beeker] use gradle as default build tool
[Andreas Beeker] move dist files from gradles default dist directory to pois dist dir
------------------------------------------
[...truncated 2.31 KB...]
C build.gradle
? build.gradle.mine
? build.gradle.r1885615
? build.gradle.r1885616
X forrest.properties
X src/documentation
? src/integrationtest
A + C src/multimodule
> local dir edit, incoming dir delete or move upon update
M + src/multimodule/ooxml-full/java9/module-info.class
C + src/multimodule/ooxml-lite/java9/module-info.class
? src/multimodule/ooxml-lite/java9/module-info.class.r1887880
? src/multimodule/ooxml-lite/java9/module-info.class.r1887978
M + src/multimodule/ooxml-lite/java9/module-info.java
Performing status on external item at 'src/documentation':
Summary of conflicts:
Text conflicts: 2
Tree conflicts: 1
+ svn revert poi-examples/src/main/java9/module-info.class poi-examples/src/main/java9/module-info.java poi-excelant/src/main/java9/module-info.class poi-excelant/src/main/java9/module-info.java poi-excelant/src/test/java9/module-info.class poi-excelant/src/test/java9/module-info.java poi-integration/src/test/java9/module-info.class poi-integration/src/test/java9/module-info.java poi-ooxml-full/src/main/java9/module-info.class poi-ooxml-full/src/main/java9/module-info.java poi-ooxml-lite-agent/src/main/java9/module-info.class poi-ooxml-lite-agent/src/main/java9/module-info.java poi-ooxml-lite/src/main/java9/module-info.class poi-ooxml-lite/src/main/java9/module-info.java poi-ooxml/src/main/java9/module-info.class poi-ooxml/src/main/java9/module-info.java poi-ooxml/src/test/java9/module-info.class poi-ooxml/src/test/java9/module-info.java poi-scratchpad/src/main/java9/module-info.class poi-scratchpad/src/main/java9/module-info.java poi-scratchpad/src/test/java9/module-info.class poi-scratchpad/src/test/java9/module-info.java poi/src/main/java9/module-info.class poi/src/main/java9/module-info.java poi/src/test/java9/module-info.class poi/src/test/java9/module-info.java
+ echo Java-Home: /home/jenkins/tools/java/latest16
Java-Home: /home/jenkins/tools/java/latest16
+ ls -al /home/jenkins/tools/java/latest16/
total 36
drwxr-xr-x 8 root root 4096 Jun 13 17:23 .
drwxr-xr-x 28 root root 4096 Jul 19 07:14 ..
drwxr-xr-x 2 root root 4096 Jun 13 17:23 bin
drwxr-xr-x 5 root root 4096 Jun 13 17:23 conf
drwxr-xr-x 3 root root 4096 Jun 13 17:23 include
drwxr-xr-x 2 root root 4096 Jun 13 17:23 jmods
drwxr-xr-x 69 root root 4096 Jun 13 17:22 legal
drwxr-xr-x 5 root root 4096 Jun 13 17:23 lib
-rw-r--r-- 1 root root 1137 Mar 26 18:20 release
+ ls -al /home/jenkins/tools/java/latest16/bin
total 472
drwxr-xr-x 2 root root 4096 Jun 13 17:23 .
drwxr-xr-x 8 root root 4096 Jun 13 17:23 ..
-rwxr-xr-x 1 root root 13056 Mar 26 18:20 jar
-rwxr-xr-x 1 root root 13064 Mar 26 18:20 jarsigner
-rwxr-xr-x 1 root root 13040 Mar 26 18:20 java
-rwxr-xr-x 1 root root 13088 Mar 26 18:20 javac
-rwxr-xr-x 1 root root 13096 Mar 26 18:20 javadoc
-rwxr-xr-x 1 root root 13056 Mar 26 18:20 javap
-rwxr-xr-x 1 root root 13056 Mar 26 18:20 jcmd
-rwxr-xr-x 1 root root 13128 Mar 26 18:20 jconsole
-rwxr-xr-x 1 root root 13056 Mar 26 18:20 jdb
-rwxr-xr-x 1 root root 13064 Mar 26 18:20 jdeprscan
-rwxr-xr-x 1 root root 13056 Mar 26 18:20 jdeps
-rwxr-xr-x 1 root root 13056 Mar 26 18:20 jfr
-rwxr-xr-x 1 root root 13056 Mar 26 18:20 jhsdb
-rwxr-xr-x 1 root root 13064 Mar 26 18:20 jimage
-rwxr-xr-x 1 root root 13088 Mar 26 18:20 jinfo
-rwxr-xr-x 1 root root 13088 Mar 26 18:20 jlink
-rwxr-xr-x 1 root root 13088 Mar 26 18:20 jmap
-rwxr-xr-x 1 root root 13056 Mar 26 18:20 jmod
-rwxr-xr-x 1 root root 13064 Mar 26 18:20 jpackage
-rwxr-xr-x 1 root root 13056 Mar 26 18:20 jps
-rwxr-xr-x 1 root root 13096 Mar 26 18:20 jrunscript
-rwxr-xr-x 1 root root 13064 Mar 26 18:20 jshell
-rwxr-xr-x 1 root root 13096 Mar 26 18:20 jstack
-rwxr-xr-x 1 root root 13056 Mar 26 18:20 jstat
-rwxr-xr-x 1 root root 13064 Mar 26 18:20 jstatd
-rwxr-xr-x 1 root root 13064 Mar 26 18:20 keytool
-rwxr-xr-x 1 root root 13056 Mar 26 18:20 rmid
-rwxr-xr-x 1 root root 13064 Mar 26 18:20 rmiregistry
-rwxr-xr-x 1 root root 13064 Mar 26 18:20 serialver
+ /home/jenkins/tools/java/latest16/bin/java -version
openjdk version "16.0.1" 2021-04-20
OpenJDK Runtime Environment (build 16.0.1+9-24)
OpenJDK 64-Bit Server VM (build 16.0.1+9-24, mixed mode, sharing)
+ echo which java
which java
+ which java
/home/jenkins/tools/java/latest16/bin/java
+ java -version
openjdk version "16.0.1" 2021-04-20
OpenJDK Runtime Environment (build 16.0.1+9-24)
OpenJDK 64-Bit Server VM (build 16.0.1+9-24, mixed mode, sharing)
+ echo which javac
which javac
+ which javac
/home/jenkins/tools/java/latest16/bin/javac
+ javac -version
javac 16.0.1
+ echo Ant-Home:
Ant-Home:
+ ls -al
total 560
drwxr-xr-x 24 jenkins jenkins 4096 Aug 9 22:51 .
drwxr-xr-x 4 jenkins jenkins 4096 Jul 30 07:24 ..
drwxr-xr-x 6 jenkins jenkins 4096 Aug 9 22:21 build
-rw------- 1 jenkins jenkins 14939 Jan 17 2021 build.gradle
-rw-r--r-- 1 jenkins jenkins 14841 Jan 17 2021 build.gradle.mine
-rw-r--r-- 1 jenkins jenkins 14850 Jan 17 2021 build.gradle.r1885615
-rw-r--r-- 1 jenkins jenkins 14850 Jan 17 2021 build.gradle.r1885616
-rw-r--r-- 1 jenkins jenkins 168861 Aug 6 20:55 build.xml
-rw-r--r-- 1 jenkins jenkins 6325 Jan 17 2021 doap_POI.rdf
-rw-r--r-- 1 jenkins jenkins 3014 Apr 28 09:44 file-leak-detector.exclude
-rw-r--r-- 1 jenkins jenkins 6229 Dec 24 2020 forrest.properties
-rw-r--r-- 1 jenkins jenkins 53 Dec 24 2020 .gitattributes
drwxr-xr-x 3 jenkins jenkins 4096 Dec 24 2020 .github
-rw-r--r-- 1 jenkins jenkins 523 Apr 6 20:25 .gitignore
drwxr-xr-x 3 jenkins jenkins 4096 Dec 24 2020 gradle
-rw-r--r-- 1 jenkins jenkins 154 Apr 7 22:55 gradle.properties
-rwxr-xr-x 1 jenkins jenkins 5766 May 14 06:55 gradlew
-rw-r--r-- 1 jenkins jenkins 2763 May 14 06:55 gradlew.bat
drwxr-xr-x 2 jenkins jenkins 4096 Aug 9 22:51 jenkins
-rw-r--r-- 1 jenkins jenkins 167281 Mar 14 01:55 KEYS
drwxr-xr-x 2 jenkins jenkins 4096 Apr 7 22:55 legal
drwxr-xr-x 10 jenkins jenkins 4096 Feb 22 00:25 lib
drwxr-xr-x 2 jenkins jenkins 4096 Apr 10 07:25 lib.stored
drwxr-xr-x 2 jenkins jenkins 4096 Jul 15 08:10 maven
drwxr-xr-x 3 jenkins jenkins 4096 Jul 12 08:25 osgi
-rw-r--r-- 1 jenkins jenkins 4813 Dec 24 2020 patch.xml
drwxr-xr-x 5 jenkins jenkins 4096 Aug 9 22:10 poi
drwxr-xr-x 4 jenkins jenkins 4096 Aug 9 22:10 poi-examples
drwxr-xr-x 4 jenkins jenkins 4096 Aug 9 22:10 poi-excelant
drwxr-xr-x 4 jenkins jenkins 4096 Aug 9 22:10 poi-integration
drwxr-xr-x 4 jenkins jenkins 4096 Aug 9 22:10 poi-ooxml
drwxr-xr-x 4 jenkins jenkins 4096 Aug 9 22:10 poi-ooxml-full
drwxr-xr-x 3 jenkins jenkins 4096 Jul 19 22:10 poi-ooxml-lite
drwxr-xr-x 4 jenkins jenkins 4096 May 14 06:55 poi-ooxml-lite-agent
drwxr-xr-x 5 jenkins jenkins 4096 Aug 9 22:10 poi-scratchpad
-rw-r--r-- 1 jenkins jenkins 4328 Apr 9 08:25 README.rst
-rw-r--r-- 1 jenkins jenkins 197 Apr 7 22:55 settings.gradle
drwxr-xr-x 9 jenkins jenkins 4096 Jul 12 08:25 sonar
drwxr-xr-x 6 jenkins jenkins 4096 Mar 27 14:06 src
drwxr-xr-x 4 jenkins jenkins 4096 Aug 9 22:51 .svn
drwxr-xr-x 15 jenkins jenkins 4096 Dec 30 2020 test-data
-rw-r--r-- 1 jenkins jenkins 426 Jul 19 22:10 .travis.yml
+ echo which ant
which ant
+ which ant
/usr/bin/ant
+ ant -version
Apache Ant(TM) version 1.10.5 compiled on March 28 2019
+ echo <project default="test"><target name="test"><echo>Java ${ant.java.version}/${java.version}</echo><exec executable="javac"><arg value="-version"/></exec></target></project>
+ ant -f build.javacheck.xml -v
Apache Ant(TM) version 1.10.5 compiled on March 28 2019
Buildfile: <https://ci-builds.apache.org/job/POI/job/POI-DSL-1.16/ws/build.javacheck.xml>
Detected Java version: 16 in: /usr/local/asfpackages/java/openjdk-16-16.0.1
Detected OS: Linux
parsing buildfile <https://ci-builds.apache.org/job/POI/job/POI-DSL-1.16/ws/build.javacheck.xml> with URI = <https://ci-builds.apache.org/job/POI/job/POI-DSL-1.16/ws/build.javacheck.xml>
Project base dir set to: <https://ci-builds.apache.org/job/POI/job/POI-DSL-1.16/ws/>
Build sequence for target(s) `test' is [test]
Complete build sequence is [test, ]
test:
parsing buildfile jar:file:/usr/share/ant/lib/ant.jar!/org/apache/tools/ant/antlib.xml with URI = jar:file:/usr/share/ant/lib/ant.jar!/org/apache/tools/ant/antlib.xml from a zip file
[echo] Java 16/16.0.1
[exec] Current OS is Linux
[exec] Executing 'javac' with arguments:
[exec] '-version'
[exec]
[exec] The ' characters around the executable and arguments are
[exec] not part of the command.
[exec] javac 16.0.1
BUILD SUCCESSFUL
Total time: 0 seconds
+ exit 0
[POI-DSL-1.16] $ /bin/sh -xe /tmp/jenkins986503091364809304.sh
+ touch --no-create build/*/build/test-results/TEST-*.xml build/*/build/test-results/test/TEST-*.xml
[POI-DSL-1.16] $ /home/jenkins/tools/ant/latest1.10/bin/ant init
Buildfile: <https://ci-builds.apache.org/job/POI/job/POI-DSL-1.16/ws/build.xml>
check-jars:
fetch-jars:
check-ooxml-jars:
fetch-ooxml-jars:
[get] Destination already exists (skipping): <https://ci-builds.apache.org/job/POI/job/POI-DSL-1.16/ws/lib/ooxml/curvesapi-1.06.jar>
[get] Getting: https://repo1.maven.org/maven2/org/apache/xmlbeans/xmlbeans/5.0.0/xmlbeans-5.0.0.jar
[get] To: <https://ci-builds.apache.org/job/POI/job/POI-DSL-1.16/ws/lib/ooxml/xmlbeans-5.0.0.jar>
[get] Destination already exists (skipping): <https://ci-builds.apache.org/job/POI/job/POI-DSL-1.16/ws/lib/ooxml/commons-compress-1.21.jar>
[get] Destination already exists (skipping): <https://ci-builds.apache.org/job/POI/job/POI-DSL-1.16/ws/lib/ooxml-tests/reflections-0.9.12.jar>
[get] Destination already exists (skipping): <https://ci-builds.apache.org/job/POI/job/POI-DSL-1.16/ws/lib/ooxml-tests/guava-30.1-jre.jar>
[get] Destination already exists (skipping): <https://ci-builds.apache.org/job/POI/job/POI-DSL-1.16/ws/lib/ooxml-tests/javassist-3.27.0-GA.jar>
[get] Destination already exists (skipping): <https://ci-builds.apache.org/job/POI/job/POI-DSL-1.16/ws/lib/ooxml-tests/slf4j-api-1.7.31.jar>
[get] Destination already exists (skipping): <https://ci-builds.apache.org/job/POI/job/POI-DSL-1.16/ws/lib/ooxml-batik/batik-anim-1.14.jar>
[get] Destination already exists (skipping): <https://ci-builds.apache.org/job/POI/job/POI-DSL-1.16/ws/lib/ooxml-batik/batik-awt-util-1.14.jar>
[get] Destination already exists (skipping): <https://ci-builds.apache.org/job/POI/job/POI-DSL-1.16/ws/lib/ooxml-batik/batik-bridge-1.14.jar>
[get] Destination already exists (skipping): <https://ci-builds.apache.org/job/POI/job/POI-DSL-1.16/ws/lib/ooxml-batik/batik-codec-1.14.jar>
[get] Destination already exists (skipping): <https://ci-builds.apache.org/job/POI/job/POI-DSL-1.16/ws/lib/ooxml-batik/batik-constants-1.14.jar>
[get] Destination already exists (skipping): <https://ci-builds.apache.org/job/POI/job/POI-DSL-1.16/ws/lib/ooxml-batik/batik-css-1.14.jar>
[get] Destination already exists (skipping): <https://ci-builds.apache.org/job/POI/job/POI-DSL-1.16/ws/lib/ooxml-batik/batik-dom-1.14.jar>
[get] Destination already exists (skipping): <https://ci-builds.apache.org/job/POI/job/POI-DSL-1.16/ws/lib/ooxml-batik/batik-ext-1.14.jar>
[get] Destination already exists (skipping): <https://ci-builds.apache.org/job/POI/job/POI-DSL-1.16/ws/lib/ooxml-batik/batik-gvt-1.14.jar>
[get] Destination already exists (skipping): <https://ci-builds.apache.org/job/POI/job/POI-DSL-1.16/ws/lib/ooxml-batik/batik-i18n-1.14.jar>
[get] Destination already exists (skipping): <https://ci-builds.apache.org/job/POI/job/POI-DSL-1.16/ws/lib/ooxml-batik/batik-parser-1.14.jar>
[get] Destination already exists (skipping): <https://ci-builds.apache.org/job/POI/job/POI-DSL-1.16/ws/lib/ooxml-batik/batik-script-1.14.jar>
[get] Destination already exists (skipping): <https://ci-builds.apache.org/job/POI/job/POI-DSL-1.16/ws/lib/ooxml-batik/batik-shared-resources-1.14.jar>
[get] Destination already exists (skipping): <https://ci-builds.apache.org/job/POI/job/POI-DSL-1.16/ws/lib/ooxml-batik/batik-svg-dom-1.14.jar>
[get] Destination already exists (skipping): <https://ci-builds.apache.org/job/POI/job/POI-DSL-1.16/ws/lib/ooxml-batik/batik-svggen-1.14.jar>
[get] Destination already exists (skipping): <https://ci-builds.apache.org/job/POI/job/POI-DSL-1.16/ws/lib/ooxml-batik/batik-svgrasterizer-1.14.jar>
[get] Destination already exists (skipping): <https://ci-builds.apache.org/job/POI/job/POI-DSL-1.16/ws/lib/ooxml-batik/batik-transcoder-1.14.jar>
[get] Destination already exists (skipping): <https://ci-builds.apache.org/job/POI/job/POI-DSL-1.16/ws/lib/ooxml-batik/batik-util-1.14.jar>
[get] Destination already exists (skipping): <https://ci-builds.apache.org/job/POI/job/POI-DSL-1.16/ws/lib/ooxml-batik/batik-xml-1.14.jar>
[get] Destination already exists (skipping): <https://ci-builds.apache.org/job/POI/job/POI-DSL-1.16/ws/lib/ooxml-batik/xml-apis-ext-1.3.04.jar>
[get] Destination already exists (skipping): <https://ci-builds.apache.org/job/POI/job/POI-DSL-1.16/ws/lib/ooxml-batik/xmlgraphics-commons-2.4.jar>
[get] Destination already exists (skipping): <https://ci-builds.apache.org/job/POI/job/POI-DSL-1.16/ws/lib/ooxml-provided/pdfbox-2.0.24.jar>
[get] Destination already exists (skipping): <https://ci-builds.apache.org/job/POI/job/POI-DSL-1.16/ws/lib/ooxml-provided/fontbox-2.0.24.jar>
[get] Destination already exists (skipping): <https://ci-builds.apache.org/job/POI/job/POI-DSL-1.16/ws/lib/ooxml-provided/graphics2d-0.32.jar>
init:
[echo] Using Ant: Apache Ant(TM) version 1.10.10 compiled on April 12 2021 from /home/jenkins/tools/ant/latest1.10, Ant detected Java 16 (may be different than actual Java sometimes...)
[echo] Using Java: 16.0.1/16.0.1+9-24/16.0.1+9-24/OpenJDK 64-Bit Server VM from Oracle Corporation on Linux: 4.15.0-112-generic
[echo] Building Apache POI version 5.0.1-SNAPSHOT and RC: RC1, isJava8: false
[echo] Compiling for Java 9+
BUILD SUCCESSFUL
Total time: 1 second
[Gradle] - Launching build.
[POI-DSL-1.16] $ <https://ci-builds.apache.org/job/POI/job/POI-DSL-1.16/ws/gradlew> jenkins
To honour the JVM settings for this build a single-use Daemon process will be forked. See https://docs.gradle.org/7.1/userguide/gradle_daemon.html#sec:disabling_the_daemon.
Daemon will be stopped at the end of the build
FAILURE: Build failed with an exception.
* Where:
Build file '<https://ci-builds.apache.org/job/POI/job/POI-DSL-1.16/ws/build.gradle'> line: 103
* What went wrong:
Could not compile build file '<https://ci-builds.apache.org/job/POI/job/POI-DSL-1.16/ws/build.gradle'.>
> startup failed:
build file '<https://ci-builds.apache.org/job/POI/job/POI-DSL-1.16/ws/build.gradle'>: 103: Unexpected input: '{' @ line 103, column 13.
subprojects {
^
1 error
* Try:
Run with --stacktrace option to get the stack trace. Run with --info or --debug option to get more log output. Run with --scan to get full insights.
* Get more help at https://help.gradle.org
BUILD FAILED in 8s
Build step 'Invoke Gradle script' changed build result to FAILURE
Build step 'Invoke Gradle script' marked build as failure
[SpotBugs] Skipping execution of recorder since overall result is 'FAILURE'
Archiving artifacts
Skipping publisher since build result is FAILURE
Recording test results
ERROR: Step ?Publish JUnit test result report? failed: Test reports were found but none of them are new. Did leafNodes run?
For example, <https://ci-builds.apache.org/job/POI/job/POI-DSL-1.16/ws/poi-ooxml/build/test-results/TEST-org.apache.poi.extractor.ooxml.TestExtractorFactory.xml> is 31 min old
---------------------------------------------------------------------
To unsubscribe, e-mail: dev-unsubscribe@poi.apache.org
For additional commands, e-mail: dev-help@poi.apache.org
Build failed in Jenkins: POI » POI-DSL-1.16 #433
Posted by Apache Jenkins Server <je...@builds.apache.org>.
See <https://ci-builds.apache.org/job/POI/job/POI-DSL-1.16/433/display/redirect?page=changes>
Changes:
[PJ Fanning] add support for reading hyperlinks that have cell refs that are area references (very limited update or write support as yet)
------------------------------------------
[...truncated 228.08 KB...]
[junitlauncher]
[junitlauncher] Running org.apache.poi.xssf.extractor.TestXSSFExcelExtractor
[junitlauncher] Tests run: 8, Failures: 0, Aborted: 0, Skipped: 0, Time elapsed: 0.421000 sec
[junitlauncher] Running org.apache.poi.xssf.extractor.TestXSSFExcelExtractorUsingFactory
[junitlauncher]
[junitlauncher] Running org.apache.poi.xssf.extractor.TestXSSFExcelExtractorUsingFactory
[junitlauncher] Tests run: 8, Failures: 0, Aborted: 0, Skipped: 0, Time elapsed: 0.396000 sec
[junitlauncher] Running org.apache.poi.xssf.extractor.TestXSSFExportToXML
[junitlauncher]
[junitlauncher] Running org.apache.poi.xssf.extractor.TestXSSFExportToXML
[junitlauncher] Tests run: 18, Failures: 0, Aborted: 0, Skipped: 1, Time elapsed: 0.390000 sec
[junitlauncher] Running org.apache.poi.xssf.extractor.TestXSSFImportFromXML
[junitlauncher]
[junitlauncher] Running org.apache.poi.xssf.extractor.TestXSSFImportFromXML
[junitlauncher] Tests run: 5, Failures: 0, Aborted: 0, Skipped: 0, Time elapsed: 4.423000 sec
[junitlauncher] Running org.apache.poi.xssf.io.TestLoadSaveXSSF
[junitlauncher]
[junitlauncher] Running org.apache.poi.xssf.io.TestLoadSaveXSSF
[junitlauncher] Tests run: 3, Failures: 0, Aborted: 0, Skipped: 0, Time elapsed: 0.051000 sec
[junitlauncher] Running org.apache.poi.xssf.model.TestCalculationChain
[junitlauncher]
[junitlauncher] Running org.apache.poi.xssf.model.TestCalculationChain
[junitlauncher] Tests run: 1, Failures: 0, Aborted: 0, Skipped: 0, Time elapsed: 0.305000 sec
[junitlauncher] Running org.apache.poi.xssf.model.TestCommentsTable
[junitlauncher]
[junitlauncher] Running org.apache.poi.xssf.model.TestCommentsTable
[junitlauncher] Tests run: 7, Failures: 0, Aborted: 0, Skipped: 0, Time elapsed: 0.094000 sec
[junitlauncher] Running org.apache.poi.xssf.model.TestExternalLinksTable
[junitlauncher]
[junitlauncher] Running org.apache.poi.xssf.model.TestExternalLinksTable
[junitlauncher] Tests run: 4, Failures: 0, Aborted: 0, Skipped: 0, Time elapsed: 0.056000 sec
[junitlauncher] Running org.apache.poi.xssf.model.TestMapInfo
[junitlauncher]
[junitlauncher] Running org.apache.poi.xssf.model.TestMapInfo
[junitlauncher] Tests run: 1, Failures: 0, Aborted: 0, Skipped: 0, Time elapsed: 0.012000 sec
[junitlauncher] Running org.apache.poi.xssf.model.TestSharedStringsTable
[junitlauncher]
[junitlauncher] Running org.apache.poi.xssf.model.TestSharedStringsTable
[junitlauncher] Tests run: 4, Failures: 0, Aborted: 0, Skipped: 0, Time elapsed: 0.069000 sec
[junitlauncher] Running org.apache.poi.xssf.model.TestStylesTable
[junitlauncher]
[junitlauncher] Running org.apache.poi.xssf.model.TestStylesTable
[junitlauncher] Tests run: 13, Failures: 0, Aborted: 0, Skipped: 0, Time elapsed: 0.208000 sec
[junitlauncher] Running org.apache.poi.xssf.model.TestThemesTable
[junitlauncher]
[junitlauncher] Running org.apache.poi.xssf.model.TestThemesTable
[junitlauncher] Tests run: 3, Failures: 0, Aborted: 0, Skipped: 0, Time elapsed: 0.084000 sec
[junitlauncher] Running org.apache.poi.xssf.streaming.TestAutoSizeColumnTracker
[junitlauncher]
[junitlauncher] Running org.apache.poi.xssf.streaming.TestAutoSizeColumnTracker
[junitlauncher] Tests run: 8, Failures: 0, Aborted: 0, Skipped: 0, Time elapsed: 0.030000 sec
[junitlauncher] Running org.apache.poi.xssf.streaming.TestDeferredSXSSFWorkbook
[junitlauncher]
[junitlauncher] Running org.apache.poi.xssf.streaming.TestDeferredSXSSFWorkbook
[junitlauncher] Tests run: 28, Failures: 0, Aborted: 0, Skipped: 0, Time elapsed: 0.632000 sec
[junitlauncher] Running org.apache.poi.xssf.streaming.TestOutlining
[junitlauncher]
[junitlauncher] Running org.apache.poi.xssf.streaming.TestOutlining
[junitlauncher] Tests run: 6, Failures: 0, Aborted: 0, Skipped: 0, Time elapsed: 0.016000 sec
[junitlauncher] Running org.apache.poi.xssf.streaming.TestSXSSFCell
[junitlauncher]
[junitlauncher] Running org.apache.poi.xssf.streaming.TestSXSSFCell
[junitlauncher] Tests run: 54, Failures: 0, Aborted: 0, Skipped: 0, Time elapsed: 0.748000 sec
[junitlauncher] Running org.apache.poi.xssf.streaming.TestSXSSFDataValidation
[junitlauncher]
[junitlauncher] Running org.apache.poi.xssf.streaming.TestSXSSFDataValidation
[junitlauncher] Tests run: 2, Failures: 0, Aborted: 0, Skipped: 0, Time elapsed: 0.128000 sec
[junitlauncher] Running org.apache.poi.xssf.streaming.TestSXSSFEvaluationSheet
[junitlauncher]
[junitlauncher] Running org.apache.poi.xssf.streaming.TestSXSSFEvaluationSheet
[junitlauncher] Tests run: 1, Failures: 0, Aborted: 0, Skipped: 0, Time elapsed: 0.005000 sec
[junitlauncher] Running org.apache.poi.xssf.streaming.TestSXSSFFormulaEvaluation
[junitlauncher]
[junitlauncher] Running org.apache.poi.xssf.streaming.TestSXSSFFormulaEvaluation
[junitlauncher] Tests run: 28, Failures: 0, Aborted: 0, Skipped: 0, Time elapsed: 0.630000 sec
[junitlauncher] Running org.apache.poi.xssf.streaming.TestSXSSFHyperlink
[junitlauncher]
[junitlauncher] Running org.apache.poi.xssf.streaming.TestSXSSFHyperlink
[junitlauncher] Tests run: 2, Failures: 0, Aborted: 0, Skipped: 0, Time elapsed: 0.022000 sec
[junitlauncher] Running org.apache.poi.xssf.streaming.TestSXSSFRow
[junitlauncher]
[junitlauncher] Running org.apache.poi.xssf.streaming.TestSXSSFRow
[junitlauncher] Tests run: 12, Failures: 0, Aborted: 0, Skipped: 0, Time elapsed: 0.147000 sec
[junitlauncher] Running org.apache.poi.xssf.streaming.TestSXSSFSheet
[junitlauncher]
[junitlauncher] Running org.apache.poi.xssf.streaming.TestSXSSFSheet
[junitlauncher] Tests run: 49, Failures: 0, Aborted: 0, Skipped: 0, Time elapsed: 0.752000 sec
[junitlauncher] Running org.apache.poi.xssf.streaming.TestSXSSFSheetAutoSizeColumn
[junitlauncher]
[junitlauncher] Running org.apache.poi.xssf.streaming.TestSXSSFSheetAutoSizeColumn
[junitlauncher] Tests run: 25, Failures: 0, Aborted: 0, Skipped: 0, Time elapsed: 0.107000 sec
[junitlauncher] Running org.apache.poi.xssf.streaming.TestSXSSFUnicodeSurrogates
[junitlauncher]
[junitlauncher] Running org.apache.poi.xssf.streaming.TestSXSSFUnicodeSurrogates
[junitlauncher] Tests run: 1, Failures: 0, Aborted: 0, Skipped: 0, Time elapsed: 0.016000 sec
[junitlauncher] Running org.apache.poi.xssf.streaming.TestSXSSFWorkbook
[junitlauncher]
[junitlauncher] Running org.apache.poi.xssf.streaming.TestSXSSFWorkbook
[junitlauncher] Tests run: 37, Failures: 0, Aborted: 0, Skipped: 3, Time elapsed: 0.749000 sec
[junitlauncher] Running org.apache.poi.xssf.streaming.TestSXSSFWorkbookWithCustomZipEntrySource
[junitlauncher]
[junitlauncher] Running org.apache.poi.xssf.streaming.TestSXSSFWorkbookWithCustomZipEntrySource
[junitlauncher] Tests run: 3, Failures: 0, Aborted: 0, Skipped: 0, Time elapsed: 0.049000 sec
[junitlauncher] Running org.apache.poi.xssf.streaming.TestSheetDataWriter
[junitlauncher]
[junitlauncher] Running org.apache.poi.xssf.streaming.TestSheetDataWriter
[junitlauncher] Tests run: 3, Failures: 0, Aborted: 0, Skipped: 0, Time elapsed: 0.002000 sec
[junitlauncher] Running org.apache.poi.xssf.usermodel.TestFormulaEvaluatorOnXSSF
[junitlauncher]
[junitlauncher] Running org.apache.poi.xssf.usermodel.TestFormulaEvaluatorOnXSSF
[junitlauncher] Aborted: [7] IntersectionEval, 46, 47
[junitlauncher] Aborted: [12] PercentEval, 66, 67
[junitlauncher] Aborted: [14] RangeEval, 74, 75
[junitlauncher] Aborted: [23] Addbar, 115, 116
[junitlauncher] Aborted: [24] Addcommand, 119, 120
[junitlauncher] Aborted: [25] Addmenu, 123, 124
[junitlauncher] Aborted: [27] Addtoolbar, 131, 132
[junitlauncher] Aborted: [29] Apptitle, 139, 140
[junitlauncher] Aborted: [40] Averagea, 183, 184
[junitlauncher] Aborted: [44] Call, 199, 200
[junitlauncher] Aborted: [45] Caller, 203, 204
[junitlauncher] Aborted: [50] Checkcommand, 223, 224
[junitlauncher] Aborted: [57] Column, 251, 252
[junitlauncher] Aborted: [70] Createobject, 303, 304
[junitlauncher] Aborted: [73] Customundo, 315, 316
[junitlauncher] Aborted: [74] Date, 319, 320
[junitlauncher] Aborted: [80] Days360, 343, 344
[junitlauncher] Aborted: [81] Db, 347, 348
[junitlauncher] Aborted: [82] Dbcs, 351, 352
[junitlauncher] Aborted: [87] Deletebar, 371, 372
[junitlauncher] Aborted: [88] Deletecommand, 375, 376
[junitlauncher] Aborted: [89] Deletemenu, 379, 380
[junitlauncher] Aborted: [90] Deletetoolbar, 383, 384
[junitlauncher] Aborted: [93] Dget, 395, 396
[junitlauncher] Aborted: [94] Dialogbox, 399, 400
[junitlauncher] Aborted: [98] Documents, 415, 416
[junitlauncher] Aborted: [107] Enablecommand, 451, 452
[junitlauncher] Aborted: [108] Enabletool, 455, 456
[junitlauncher] Aborted: [114] Exec, 479, 480
[junitlauncher] Aborted: [115] Execute, 483, 484
[junitlauncher] Aborted: [118] Externalflag, 495, 496
[junitlauncher] Aborted: [119] Fact, 499, 500
[junitlauncher] Aborted: [121] Fclose, 507, 508
[junitlauncher] Aborted: [123] Files, 515, 516
[junitlauncher] Aborted: [131] Fopen, 547, 548
[junitlauncher] Aborted: [135] Fread, 563, 564
[junitlauncher] Aborted: [136] Freadln, 567, 568
[junitlauncher] Aborted: [138] Fsize, 575, 576
[junitlauncher] Aborted: [147] Getbar, 611, 612
[junitlauncher] Aborted: [148] Getcell, 615, 616
[junitlauncher] Aborted: [149] Getchartitem, 619, 620
[junitlauncher] Aborted: [150] Getdef, 623, 624
[junitlauncher] Aborted: [151] Getdocument, 627, 628
[junitlauncher] Aborted: [152] Getformula, 631, 632
[junitlauncher] Aborted: [153] Getlinkinfo, 635, 636
[junitlauncher] Aborted: [154] Getmovie, 639, 640
[junitlauncher] Aborted: [155] Getname, 643, 644
[junitlauncher] Aborted: [156] Getnote, 647, 648
[junitlauncher] Aborted: [157] Getobject, 651, 652
[junitlauncher] Aborted: [162] Gettool, 671, 672
[junitlauncher] Aborted: [163] Gettoolbar, 675, 676
[junitlauncher] Aborted: [164] Getwindow, 679, 680
[junitlauncher] Aborted: [165] Getworkbook, 683, 684
[junitlauncher] Aborted: [166] Getworkspace, 687, 688
[junitlauncher] Aborted: [230] Moviecommand, 943, 944
[junitlauncher] Aborted: [247] Opendialog, 1011, 1012
[junitlauncher] Aborted: [248] Optionslistsget, 1015, 1016
[junitlauncher] Aborted: [250] Pause, 1023, 1024
[junitlauncher] Aborted: [255] Phonetic, 1043, 1044
[junitlauncher] Aborted: [257] Pivotadddata, 1051, 1052
[junitlauncher] Aborted: [260] Poke, 1063, 1064
[junitlauncher] Aborted: [263] Presstool, 1075, 1076
[junitlauncher] Aborted: [270] Rand, 1103, 1104
[junitlauncher] Aborted: [273] Reftext, 1115, 1116
[junitlauncher] Aborted: [274] Register, 1119, 1120
[junitlauncher] Aborted: [275] Registerid, 1123, 1124
[junitlauncher] Aborted: [276] Relref, 1127, 1128
[junitlauncher] Aborted: [277] Renamecommand, 1131, 1132
[junitlauncher] Aborted: [282] Resettoolbar, 1151, 1152
[junitlauncher] Aborted: [283] Restart, 1155, 1156
[junitlauncher] Aborted: [285] Resume, 1163, 1164
[junitlauncher] Aborted: [292] Row, 1191, 1192
[junitlauncher] Aborted: [295] Savedialog, 1203, 1204
[junitlauncher] Aborted: [296] Savetoolbar, 1207, 1208
[junitlauncher] Aborted: [297] Scenarioget, 1211, 1212
[junitlauncher] Aborted: [303] Setname, 1235, 1236
[junitlauncher] Aborted: [304] Setvalue, 1239, 1240
[junitlauncher] Aborted: [305] Showbar, 1243, 1244
[junitlauncher] Aborted: [313] Spellingcheck, 1275, 1276
[junitlauncher] Aborted: [322] Substitute, 1311, 1312
[junitlauncher] Aborted: [336] Terminate, 1367, 1368
[junitlauncher] Aborted: [338] Textbox, 1375, 1376
[junitlauncher] Aborted: [339] Textref, 1379, 1380
[junitlauncher] Aborted: [340] Time, 1383, 1384
[junitlauncher] Aborted: [346] Trim, 1407, 1408
[junitlauncher] Aborted: [352] Unregister, 1431, 1432
[junitlauncher] Aborted: [355] Value, 1443, 1444
[junitlauncher] Aborted: [361] Viewget, 1467, 1468
[junitlauncher] Aborted: [366] Windows, 1487, 1488
[junitlauncher] Aborted: [367] Windowtitle, 1491, 1492
[junitlauncher] Tests run: 369, Failures: 0, Aborted: 90, Skipped: 0, Time elapsed: 3.830000 sec
[junitlauncher] Running org.apache.poi.xssf.usermodel.TestMatrixFormulasFromXMLSpreadsheet
[junitlauncher]
[junitlauncher] Running org.apache.poi.xssf.usermodel.TestMatrixFormulasFromXMLSpreadsheet
[junitlauncher] Tests run: 34, Failures: 0, Aborted: 0, Skipped: 0, Time elapsed: 0.215000 sec
[junitlauncher] Running org.apache.poi.xssf.usermodel.TestMissingWorkbookOnXSSF
[junitlauncher]
[junitlauncher] Running org.apache.poi.xssf.usermodel.TestMissingWorkbookOnXSSF
[junitlauncher] Tests run: 3, Failures: 0, Aborted: 0, Skipped: 0, Time elapsed: 0.074000 sec
[junitlauncher] Running org.apache.poi.xssf.usermodel.TestMultiSheetFormulaEvaluatorOnXSSF
[junitlauncher]
[junitlauncher] Running org.apache.poi.xssf.usermodel.TestMultiSheetFormulaEvaluatorOnXSSF
[junitlauncher] Tests run: 2, Failures: 0, Aborted: 0, Skipped: 0, Time elapsed: 0.018000 sec
[junitlauncher] Running org.apache.poi.xssf.usermodel.TestSXSSFBugs
[junitlauncher]
[junitlauncher] Running org.apache.poi.xssf.usermodel.TestSXSSFBugs
[junitlauncher] Aborted: bug59393_commentsCanHaveSameAnchor()
[junitlauncher] Tests run: 39, Failures: 0, Aborted: 1, Skipped: 2, Time elapsed: 4.078000 sec
[junitlauncher] Running org.apache.poi.xssf.usermodel.TestSXSSFSheetAutosizeColumn
[junitlauncher]
[junitlauncher] Running org.apache.poi.xssf.usermodel.TestSXSSFSheetAutosizeColumn
[junitlauncher] Tests run: 8, Failures: 0, Aborted: 0, Skipped: 0, Time elapsed: 0.042000 sec
[junitlauncher] Running org.apache.poi.xssf.usermodel.TestSheetHiding
[junitlauncher]
[junitlauncher] Running org.apache.poi.xssf.usermodel.TestSheetHiding
[junitlauncher] Tests run: 5, Failures: 0, Aborted: 0, Skipped: 0, Time elapsed: 0.076000 sec
[junitlauncher] Running org.apache.poi.xssf.usermodel.TestTableStyles
[junitlauncher]
[junitlauncher] Running org.apache.poi.xssf.usermodel.TestTableStyles
[junitlauncher] Tests run: 2, Failures: 0, Aborted: 0, Skipped: 0, Time elapsed: 0.303000 sec
[junitlauncher] Running org.apache.poi.xssf.usermodel.TestXSSFBugs
[junitlauncher]
[junitlauncher] Running org.apache.poi.xssf.usermodel.TestXSSFBugs
[junitlauncher] Aborted: bug59393_commentsCanHaveSameAnchor()
[junitlauncher] Failed: testBug56527()
[junitlauncher] Tests run: 172, Failures: 1, Aborted: 1, Skipped: 7, Time elapsed: 13.625000 sec
BUILD FAILED
<https://ci-builds.apache.org/job/POI/job/POI-DSL-1.16/ws/build.xml>:1795: The following error occurred while executing this line:
<https://ci-builds.apache.org/job/POI/job/POI-DSL-1.16/ws/build.xml>:1767: The following error occurred while executing this line:
<https://ci-builds.apache.org/job/POI/job/POI-DSL-1.16/ws/build.xml>:1383: Some test(s) have failure(s)
Total time: 12 minutes 40 seconds
Build step 'Invoke Ant' marked build as failure
[SpotBugs] Skipping execution of recorder since overall result is 'FAILURE'
Archiving artifacts
Skipping publisher since build result is FAILURE
Recording test results
[Checks API] No suitable checks publisher found.
---------------------------------------------------------------------
To unsubscribe, e-mail: dev-unsubscribe@poi.apache.org
For additional commands, e-mail: dev-help@poi.apache.org