You are viewing a plain text version of this content. The canonical link for it is here.
Posted to builds@beam.apache.org by Apache Jenkins Server <je...@builds.apache.org> on 2019/03/02 00:54:13 UTC
Build failed in Jenkins: beam_PostCommit_Python_Verify #7548
See <https://builds.apache.org/job/beam_PostCommit_Python_Verify/7548/display/redirect>
------------------------------------------
[...truncated 311.63 KB...]
"label": "Transform Function",
"namespace": "apache_beam.transforms.core.CallableWrapperDoFn",
"type": "STRING",
"value": "format_result"
},
{
"key": "fn",
"label": "Transform Function",
"namespace": "apache_beam.transforms.core.ParDo",
"shortValue": "CallableWrapperDoFn",
"type": "STRING",
"value": "apache_beam.transforms.core.CallableWrapperDoFn"
}
],
"non_parallel_inputs": {},
"output_info": [
{
"encoding": {
"@type": "kind:windowed_value",
"component_encodings": [
{
"@type": "FastPrimitivesCoder$eNprYEpOLEhMzkiNT0pNzNVLzk9JLSqGUlxuicUlAUWZuZklmWWpxc4gQa5CBs3GQsbaQqZQ/vi0xJycpMTk7Hiw+kJmPEYFZCZn56RCjWABGsFaW8iWVJykBwDlGS3/",
"component_encodings": [
{
"@type": "FastPrimitivesCoder$eNprYEpOLEhMzkiNT0pNzNVLzk9JLSqGUlxuicUlAUWZuZklmWWpxc4gQa5CBs3GQsbaQqZQ/vi0xJycpMTk7Hiw+kJmPEYFZCZn56RCjWABGsFaW8iWVJykBwDlGS3/",
"component_encodings": [],
"pipeline_proto_coder_id": "ref_Coder_FastPrimitivesCoder_3"
},
{
"@type": "FastPrimitivesCoder$eNprYEpOLEhMzkiNT0pNzNVLzk9JLSqGUlxuicUlAUWZuZklmWWpxc4gQa5CBs3GQsbaQqZQ/vi0xJycpMTk7Hiw+kJmPEYFZCZn56RCjWABGsFaW8iWVJykBwDlGS3/",
"component_encodings": [],
"pipeline_proto_coder_id": "ref_Coder_FastPrimitivesCoder_3"
}
],
"is_pair_like": true,
"pipeline_proto_coder_id": "ref_Coder_FastPrimitivesCoder_3"
},
{
"@type": "kind:interval_window"
}
],
"is_wrapper": true
},
"output_name": "out",
"user_name": "format.out"
}
],
"parallel_input": {
"@type": "OutputReference",
"output_name": "out",
"step_name": "s7"
},
"serialized_fn": "ref_AppliedPTransform_format_10",
"user_name": "format"
}
},
{
"kind": "ParallelDo",
"name": "s9",
"properties": {
"display_data": [
{
"key": "fn",
"label": "Transform Function",
"namespace": "apache_beam.transforms.core.CallableWrapperDoFn",
"type": "STRING",
"value": "<lambda>"
},
{
"key": "fn",
"label": "Transform Function",
"namespace": "apache_beam.transforms.core.ParDo",
"shortValue": "CallableWrapperDoFn",
"type": "STRING",
"value": "apache_beam.transforms.core.CallableWrapperDoFn"
}
],
"non_parallel_inputs": {},
"output_info": [
{
"encoding": {
"@type": "kind:windowed_value",
"component_encodings": [
{
"@type": "kind:bytes"
},
{
"@type": "kind:interval_window"
}
],
"is_wrapper": true
},
"output_name": "out",
"user_name": "encode.out"
}
],
"parallel_input": {
"@type": "OutputReference",
"output_name": "out",
"step_name": "s8"
},
"serialized_fn": "ref_AppliedPTransform_encode_11",
"user_name": "encode"
}
},
{
"kind": "ParallelWrite",
"name": "s10",
"properties": {
"display_data": [],
"encoding": {
"@type": "kind:windowed_value",
"component_encodings": [
{
"@type": "kind:bytes"
},
{
"@type": "kind:global_window"
}
],
"is_wrapper": true
},
"format": "pubsub",
"parallel_input": {
"@type": "OutputReference",
"output_name": "out",
"step_name": "s9"
},
"pubsub_topic": "projects/apache-beam-testing/topics/wc_topic_outputeb2abcec-3a7e-488f-98b5-ba233df9854a",
"user_name": "WriteToPubSub/Write/NativeWrite"
}
}
],
"type": "JOB_TYPE_STREAMING"
}
root: INFO: Create job: <Job
createTime: u'2019-03-02T00:12:14.906631Z'
currentStateTime: u'1970-01-01T00:00:00Z'
id: u'2019-03-01_16_12_14-13027696071661498384'
location: u'us-central1'
name: u'beamapp-jenkins-0302001206-287609'
projectId: u'apache-beam-testing'
stageStates: []
startTime: u'2019-03-02T00:12:14.906631Z'
steps: []
tempFiles: []
type: TypeValueValuesEnum(JOB_TYPE_STREAMING, 2)>
root: INFO: Created job with id: [2019-03-01_16_12_14-13027696071661498384]
root: INFO: To access the Dataflow monitoring console, please navigate to https://console.cloud.google.com/dataflow/jobsDetail/locations/us-central1/jobs/2019-03-01_16_12_14-13027696071661498384?project=apache-beam-testing
root: INFO: Job 2019-03-01_16_12_14-13027696071661498384 is in state JOB_STATE_RUNNING
root: INFO: 2019-03-02T00:12:19.967Z: JOB_MESSAGE_DETAILED: Checking permissions granted to controller Service Account.
root: INFO: 2019-03-02T00:12:21.235Z: JOB_MESSAGE_BASIC: Worker configuration: n1-standard-4 in us-central1-f.
root: INFO: 2019-03-02T00:12:21.693Z: JOB_MESSAGE_DETAILED: Expanding CollectionToSingleton operations into optimizable parts.
root: INFO: 2019-03-02T00:12:21.729Z: JOB_MESSAGE_DETAILED: Expanding CoGroupByKey operations into optimizable parts.
root: INFO: 2019-03-02T00:12:21.783Z: JOB_MESSAGE_DETAILED: Expanding SplittableProcessKeyed operations into optimizable parts.
root: INFO: 2019-03-02T00:12:21.788Z: JOB_MESSAGE_DETAILED: Expanding GroupByKey operations into streaming Read/Write steps
root: INFO: 2019-03-02T00:12:21.799Z: JOB_MESSAGE_DEBUG: Annotating graph with Autotuner information.
root: INFO: 2019-03-02T00:12:21.841Z: JOB_MESSAGE_DETAILED: Fusing adjacent ParDo, Read, Write, and Flatten operations
root: INFO: 2019-03-02T00:12:21.845Z: JOB_MESSAGE_DETAILED: Fusing consumer decode into ReadFromPubSub/Read
root: INFO: 2019-03-02T00:12:21.851Z: JOB_MESSAGE_DETAILED: Fusing consumer pair_with_one into split
root: INFO: 2019-03-02T00:12:21.862Z: JOB_MESSAGE_DETAILED: Fusing consumer count into group/MergeBuckets
root: INFO: 2019-03-02T00:12:21.870Z: JOB_MESSAGE_DETAILED: Fusing consumer WriteToPubSub/Write/NativeWrite into encode
root: INFO: 2019-03-02T00:12:21.874Z: JOB_MESSAGE_DETAILED: Fusing consumer encode into format
root: INFO: 2019-03-02T00:12:21.883Z: JOB_MESSAGE_DETAILED: Fusing consumer group/MergeBuckets into group/ReadStream
root: INFO: 2019-03-02T00:12:21.900Z: JOB_MESSAGE_DETAILED: Fusing consumer format into count
root: INFO: 2019-03-02T00:12:21.907Z: JOB_MESSAGE_DETAILED: Fusing consumer group/WriteStream into WindowInto(WindowIntoFn)
root: INFO: 2019-03-02T00:12:21.925Z: JOB_MESSAGE_DETAILED: Fusing consumer split into decode
root: INFO: 2019-03-02T00:12:21.935Z: JOB_MESSAGE_DETAILED: Fusing consumer WindowInto(WindowIntoFn) into pair_with_one
root: INFO: 2019-03-02T00:12:21.970Z: JOB_MESSAGE_DEBUG: Adding StepResource setup and teardown to workflow graph.
root: INFO: 2019-03-02T00:12:22.031Z: JOB_MESSAGE_DEBUG: Adding workflow start and stop steps.
root: INFO: 2019-03-02T00:12:22.082Z: JOB_MESSAGE_DEBUG: Assigning stage ids.
root: INFO: 2019-03-02T00:12:22.401Z: JOB_MESSAGE_DEBUG: Executing wait step start2
root: INFO: 2019-03-02T00:12:22.438Z: JOB_MESSAGE_DEBUG: Starting worker pool setup.
root: INFO: 2019-03-02T00:12:22.447Z: JOB_MESSAGE_BASIC: Starting 1 workers...
root: INFO: 2019-03-02T00:12:26.397Z: JOB_MESSAGE_BASIC: Executing operation ReadFromPubSub/Read+decode+split+pair_with_one+WindowInto(WindowIntoFn)+group/WriteStream
root: INFO: 2019-03-02T00:12:26.398Z: JOB_MESSAGE_BASIC: Executing operation group/ReadStream+group/MergeBuckets+count+format+encode+WriteToPubSub/Write/NativeWrite
root: INFO: 2019-03-02T00:13:24.492Z: JOB_MESSAGE_DETAILED: Workers have started successfully.
root: INFO: 2019-03-02T00:13:35.661Z: JOB_MESSAGE_DEBUG: Executing input step topology_init_attach_disk_input_step
root: WARNING: Timing out on waiting for job 2019-03-01_16_12_14-13027696071661498384 after 183 seconds
google.auth.transport._http_client: DEBUG: Making request: GET http://169.254.169.254
google.auth.transport._http_client: DEBUG: Making request: GET http://metadata.google.internal/computeMetadata/v1/project/project-id
google.auth.transport.requests: DEBUG: Making request: GET http://metadata.google.internal/computeMetadata/v1/instance/service-accounts/default/?recursive=true
urllib3.connectionpool: DEBUG: Starting new HTTP connection (1): metadata.google.internal:80
urllib3.connectionpool: DEBUG: http://metadata.google.internal:80 "GET /computeMetadata/v1/instance/service-accounts/default/?recursive=true HTTP/1.1" 200 144
google.auth.transport.requests: DEBUG: Making request: GET http://metadata.google.internal/computeMetadata/v1/instance/service-accounts/844138762903-compute@developer.gserviceaccount.com/token
urllib3.connectionpool: DEBUG: http://metadata.google.internal:80 "GET /computeMetadata/v1/instance/service-accounts/844138762903-compute@developer.gserviceaccount.com/token HTTP/1.1" 200 176
--------------------- >> end captured logging << ---------------------
----------------------------------------------------------------------
XML: <https://builds.apache.org/job/beam_PostCommit_Python_Verify/ws/src/sdks/python/nosetests.xml>
----------------------------------------------------------------------
Ran 28 tests in 2952.298s
FAILED (SKIP=1, errors=1)
Found: https://console.cloud.google.com/dataflow/jobsDetail/locations/us-central1/jobs/2019-03-01_16_05_12-4829220433918080409?project=apache-beam-testing.
Found: https://console.cloud.google.com/dataflow/jobsDetail/locations/us-central1/jobs/2019-03-01_16_19_57-775587859428624609?project=apache-beam-testing.
Found: https://console.cloud.google.com/dataflow/jobsDetail/locations/us-central1/jobs/2019-03-01_16_05_10-4675896364084593188?project=apache-beam-testing.
Found: https://console.cloud.google.com/dataflow/jobsDetail/locations/us-central1/jobs/2019-03-01_16_13_17-1429229896428250796?project=apache-beam-testing.
Found: https://console.cloud.google.com/dataflow/jobsDetail/locations/us-central1/jobs/2019-03-01_16_20_17-146034695496012337?project=apache-beam-testing.
Found: https://console.cloud.google.com/dataflow/jobsDetail/locations/us-central1/jobs/2019-03-01_16_26_32-1194685025422609110?project=apache-beam-testing.
Found: https://console.cloud.google.com/dataflow/jobsDetail/locations/us-central1/jobs/2019-03-01_16_33_22-17176027455344483613?project=apache-beam-testing.
Found: https://console.cloud.google.com/dataflow/jobsDetail/locations/us-central1/jobs/2019-03-01_16_40_12-1989622223956140072?project=apache-beam-testing.
Found: https://console.cloud.google.com/dataflow/jobsDetail/locations/us-central1/jobs/2019-03-01_16_47_10-17786358701141625920?project=apache-beam-testing.
Found: https://console.cloud.google.com/dataflow/jobsDetail/locations/us-central1/jobs/2019-03-01_16_05_12-16604741126201546537?project=apache-beam-testing.
Found: https://console.cloud.google.com/dataflow/jobsDetail/locations/us-central1/jobs/2019-03-01_16_05_13-7431252010499474286?project=apache-beam-testing.
Found: https://console.cloud.google.com/dataflow/jobsDetail/locations/us-central1/jobs/2019-03-01_16_17_23-13855410181267372023?project=apache-beam-testing.
Found: https://console.cloud.google.com/dataflow/jobsDetail/locations/us-central1/jobs/2019-03-01_16_26_30-8782653607491606026?project=apache-beam-testing.
Found: https://console.cloud.google.com/dataflow/jobsDetail/locations/us-central1/jobs/2019-03-01_16_35_32-12846887807250093142?project=apache-beam-testing.
Found: https://console.cloud.google.com/dataflow/jobsDetail/locations/us-central1/jobs/2019-03-01_16_05_10-9233590123972163908?project=apache-beam-testing.
Found: https://console.cloud.google.com/dataflow/jobsDetail/locations/us-central1/jobs/2019-03-01_16_23_48-9756247406132788238?project=apache-beam-testing.
Found: https://console.cloud.google.com/dataflow/jobsDetail/locations/us-central1/jobs/2019-03-01_16_05_10-13523546464452780883?project=apache-beam-testing.
Found: https://console.cloud.google.com/dataflow/jobsDetail/locations/us-central1/jobs/2019-03-01_16_12_14-13027696071661498384?project=apache-beam-testing.
Found: https://console.cloud.google.com/dataflow/jobsDetail/locations/us-central1/jobs/2019-03-01_16_05_10-3304273268694911473?project=apache-beam-testing.
Found: https://console.cloud.google.com/dataflow/jobsDetail/locations/us-central1/jobs/2019-03-01_16_12_42-13811364547471939573?project=apache-beam-testing.
Found: https://console.cloud.google.com/dataflow/jobsDetail/locations/us-central1/jobs/2019-03-01_16_19_35-16293201522990243382?project=apache-beam-testing.
Found: https://console.cloud.google.com/dataflow/jobsDetail/locations/us-central1/jobs/2019-03-01_16_27_14-9542008010182795091?project=apache-beam-testing.
Found: https://console.cloud.google.com/dataflow/jobsDetail/locations/us-central1/jobs/2019-03-01_16_05_10-17546798416175676905?project=apache-beam-testing.
Found: https://console.cloud.google.com/dataflow/jobsDetail/locations/us-central1/jobs/2019-03-01_16_12_50-3187576520835936121?project=apache-beam-testing.
Found: https://console.cloud.google.com/dataflow/jobsDetail/locations/us-central1/jobs/2019-03-01_16_23_12-5838871945870590642?project=apache-beam-testing.
Found: https://console.cloud.google.com/dataflow/jobsDetail/locations/us-central1/jobs/2019-03-01_16_29_26-3095883093555890567?project=apache-beam-testing.
> Task :beam-sdks-python:postCommitIT FAILED
FAILURE: Build failed with an exception.
* Where:
Build file '<https://builds.apache.org/job/beam_PostCommit_Python_Verify/ws/src/sdks/python/build.gradle'> line: 278
* What went wrong:
Execution failed for task ':beam-sdks-python:postCommitIT'.
> Process 'command 'sh'' finished with non-zero exit value 1
* Try:
Run with --stacktrace option to get the stack trace. Run with --info or --debug option to get more log output. Run with --scan to get full insights.
* Get more help at https://help.gradle.org
Deprecated Gradle features were used in this build, making it incompatible with Gradle 6.0.
Use '--warning-mode all' to show the individual deprecation warnings.
See https://docs.gradle.org/5.2.1/userguide/command_line_interface.html#sec:command_line_warnings
BUILD FAILED in 53m 59s
6 actionable tasks: 6 executed
Publishing build scan...
https://gradle.com/s/nxmq7o72sy23u
Build step 'Invoke Gradle script' changed build result to FAILURE
Build step 'Invoke Gradle script' marked build as failure
---------------------------------------------------------------------
To unsubscribe, e-mail: builds-unsubscribe@beam.apache.org
For additional commands, e-mail: builds-help@beam.apache.org