You are viewing a plain text version of this content. The canonical link for it is here.
Posted to yarn-dev@hadoop.apache.org by Apache Jenkins Server <je...@builds.apache.org> on 2014/12/09 18:23:13 UTC

Failed: YARN-2571 PreCommit Build #6057

Jira: https://issues.apache.org/jira/browse/YARN-2571
Build: https://builds.apache.org/job/PreCommit-YARN-Build/6057/

###################################################################################
########################## LAST 60 LINES OF THE CONSOLE ###########################
[...truncated 3508 lines...]



{color:red}-1 overall{color}.  Here are the results of testing the latest attachment 
  http://issues.apache.org/jira/secure/attachment/12685837/YARN-2571-009.patch
  against trunk revision 82707b4.

    {color:green}+1 @author{color}.  The patch does not contain any @author tags.

    {color:green}+1 tests included{color}.  The patch appears to include 16 new or modified test files.

    {color:green}+1 javac{color}.  The applied patch does not increase the total number of javac compiler warnings.

    {color:green}+1 javadoc{color}.  There were no new javadoc warning messages.

    {color:green}+1 eclipse:eclipse{color}.  The patch built with eclipse:eclipse.

    {color:green}+1 findbugs{color}.  The patch does not introduce any new Findbugs (version 2.0.3) warnings.

    {color:green}+1 release audit{color}.  The applied patch does not increase the total number of release audit warnings.

    {color:green}+1 core tests{color}.  The patch passed unit tests in hadoop-yarn-project/hadoop-yarn/hadoop-yarn-registry hadoop-yarn-project/hadoop-yarn/hadoop-yarn-server/hadoop-yarn-server-common hadoop-yarn-project/hadoop-yarn/hadoop-yarn-server/hadoop-yarn-server-resourcemanager.

Test results: https://builds.apache.org/job/PreCommit-YARN-Build/6057//testReport/
Console output: https://builds.apache.org/job/PreCommit-YARN-Build/6057//console

This message is automatically generated.


======================================================================
======================================================================
    Adding comment to Jira.
======================================================================
======================================================================


Comment added.
93961c9cb04814197fbe9d16f53ccb85ceca4f9b logged out


======================================================================
======================================================================
    Finished build.
======================================================================
======================================================================


Build step 'Execute shell' marked build as failure
Archiving artifacts
Sending artifact delta relative to PreCommit-YARN-Build #6051
Archived 25 artifacts
Archive block size is 32768
Received 166 blocks and 3570236 bytes
Compression is 60.4%
Took 1.4 sec
[description-setter] Could not determine description.
Recording test results
Email was triggered for: Failure
Sending email for trigger: Failure



###################################################################################
############################## FAILED TESTS (if any) ##############################
All tests passed

Failed: YARN-2920 PreCommit Build #6059

Posted by Apache Jenkins Server <je...@builds.apache.org>.
Jira: https://issues.apache.org/jira/browse/YARN-2920
Build: https://builds.apache.org/job/PreCommit-YARN-Build/6059/

###################################################################################
########################## LAST 60 LINES OF THE CONSOLE ###########################
[...truncated 8085 lines...]

    {color:green}+1 @author{color}.  The patch does not contain any @author tags.

    {color:green}+1 tests included{color}.  The patch appears to include 1 new or modified test files.

    {color:green}+1 javac{color}.  The applied patch does not increase the total number of javac compiler warnings.

    {color:green}+1 javadoc{color}.  There were no new javadoc warning messages.

    {color:green}+1 eclipse:eclipse{color}.  The patch built with eclipse:eclipse.

    {color:green}+1 findbugs{color}.  The patch does not introduce any new Findbugs (version 2.0.3) warnings.

    {color:green}+1 release audit{color}.  The applied patch does not increase the total number of release audit warnings.

    {color:red}-1 core tests{color}.  The patch failed these unit tests in hadoop-hdfs-project/hadoop-hdfs:

                  org.apache.hadoop.hdfs.qjournal.TestSecureNNWithQJM

                                      The following test timeouts occurred in hadoop-hdfs-project/hadoop-hdfs:

org.apache.hadoop.hdfs.server.blockmanagement.TestDatanodeManager

Test results: https://builds.apache.org/job/PreCommit-YARN-Build/6059//testReport/
Console output: https://builds.apache.org/job/PreCommit-YARN-Build/6059//console

This message is automatically generated.


======================================================================
======================================================================
    Adding comment to Jira.
======================================================================
======================================================================


Comment added.
17c45500a3a15816b78ab2d9e832bf2773513a7f logged out


======================================================================
======================================================================
    Finished build.
======================================================================
======================================================================


Build step 'Execute shell' marked build as failure
Archiving artifacts
Sending artifact delta relative to PreCommit-YARN-Build #6051
Archived 19 artifacts
Archive block size is 32768
Received 0 blocks and 11217820 bytes
Compression is 0.0%
Took 2.6 sec
[description-setter] Could not determine description.
Recording test results
Email was triggered for: Failure
Sending email for trigger: Failure



###################################################################################
############################## FAILED TESTS (if any) ##############################
1 tests failed.
FAILED:  org.apache.hadoop.hdfs.qjournal.TestSecureNNWithQJM.testSecureMode

Error Message:
test timed out after 30000 milliseconds

Stack Trace:
java.lang.Exception: test timed out after 30000 milliseconds
	at java.net.SocketInputStream.socketRead0(Native Method)
	at java.net.SocketInputStream.read(SocketInputStream.java:152)
	at java.net.SocketInputStream.read(SocketInputStream.java:122)
	at sun.security.ssl.InputRecord.readFully(InputRecord.java:442)
	at sun.security.ssl.InputRecord.read(InputRecord.java:480)
	at sun.security.ssl.SSLSocketImpl.readRecord(SSLSocketImpl.java:927)
	at sun.security.ssl.SSLSocketImpl.readDataRecord(SSLSocketImpl.java:884)
	at sun.security.ssl.AppInputStream.read(AppInputStream.java:102)
	at java.io.BufferedInputStream.fill(BufferedInputStream.java:235)
	at java.io.BufferedInputStream.read1(BufferedInputStream.java:275)
	at java.io.BufferedInputStream.read(BufferedInputStream.java:334)
	at sun.net.www.http.HttpClient.parseHTTPHeader(HttpClient.java:687)
	at sun.net.www.http.HttpClient.parseHTTP(HttpClient.java:633)
	at sun.net.www.protocol.http.HttpURLConnection.getInputStream(HttpURLConnection.java:1323)
	at java.net.HttpURLConnection.getResponseCode(HttpURLConnection.java:468)
	at sun.net.www.protocol.https.HttpsURLConnectionImpl.getResponseCode(HttpsURLConnectionImpl.java:338)
	at org.apache.hadoop.hdfs.server.namenode.EditLogFileInputStream$URLLog$1.run(EditLogFileInputStream.java:466)
	at org.apache.hadoop.hdfs.server.namenode.EditLogFileInputStream$URLLog$1.run(EditLogFileInputStream.java:455)
	at java.security.AccessController.doPrivileged(Native Method)
	at javax.security.auth.Subject.doAs(Subject.java:415)
	at org.apache.hadoop.security.UserGroupInformation.doAs(UserGroupInformation.java:1669)
	at org.apache.hadoop.security.SecurityUtil.doAsUser(SecurityUtil.java:447)
	at org.apache.hadoop.security.SecurityUtil.doAsCurrentUser(SecurityUtil.java:441)
	at org.apache.hadoop.hdfs.server.namenode.EditLogFileInputStream$URLLog.getInputStream(EditLogFileInputStream.java:454)
	at org.apache.hadoop.hdfs.server.namenode.EditLogFileInputStream.init(EditLogFileInputStream.java:140)
	at org.apache.hadoop.hdfs.server.namenode.EditLogFileInputStream.nextOpImpl(EditLogFileInputStream.java:191)
	at org.apache.hadoop.hdfs.server.namenode.EditLogFileInputStream.nextOp(EditLogFileInputStream.java:249)
	at org.apache.hadoop.hdfs.server.namenode.EditLogInputStream.readOp(EditLogInputStream.java:85)
	at org.apache.hadoop.hdfs.server.namenode.EditLogInputStream.skipUntil(EditLogInputStream.java:151)
	at org.apache.hadoop.hdfs.server.namenode.RedundantEditLogInputStream.nextOp(RedundantEditLogInputStream.java:178)
	at org.apache.hadoop.hdfs.server.namenode.EditLogInputStream.readOp(EditLogInputStream.java:85)
	at org.apache.hadoop.hdfs.server.namenode.EditLogInputStream.skipUntil(EditLogInputStream.java:151)
	at org.apache.hadoop.hdfs.server.namenode.RedundantEditLogInputStream.nextOp(RedundantEditLogInputStream.java:178)
	at org.apache.hadoop.hdfs.server.namenode.EditLogInputStream.readOp(EditLogInputStream.java:85)
	at org.apache.hadoop.hdfs.server.namenode.FSEditLogLoader.loadEditRecords(FSEditLogLoader.java:186)
	at org.apache.hadoop.hdfs.server.namenode.FSEditLogLoader.loadFSEdits(FSEditLogLoader.java:139)
	at org.apache.hadoop.hdfs.server.namenode.FSImage.loadEdits(FSImage.java:819)
	at org.apache.hadoop.hdfs.server.namenode.FSImage.loadFSImage(FSImage.java:674)
	at org.apache.hadoop.hdfs.server.namenode.FSImage.recoverTransitionRead(FSImage.java:281)
	at org.apache.hadoop.hdfs.server.namenode.FSNamesystem.loadFSImage(FSNamesystem.java:982)
	at org.apache.hadoop.hdfs.server.namenode.FSNamesystem.loadFromDisk(FSNamesystem.java:690)
	at org.apache.hadoop.hdfs.server.namenode.NameNode.loadNamesystem(NameNode.java:537)
	at org.apache.hadoop.hdfs.server.namenode.NameNode.initialize(NameNode.java:596)
	at org.apache.hadoop.hdfs.server.namenode.NameNode.<init>(NameNode.java:763)
	at org.apache.hadoop.hdfs.server.namenode.NameNode.<init>(NameNode.java:747)
	at org.apache.hadoop.hdfs.server.namenode.NameNode.createNameNode(NameNode.java:1443)
	at org.apache.hadoop.hdfs.MiniDFSCluster.restartNameNode(MiniDFSCluster.java:1815)
	at org.apache.hadoop.hdfs.MiniDFSCluster.restartNameNode(MiniDFSCluster.java:1780)
	at org.apache.hadoop.hdfs.qjournal.TestSecureNNWithQJM.restartNameNode(TestSecureNNWithQJM.java:197)
	at org.apache.hadoop.hdfs.qjournal.TestSecureNNWithQJM.doNNWithQJMTest(TestSecureNNWithQJM.java:185)
	at org.apache.hadoop.hdfs.qjournal.TestSecureNNWithQJM.testSecureMode(TestSecureNNWithQJM.java:159)



Failed: YARN-2930 PreCommit Build #6058

Posted by Apache Jenkins Server <je...@builds.apache.org>.
Jira: https://issues.apache.org/jira/browse/YARN-2930
Build: https://builds.apache.org/job/PreCommit-YARN-Build/6058/

###################################################################################
########################## LAST 60 LINES OF THE CONSOLE ###########################
[...truncated 3318 lines...]
{color:red}-1 overall{color}.  Here are the results of testing the latest attachment 
  http://issues.apache.org/jira/secure/attachment/12686042/YARN-2930.2.patch
  against trunk revision 82707b4.

    {color:green}+1 @author{color}.  The patch does not contain any @author tags.

    {color:green}+1 tests included{color}.  The patch appears to include 1 new or modified test files.

    {color:green}+1 javac{color}.  The applied patch does not increase the total number of javac compiler warnings.

    {color:green}+1 javadoc{color}.  There were no new javadoc warning messages.

    {color:green}+1 eclipse:eclipse{color}.  The patch built with eclipse:eclipse.

    {color:green}+1 findbugs{color}.  The patch does not introduce any new Findbugs (version 2.0.3) warnings.

    {color:green}+1 release audit{color}.  The applied patch does not increase the total number of release audit warnings.

    {color:red}-1 core tests{color}.  The patch failed these unit tests in hadoop-yarn-project/hadoop-yarn/hadoop-yarn-server/hadoop-yarn-server-resourcemanager:

                  org.apache.hadoop.yarn.server.resourcemanager.scheduler.fair.TestFairScheduler
                  org.apache.hadoop.yarn.server.resourcemanager.TestWorkPreservingRMRestart

Test results: https://builds.apache.org/job/PreCommit-YARN-Build/6058//testReport/
Console output: https://builds.apache.org/job/PreCommit-YARN-Build/6058//console

This message is automatically generated.


======================================================================
======================================================================
    Adding comment to Jira.
======================================================================
======================================================================


Comment added.
08201019b2ae70e91c6adc38cbdba377fbbcd915 logged out


======================================================================
======================================================================
    Finished build.
======================================================================
======================================================================


Build step 'Execute shell' marked build as failure
Archiving artifacts
Sending artifact delta relative to PreCommit-YARN-Build #6051
Archived 15 artifacts
Archive block size is 32768
Received 175 blocks and 3074847 bytes
Compression is 65.1%
Took 1.3 sec
[description-setter] Could not determine description.
Recording test results
Email was triggered for: Failure
Sending email for trigger: Failure



###################################################################################
############################## FAILED TESTS (if any) ##############################
2 tests failed.
REGRESSION:  org.apache.hadoop.yarn.server.resourcemanager.TestWorkPreservingRMRestart.testReleasedContainerNotRecovered[1]

Error Message:
null

Stack Trace:
java.lang.AssertionError: null
	at org.junit.Assert.fail(Assert.java:86)
	at org.junit.Assert.assertTrue(Assert.java:41)
	at org.junit.Assert.assertTrue(Assert.java:52)
	at org.apache.hadoop.yarn.server.resourcemanager.TestWorkPreservingRMRestart.testReleasedContainerNotRecovered(TestWorkPreservingRMRestart.java:887)


REGRESSION:  org.apache.hadoop.yarn.server.resourcemanager.scheduler.fair.TestFairScheduler.testContinuousScheduling

Error Message:
expected:<2> but was:<1>

Stack Trace:
java.lang.AssertionError: expected:<2> but was:<1>
	at org.junit.Assert.fail(Assert.java:88)
	at org.junit.Assert.failNotEquals(Assert.java:743)
	at org.junit.Assert.assertEquals(Assert.java:118)
	at org.junit.Assert.assertEquals(Assert.java:555)
	at org.junit.Assert.assertEquals(Assert.java:542)
	at org.apache.hadoop.yarn.server.resourcemanager.scheduler.fair.TestFairScheduler.testContinuousScheduling(TestFairScheduler.java:3524)