You are viewing a plain text version of this content. The canonical link for it is here.
Posted to dev@zookeeper.apache.org by Apache Jenkins Server <je...@builds.apache.org> on 2013/12/15 22:52:40 UTC
ZooKeeper-trunk-openjdk7 - Build # 332 - Failure
See https://builds.apache.org/job/ZooKeeper-trunk-openjdk7/332/
###################################################################################
########################## LAST 60 LINES OF THE CONSOLE ###########################
[...truncated 263188 lines...]
[junit] 2013-12-15 21:52:31,010 [myid:] - INFO [main:ZooKeeperServer@428] - shutting down
[junit] 2013-12-15 21:52:31,010 [myid:] - INFO [main:SessionTrackerImpl@183] - Shutting down
[junit] 2013-12-15 21:52:31,010 [myid:] - INFO [main:PrepRequestProcessor@972] - Shutting down
[junit] 2013-12-15 21:52:31,010 [myid:] - INFO [main:SyncRequestProcessor@190] - Shutting down
[junit] 2013-12-15 21:52:31,010 [myid:] - INFO [ProcessThread(sid:0 cport:-1)::PrepRequestProcessor@156] - PrepRequestProcessor exited loop!
[junit] 2013-12-15 21:52:31,010 [myid:] - INFO [SyncThread:0:SyncRequestProcessor@168] - SyncRequestProcessor exited!
[junit] 2013-12-15 21:52:31,011 [myid:] - INFO [main:FinalRequestProcessor@442] - shutdown of request processor complete
[junit] 2013-12-15 21:52:31,011 [myid:] - INFO [main:FourLetterWordMain@43] - connecting to 127.0.0.1 11221
[junit] 2013-12-15 21:52:31,012 [myid:] - INFO [main:JMXEnv@133] - ensureOnly:[]
[junit] 2013-12-15 21:52:31,013 [myid:] - INFO [main:ClientBase@414] - STARTING server
[junit] 2013-12-15 21:52:31,013 [myid:] - INFO [main:ZooKeeperServer@149] - Created server with tickTime 3000 minSessionTimeout 6000 maxSessionTimeout 60000 datadir /home/jenkins/jenkins-slave/workspace/ZooKeeper-trunk-openjdk7/trunk/build/test/tmp/test706865116633062134.junit.dir/version-2 snapdir /home/jenkins/jenkins-slave/workspace/ZooKeeper-trunk-openjdk7/trunk/build/test/tmp/test706865116633062134.junit.dir/version-2
[junit] 2013-12-15 21:52:31,014 [myid:] - INFO [main:NIOServerCnxnFactory@670] - Configuring NIO connection handler with 10s sessionless connection timeout, 2 selector thread(s), 16 worker threads, and 64 kB direct buffers.
[junit] 2013-12-15 21:52:31,014 [myid:] - INFO [main:NIOServerCnxnFactory@683] - binding to port 0.0.0.0/0.0.0.0:11221
[junit] 2013-12-15 21:52:31,015 [myid:] - INFO [main:FileSnap@83] - Reading snapshot /home/jenkins/jenkins-slave/workspace/ZooKeeper-trunk-openjdk7/trunk/build/test/tmp/test706865116633062134.junit.dir/version-2/snapshot.b
[junit] 2013-12-15 21:52:31,018 [myid:] - INFO [main:FileTxnSnapLog@297] - Snapshotting: 0xb to /home/jenkins/jenkins-slave/workspace/ZooKeeper-trunk-openjdk7/trunk/build/test/tmp/test706865116633062134.junit.dir/version-2/snapshot.b
[junit] 2013-12-15 21:52:31,020 [myid:] - INFO [main:FourLetterWordMain@43] - connecting to 127.0.0.1 11221
[junit] 2013-12-15 21:52:31,020 [myid:] - INFO [NIOServerCxnFactory.AcceptThread:0.0.0.0/0.0.0.0:11221:NIOServerCnxnFactory$AcceptThread@296] - Accepted socket connection from /127.0.0.1:48770
[junit] 2013-12-15 21:52:31,021 [myid:] - INFO [NIOWorkerThread-1:NIOServerCnxn@835] - Processing stat command from /127.0.0.1:48770
[junit] 2013-12-15 21:52:31,021 [myid:] - INFO [NIOWorkerThread-1:NIOServerCnxn$StatCommand@684] - Stat command output
[junit] 2013-12-15 21:52:31,022 [myid:] - INFO [NIOWorkerThread-1:NIOServerCnxn@1006] - Closed socket connection for client /127.0.0.1:48770 (no session established for client)
[junit] 2013-12-15 21:52:31,022 [myid:] - INFO [main:JMXEnv@133] - ensureOnly:[InMemoryDataTree, StandaloneServer_port]
[junit] 2013-12-15 21:52:31,024 [myid:] - INFO [main:JMXEnv@105] - expect:InMemoryDataTree
[junit] 2013-12-15 21:52:31,025 [myid:] - INFO [main:JMXEnv@108] - found:InMemoryDataTree org.apache.ZooKeeperService:name0=StandaloneServer_port-1,name1=InMemoryDataTree
[junit] 2013-12-15 21:52:31,025 [myid:] - INFO [main:JMXEnv@105] - expect:StandaloneServer_port
[junit] 2013-12-15 21:52:31,025 [myid:] - INFO [main:JMXEnv@108] - found:StandaloneServer_port org.apache.ZooKeeperService:name0=StandaloneServer_port-1
[junit] 2013-12-15 21:52:31,025 [myid:] - INFO [main:JUnit4ZKTestRunner$LoggedInvokeMethod@57] - FINISHED TEST METHOD testQuota
[junit] 2013-12-15 21:52:31,025 [myid:] - INFO [main:ClientBase@451] - tearDown starting
[junit] 2013-12-15 21:52:31,092 [myid:] - INFO [main:ZooKeeper@777] - Session: 0x142f83f05760000 closed
[junit] 2013-12-15 21:52:31,092 [myid:] - INFO [main-EventThread:ClientCnxn$EventThread@513] - EventThread shut down
[junit] 2013-12-15 21:52:31,092 [myid:] - INFO [main:ClientBase@421] - STOPPING server
[junit] 2013-12-15 21:52:31,093 [myid:] - INFO [ConnnectionExpirer:NIOServerCnxnFactory$ConnectionExpirerThread@583] - ConnnectionExpirerThread interrupted
[junit] 2013-12-15 21:52:31,093 [myid:] - INFO [NIOServerCxnFactory.AcceptThread:0.0.0.0/0.0.0.0:11221:NIOServerCnxnFactory$AcceptThread@219] - accept thread exitted run method
[junit] 2013-12-15 21:52:31,093 [myid:] - INFO [NIOServerCxnFactory.SelectorThread-0:NIOServerCnxnFactory$SelectorThread@420] - selector thread exitted run method
[junit] 2013-12-15 21:52:31,093 [myid:] - INFO [NIOServerCxnFactory.SelectorThread-1:NIOServerCnxnFactory$SelectorThread@420] - selector thread exitted run method
[junit] 2013-12-15 21:52:31,094 [myid:] - INFO [main:ZooKeeperServer@428] - shutting down
[junit] 2013-12-15 21:52:31,094 [myid:] - INFO [main:SessionTrackerImpl@183] - Shutting down
[junit] 2013-12-15 21:52:31,095 [myid:] - INFO [main:PrepRequestProcessor@972] - Shutting down
[junit] 2013-12-15 21:52:31,095 [myid:] - INFO [main:SyncRequestProcessor@190] - Shutting down
[junit] 2013-12-15 21:52:31,095 [myid:] - INFO [ProcessThread(sid:0 cport:-1)::PrepRequestProcessor@156] - PrepRequestProcessor exited loop!
[junit] 2013-12-15 21:52:31,095 [myid:] - INFO [SyncThread:0:SyncRequestProcessor@168] - SyncRequestProcessor exited!
[junit] 2013-12-15 21:52:31,095 [myid:] - INFO [main:FinalRequestProcessor@442] - shutdown of request processor complete
[junit] 2013-12-15 21:52:31,096 [myid:] - INFO [main:FourLetterWordMain@43] - connecting to 127.0.0.1 11221
[junit] 2013-12-15 21:52:31,097 [myid:] - INFO [main:JMXEnv@133] - ensureOnly:[]
[junit] 2013-12-15 21:52:31,102 [myid:] - INFO [main:ClientBase@476] - fdcount after test is: 49 at start it was 37
[junit] 2013-12-15 21:52:31,102 [myid:] - INFO [main:ClientBase@478] - sleeping for 20 secs
[junit] 2013-12-15 21:52:31,104 [myid:] - INFO [main:ZKTestCase$1@61] - SUCCEEDED testQuota
[junit] 2013-12-15 21:52:31,104 [myid:] - INFO [main:ZKTestCase$1@56] - FINISHED testQuota
[junit] Tests run: 1, Failures: 0, Errors: 0, Time elapsed: 2.509 sec
BUILD FAILED
/home/jenkins/jenkins-slave/workspace/ZooKeeper-trunk-openjdk7/trunk/build.xml:1264: Tests failed!
Total time: 48 minutes 51 seconds
Build step 'Execute shell' marked build as failure
[locks-and-latches] Releasing all the locks
[locks-and-latches] All the locks released
Recording test results
Email was triggered for: Failure
Sending email for trigger: Failure
###################################################################################
############################## FAILED TESTS (if any) ##############################
3 tests failed.
REGRESSION: org.apache.zookeeper.test.WatcherTest.testWatcherAutoResetWithGlobal
Error Message:
KeeperErrorCode = ConnectionLoss for /watchtest/child
Stack Trace:
org.apache.zookeeper.KeeperException$ConnectionLossException: KeeperErrorCode = ConnectionLoss for /watchtest/child
at org.apache.zookeeper.KeeperException.create(KeeperException.java:99)
at org.apache.zookeeper.KeeperException.create(KeeperException.java:51)
at org.apache.zookeeper.ZooKeeper.setData(ZooKeeper.java:1670)
at org.apache.zookeeper.test.WatcherTest.testWatcherAutoReset(WatcherTest.java:287)
at org.apache.zookeeper.test.WatcherTest.testWatcherAutoResetWithGlobal(WatcherTest.java:232)
at org.apache.zookeeper.JUnit4ZKTestRunner$LoggedInvokeMethod.evaluate(JUnit4ZKTestRunner.java:52)
REGRESSION: org.apache.zookeeper.test.ObserverQuorumHammerTest.testHammerBasic
Error Message:
expected:<1000> but was:<422>
Stack Trace:
junit.framework.AssertionFailedError: expected:<1000> but was:<422>
at org.apache.zookeeper.test.ClientHammerTest.verifyHammer(ClientHammerTest.java:230)
at org.apache.zookeeper.test.ClientHammerTest.runHammer(ClientHammerTest.java:141)
at org.apache.zookeeper.test.ClientHammerTest.testHammerBasic(ClientHammerTest.java:119)
at org.apache.zookeeper.test.ObserverQuorumHammerTest.testHammerBasic(ObserverQuorumHammerTest.java:37)
at org.apache.zookeeper.JUnit4ZKTestRunner$LoggedInvokeMethod.evaluate(JUnit4ZKTestRunner.java:52)
REGRESSION: org.apache.zookeeper.test.WatcherTest.testWatcherAutoResetDisabledWithLocal
Error Message:
KeeperErrorCode = ConnectionLoss for /watchtest/child
Stack Trace:
org.apache.zookeeper.KeeperException$ConnectionLossException: KeeperErrorCode = ConnectionLoss for /watchtest/child
at org.apache.zookeeper.KeeperException.create(KeeperException.java:99)
at org.apache.zookeeper.KeeperException.create(KeeperException.java:51)
at org.apache.zookeeper.ZooKeeper.setData(ZooKeeper.java:1670)
at org.apache.zookeeper.test.WatcherTest.testWatcherAutoReset(WatcherTest.java:287)
at org.apache.zookeeper.test.WatcherTest.testWatcherAutoResetWithLocal(WatcherTest.java:241)
at org.apache.zookeeper.test.WatcherTest.testWatcherAutoResetDisabledWithLocal(WatcherTest.java:254)
at org.apache.zookeeper.JUnit4ZKTestRunner$LoggedInvokeMethod.evaluate(JUnit4ZKTestRunner.java:52)