You are viewing a plain text version of this content. The canonical link for it is here.
Posted to builds@cassandra.apache.org by Apache Jenkins Server <je...@builds.apache.org> on 2024/06/12 10:27:56 UTC

Build complete: Cassandra-5.0 #242 [UNSTABLE] 8c165b4cc029928d7b485fffae17e0904ce7a49c

-------------------------------------------------------------------------------
  Build Cassandra-5.0 #242 Still Unstable
  URL: https://ci-cassandra.apache.org/job/Cassandra-5.0/242/
  -------------------------------------------------------------------------------
  Changes:
  No changes

  -------------------------------------------------------------------------------
  Failed Tests:
  6 tests failed.
FAILED:  dtest.materialized_views_test.TestMaterializedViews.Tests / dtest jdk11 49/64 / test_rename_column_atomicity
FAILED:  dtest.materialized_views_test.TestMaterializedViews.Tests / dtest jdk17 49/64 / test_rename_column_atomicity
FAILED:  dtest-latest.materialized_views_test.TestMaterializedViews.Tests / dtest-latest jdk11 49/64 / test_rename_column_atomicity
FAILED:  dtest-latest.materialized_views_test.TestMaterializedViews.Tests / dtest-latest jdk17 49/64 / test_rename_column_atomicity
FAILED:  dtest-novnode.materialized_views_test.TestMaterializedViews.Tests / dtest-novnode jdk17 55/64 / test_rename_column_atomicity
FAILED:  dtest-novnode.materialized_views_test.TestMaterializedViews.Tests / dtest-novnode jdk11 55/64 / test_rename_column_atomicity

  -------------------------------------------------------------------------------
  For complete test report and logs see https://nightlies.apache.org/cassandra/Cassandra-5.0/242/