You are viewing a plain text version of this content. The canonical link for it is here.
Posted to builds@solr.apache.org by Apache Jenkins Server <je...@builds.apache.org> on 2024/03/11 15:56:00 UTC
[JENKINS] Lucene » Lucene-Solr-Tests-8.11 - Build # 641 - Still Unstable!
Build: https://ci-builds.apache.org/job/Lucene/job/Lucene-Solr-Tests-8.11/641/
1 tests failed.
FAILED: org.apache.solr.cloud.api.collections.ShardSplitTest.testSplitMixedReplicaTypes
Error Message:
Timeout occurred while waiting response from server at: http://127.0.0.1:42541
Stack Trace:
org.apache.solr.client.solrj.SolrServerException: Timeout occurred while waiting response from server at: http://127.0.0.1:42541
at __randomizedtesting.SeedInfo.seed([2C002CD9F9A483ED:94C37879057F5698]:0)
at org.apache.solr.client.solrj.impl.HttpSolrClient.executeMethod(HttpSolrClient.java:692)
at org.apache.solr.client.solrj.impl.HttpSolrClient.request(HttpSolrClient.java:266)
at org.apache.solr.client.solrj.impl.HttpSolrClient.request(HttpSolrClient.java:248)
at org.apache.solr.client.solrj.impl.LBSolrClient.doRequest(LBSolrClient.java:369)
at org.apache.solr.client.solrj.impl.LBSolrClient.request(LBSolrClient.java:297)
at org.apache.solr.client.solrj.impl.BaseCloudSolrClient.sendRequest(BaseCloudSolrClient.java:1188)
at org.apache.solr.client.solrj.impl.BaseCloudSolrClient.requestWithRetryOnStaleState(BaseCloudSolrClient.java:934)
at org.apache.solr.client.solrj.impl.BaseCloudSolrClient.request(BaseCloudSolrClient.java:866)
at org.apache.solr.client.solrj.SolrRequest.process(SolrRequest.java:225)
at org.apache.solr.client.solrj.SolrRequest.process(SolrRequest.java:242)
at org.apache.solr.cloud.api.collections.ShardSplitTest.doSplitMixedReplicaTypes(ShardSplitTest.java:365)
at org.apache.solr.cloud.api.collections.ShardSplitTest.testSplitMixedReplicaTypes(ShardSplitTest.java:350)
at sun.reflect.NativeMethodAccessorImpl.invoke0(Native Method)
at sun.reflect.NativeMethodAccessorImpl.invoke(NativeMethodAccessorImpl.java:62)
at sun.reflect.DelegatingMethodAccessorImpl.invoke(DelegatingMethodAccessorImpl.java:43)
at java.lang.reflect.Method.invoke(Method.java:498)
at com.carrotsearch.randomizedtesting.RandomizedRunner.invoke(RandomizedRunner.java:1758)
at com.carrotsearch.randomizedtesting.RandomizedRunner$8.evaluate(RandomizedRunner.java:946)
at com.carrotsearch.randomizedtesting.RandomizedRunner$9.evaluate(RandomizedRunner.java:982)
at com.carrotsearch.randomizedtesting.RandomizedRunner$10.evaluate(RandomizedRunner.java:996)
at org.apache.solr.BaseDistributedSearchTestCase$ShardsRepeatRule$ShardsFixedStatement.callStatement(BaseDistributedSearchTestCase.java:1084)
at org.apache.solr.BaseDistributedSearchTestCase$ShardsRepeatRule$ShardsStatement.evaluate(BaseDistributedSearchTestCase.java:1055)
at com.carrotsearch.randomizedtesting.rules.SystemPropertiesRestoreRule$1.evaluate(SystemPropertiesRestoreRule.java:80)
at org.junit.rules.RunRules.evaluate(RunRules.java:20)
at org.apache.lucene.util.TestRuleSetupTeardownChained$1.evaluate(TestRuleSetupTeardownChained.java:49)
at org.apache.lucene.util.AbstractBeforeAfterRule$1.evaluate(AbstractBeforeAfterRule.java:45)
at org.apache.lucene.util.TestRuleThreadAndTestName$1.evaluate(TestRuleThreadAndTestName.java:48)
at org.apache.lucene.util.TestRuleIgnoreAfterMaxFailures$1.evaluate(TestRuleIgnoreAfterMaxFailures.java:64)
at org.apache.lucene.util.TestRuleMarkFailure$1.evaluate(TestRuleMarkFailure.java:47)
at org.junit.rules.RunRules.evaluate(RunRules.java:20)
at com.carrotsearch.randomizedtesting.rules.StatementAdapter.evaluate(StatementAdapter.java:36)
at com.carrotsearch.randomizedtesting.ThreadLeakControl$StatementRunner.run(ThreadLeakControl.java:390)
at com.carrotsearch.randomizedtesting.ThreadLeakControl.forkTimeoutingTask(ThreadLeakControl.java:843)
at com.carrotsearch.randomizedtesting.ThreadLeakControl$3.evaluate(ThreadLeakControl.java:490)
at com.carrotsearch.randomizedtesting.RandomizedRunner.runSingleTest(RandomizedRunner.java:955)
at com.carrotsearch.randomizedtesting.RandomizedRunner$5.evaluate(RandomizedRunner.java:840)
at com.carrotsearch.randomizedtesting.RandomizedRunner$6.evaluate(RandomizedRunner.java:891)
at com.carrotsearch.randomizedtesting.RandomizedRunner$7.evaluate(RandomizedRunner.java:902)
at com.carrotsearch.randomizedtesting.rules.StatementAdapter.evaluate(StatementAdapter.java:36)
at com.carrotsearch.randomizedtesting.rules.SystemPropertiesRestoreRule$1.evaluate(SystemPropertiesRestoreRule.java:80)
at org.junit.rules.RunRules.evaluate(RunRules.java:20)
at org.apache.lucene.util.AbstractBeforeAfterRule$1.evaluate(AbstractBeforeAfterRule.java:45)
at com.carrotsearch.randomizedtesting.rules.StatementAdapter.evaluate(StatementAdapter.java:36)
at org.apache.lucene.util.TestRuleStoreClassName$1.evaluate(TestRuleStoreClassName.java:41)
at com.carrotsearch.randomizedtesting.rules.NoShadowingOrOverridesOnMethodsRule$1.evaluate(NoShadowingOrOverridesOnMethodsRule.java:40)
at com.carrotsearch.randomizedtesting.rules.NoShadowingOrOverridesOnMethodsRule$1.evaluate(NoShadowingOrOverridesOnMethodsRule.java:40)
at com.carrotsearch.randomizedtesting.rules.StatementAdapter.evaluate(StatementAdapter.java:36)
at com.carrotsearch.randomizedtesting.rules.StatementAdapter.evaluate(StatementAdapter.java:36)
at com.carrotsearch.randomizedtesting.rules.StatementAdapter.evaluate(StatementAdapter.java:36)
at org.apache.lucene.util.TestRuleAssertionsRequired$1.evaluate(TestRuleAssertionsRequired.java:53)
at org.apache.lucene.util.TestRuleMarkFailure$1.evaluate(TestRuleMarkFailure.java:47)
at org.apache.lucene.util.TestRuleIgnoreAfterMaxFailures$1.evaluate(TestRuleIgnoreAfterMaxFailures.java:64)
at org.apache.lucene.util.TestRuleIgnoreTestSuites$1.evaluate(TestRuleIgnoreTestSuites.java:54)
at org.junit.rules.RunRules.evaluate(RunRules.java:20)
at com.carrotsearch.randomizedtesting.rules.StatementAdapter.evaluate(StatementAdapter.java:36)
at com.carrotsearch.randomizedtesting.ThreadLeakControl$StatementRunner.run(ThreadLeakControl.java:390)
at com.carrotsearch.randomizedtesting.ThreadLeakControl.lambda$forkTimeoutingTask$0(ThreadLeakControl.java:850)
at java.lang.Thread.run(Thread.java:750)
Caused by: java.net.SocketTimeoutException: Read timed out
at java.net.SocketInputStream.socketRead0(Native Method)
at java.net.SocketInputStream.socketRead(SocketInputStream.java:116)
at java.net.SocketInputStream.read(SocketInputStream.java:171)
at java.net.SocketInputStream.read(SocketInputStream.java:141)
at org.apache.http.impl.io.SessionInputBufferImpl.streamRead(SessionInputBufferImpl.java:137)
at org.apache.http.impl.io.SessionInputBufferImpl.fillBuffer(SessionInputBufferImpl.java:153)
at org.apache.http.impl.io.SessionInputBufferImpl.readLine(SessionInputBufferImpl.java:280)
at org.apache.http.impl.conn.DefaultHttpResponseParser.parseHead(DefaultHttpResponseParser.java:138)
at org.apache.http.impl.conn.DefaultHttpResponseParser.parseHead(DefaultHttpResponseParser.java:56)
at org.apache.http.impl.io.AbstractMessageParser.parse(AbstractMessageParser.java:259)
at org.apache.http.impl.DefaultBHttpClientConnection.receiveResponseHeader(DefaultBHttpClientConnection.java:163)
at org.apache.http.impl.conn.CPoolProxy.receiveResponseHeader(CPoolProxy.java:157)
at org.apache.http.protocol.HttpRequestExecutor.doReceiveResponse(HttpRequestExecutor.java:273)
at org.apache.http.protocol.HttpRequestExecutor.execute(HttpRequestExecutor.java:125)
at org.apache.http.impl.execchain.MainClientExec.execute(MainClientExec.java:272)
at org.apache.http.impl.execchain.ProtocolExec.execute(ProtocolExec.java:186)
at org.apache.http.impl.execchain.RetryExec.execute(RetryExec.java:89)
at org.apache.http.impl.execchain.RedirectExec.execute(RedirectExec.java:110)
at org.apache.http.impl.client.InternalHttpClient.doExecute(InternalHttpClient.java:185)
at org.apache.http.impl.client.CloseableHttpClient.execute(CloseableHttpClient.java:83)
at org.apache.http.impl.client.CloseableHttpClient.execute(CloseableHttpClient.java:56)
at org.apache.solr.client.solrj.impl.HttpSolrClient.executeMethod(HttpSolrClient.java:571)
... 57 more
Build Log:
[...truncated 15443 lines...]
[junit4] Suite: org.apache.solr.cloud.api.collections.ShardSplitTest
[junit4] 2> 1601030 INFO (SUITE-ShardSplitTest-seed#[2C002CD9F9A483ED]-worker) [ ] o.a.s.SolrTestCase Setting 'solr.default.confdir' system property to test-framework derived value of '/home/jenkins/jenkins-slave/workspace/Lucene/Lucene-Solr-Tests-8.11/solr/server/solr/configsets/_default/conf'
[junit4] 2> 1601030 INFO (SUITE-ShardSplitTest-seed#[2C002CD9F9A483ED]-worker) [ ] o.a.s.SolrTestCaseJ4 SecureRandom sanity checks: test.solr.allowed.securerandom=null & java.security.egd=file:/dev/./urandom
[junit4] 2> 1601031 INFO (SUITE-ShardSplitTest-seed#[2C002CD9F9A483ED]-worker) [ ] o.a.s.u.ErrorLogMuter Closing ErrorLogMuter-regex-328 after mutting 0 log messages
[junit4] 2> 1601031 INFO (SUITE-ShardSplitTest-seed#[2C002CD9F9A483ED]-worker) [ ] o.a.s.u.ErrorLogMuter Creating ErrorLogMuter-regex-329 for ERROR logs matching regex: ignore_exception
[junit4] 2> 1601032 INFO (SUITE-ShardSplitTest-seed#[2C002CD9F9A483ED]-worker) [ ] o.a.s.SolrTestCaseJ4 Created dataDir: /home/jenkins/jenkins-slave/workspace/Lucene/Lucene-Solr-Tests-8.11/solr/build/solr-core/test/J0/temp/solr.cloud.api.collections.ShardSplitTest_2C002CD9F9A483ED-001/data-dir-128-001
[junit4] 2> 1601032 WARN (SUITE-ShardSplitTest-seed#[2C002CD9F9A483ED]-worker) [ ] o.a.s.SolrTestCaseJ4 startTrackingSearchers: numOpens=28 numCloses=28
[junit4] 2> 1601032 INFO (SUITE-ShardSplitTest-seed#[2C002CD9F9A483ED]-worker) [ ] o.a.s.SolrTestCaseJ4 Using PointFields (NUMERIC_POINTS_SYSPROP=true) w/NUMERIC_DOCVALUES_SYSPROP=true
[junit4] 2> 1601037 INFO (SUITE-ShardSplitTest-seed#[2C002CD9F9A483ED]-worker) [ ] o.a.s.SolrTestCaseJ4 Randomized ssl (false) and clientAuth (false) via: @org.apache.solr.SolrTestCaseJ4$SuppressSSL(bugUrl=https://issues.apache.org/jira/browse/SOLR-5776)
[junit4] 2> 1601038 INFO (SUITE-ShardSplitTest-seed#[2C002CD9F9A483ED]-worker) [ ] o.a.s.BaseDistributedSearchTestCase Setting hostContext system property: /
[junit4] 2> 1601042 INFO (TEST-ShardSplitTest.testSplitStaticIndexReplicationLink-seed#[2C002CD9F9A483ED]) [ ] o.a.s.u.ErrorLogMuter Closing ErrorLogMuter-regex-329 after mutting 0 log messages
[junit4] 2> 1601042 INFO (TEST-ShardSplitTest.testSplitStaticIndexReplicationLink-seed#[2C002CD9F9A483ED]) [ ] o.a.s.u.ErrorLogMuter Creating ErrorLogMuter-regex-330 for ERROR logs matching regex: ignore_exception
[junit4] 2> 1601043 INFO (TEST-ShardSplitTest.testSplitStaticIndexReplicationLink-seed#[2C002CD9F9A483ED]) [ ] o.a.s.c.ZkTestServer STARTING ZK TEST SERVER
[junit4] 2> 1601043 INFO (ZkTestServer Run Thread) [ ] o.a.s.c.ZkTestServer client port: 0.0.0.0/0.0.0.0:0
[junit4] 2> 1601044 INFO (ZkTestServer Run Thread) [ ] o.a.s.c.ZkTestServer Starting server
[junit4] 2> 1601044 WARN (ZkTestServer Run Thread) [ ] o.a.z.s.ServerCnxnFactory maxCnxns is not configured, using default value 0.
[junit4] 2> 1601143 INFO (TEST-ShardSplitTest.testSplitStaticIndexReplicationLink-seed#[2C002CD9F9A483ED]) [ ] o.a.s.c.ZkTestServer start zk server on port: 42821
[junit4] 2> 1601144 INFO (TEST-ShardSplitTest.testSplitStaticIndexReplicationLink-seed#[2C002CD9F9A483ED]) [ ] o.a.s.c.ZkTestServer waitForServerUp: 127.0.0.1:42821
[junit4] 2> 1601144 INFO (TEST-ShardSplitTest.testSplitStaticIndexReplicationLink-seed#[2C002CD9F9A483ED]) [ ] o.a.s.c.ZkTestServer parse host and port list: 127.0.0.1:42821
[junit4] 2> 1601144 INFO (TEST-ShardSplitTest.testSplitStaticIndexReplicationLink-seed#[2C002CD9F9A483ED]) [ ] o.a.s.c.ZkTestServer connecting to 127.0.0.1 42821
[junit4] 2> 1601149 DEBUG (TEST-ShardSplitTest.testSplitStaticIndexReplicationLink-seed#[2C002CD9F9A483ED]) [ ] o.a.s.c.c.SolrZkClient Using default ZkCredentialsProvider
[junit4] 2> 1601150 INFO (TEST-ShardSplitTest.testSplitStaticIndexReplicationLink-seed#[2C002CD9F9A483ED]) [ ] o.a.s.c.c.ConnectionManager Waiting for client to connect to ZooKeeper
[junit4] 2> 1601156 DEBUG (TEST-ShardSplitTest.testSplitStaticIndexReplicationLink-seed#[2C002CD9F9A483ED]-EventThread) [ ] o.a.s.c.c.SolrZkClient Submitting job to respond to event WatchedEvent state:SyncConnected type:None path:null
[junit4] 2> 1601160 DEBUG (zkConnectionManagerCallback-15242-thread-1) [ ] o.a.s.c.c.ConnectionManager Watcher org.apache.solr.common.cloud.ConnectionManager@1546a751 name: ZooKeeperConnection Watcher:127.0.0.1:42821 got event WatchedEvent state:SyncConnected type:None path:null path: null type: None
[junit4] 2> 1601160 INFO (zkConnectionManagerCallback-15242-thread-1) [ ] o.a.s.c.c.ConnectionManager zkClient has connected
[junit4] 2> 1601160 INFO (TEST-ShardSplitTest.testSplitStaticIndexReplicationLink-seed#[2C002CD9F9A483ED]) [ ] o.a.s.c.c.ConnectionManager Client is connected to ZooKeeper
[junit4] 2> 1601160 DEBUG (TEST-ShardSplitTest.testSplitStaticIndexReplicationLink-seed#[2C002CD9F9A483ED]) [ ] o.a.s.c.c.SolrZkClient Using default ZkACLProvider
[junit4] 2> 1601172 DEBUG (TEST-ShardSplitTest.testSplitStaticIndexReplicationLink-seed#[2C002CD9F9A483ED]) [ ] o.a.s.c.c.SolrZkClient makePath: /solr
[junit4] 2> 1601176 DEBUG (TEST-ShardSplitTest.testSplitStaticIndexReplicationLink-seed#[2C002CD9F9A483ED]) [ ] o.a.s.c.c.SolrZkClient Using default ZkCredentialsProvider
[junit4] 2> 1601177 INFO (TEST-ShardSplitTest.testSplitStaticIndexReplicationLink-seed#[2C002CD9F9A483ED]) [ ] o.a.s.c.c.ConnectionManager Waiting for client to connect to ZooKeeper
[junit4] 2> 1601179 DEBUG (TEST-ShardSplitTest.testSplitStaticIndexReplicationLink-seed#[2C002CD9F9A483ED]-EventThread) [ ] o.a.s.c.c.SolrZkClient Submitting job to respond to event WatchedEvent state:SyncConnected type:None path:null
[junit4] 2> 1601180 DEBUG (zkConnectionManagerCallback-15244-thread-1) [ ] o.a.s.c.c.ConnectionManager Watcher org.apache.solr.common.cloud.ConnectionManager@4a433234 name: ZooKeeperConnection Watcher:127.0.0.1:42821/solr got event WatchedEvent state:SyncConnected type:None path:null path: null type: None
[junit4] 2> 1601180 INFO (zkConnectionManagerCallback-15244-thread-1) [ ] o.a.s.c.c.ConnectionManager zkClient has connected
[junit4] 2> 1601180 INFO (TEST-ShardSplitTest.testSplitStaticIndexReplicationLink-seed#[2C002CD9F9A483ED]) [ ] o.a.s.c.c.ConnectionManager Client is connected to ZooKeeper
[junit4] 2> 1601180 DEBUG (TEST-ShardSplitTest.testSplitStaticIndexReplicationLink-seed#[2C002CD9F9A483ED]) [ ] o.a.s.c.c.SolrZkClient Using default ZkACLProvider
[junit4] 2> 1601181 DEBUG (TEST-ShardSplitTest.testSplitStaticIndexReplicationLink-seed#[2C002CD9F9A483ED]) [ ] o.a.s.c.c.SolrZkClient makePath: /clusterprops.json
[junit4] 2> 1601181 INFO (TEST-ShardSplitTest.testSplitStaticIndexReplicationLink-seed#[2C002CD9F9A483ED]) [ ] o.a.s.c.ZkTestServer put /home/jenkins/jenkins-slave/workspace/Lucene/Lucene-Solr-Tests-8.11/solr/core/src/test-files/solr/collection1/conf/solrconfig-tlog.xml to /configs/conf1/solrconfig.xml
[junit4] 2> 1601181 DEBUG (TEST-ShardSplitTest.testSplitStaticIndexReplicationLink-seed#[2C002CD9F9A483ED]) [ ] o.a.s.c.c.SolrZkClient makePath: /configs/conf1/solrconfig.xml
[junit4] 2> 1601182 INFO (TEST-ShardSplitTest.testSplitStaticIndexReplicationLink-seed#[2C002CD9F9A483ED]) [ ] o.a.s.c.ZkTestServer put /home/jenkins/jenkins-slave/workspace/Lucene/Lucene-Solr-Tests-8.11/solr/core/src/test-files/solr/collection1/conf/schema15.xml to /configs/conf1/schema.xml
[junit4] 2> 1601182 DEBUG (TEST-ShardSplitTest.testSplitStaticIndexReplicationLink-seed#[2C002CD9F9A483ED]) [ ] o.a.s.c.c.SolrZkClient makePath: /configs/conf1/schema.xml
[junit4] 2> 1601183 INFO (TEST-ShardSplitTest.testSplitStaticIndexReplicationLink-seed#[2C002CD9F9A483ED]) [ ] o.a.s.c.ZkTestServer put /home/jenkins/jenkins-slave/workspace/Lucene/Lucene-Solr-Tests-8.11/solr/core/src/test-files/solr/collection1/conf/solrconfig.snippet.randomindexconfig.xml to /configs/conf1/solrconfig.snippet.randomindexconfig.xml
[junit4] 2> 1601183 DEBUG (TEST-ShardSplitTest.testSplitStaticIndexReplicationLink-seed#[2C002CD9F9A483ED]) [ ] o.a.s.c.c.SolrZkClient makePath: /configs/conf1/solrconfig.snippet.randomindexconfig.xml
[junit4] 2> 1601184 INFO (TEST-ShardSplitTest.testSplitStaticIndexReplicationLink-seed#[2C002CD9F9A483ED]) [ ] o.a.s.c.ZkTestServer put /home/jenkins/jenkins-slave/workspace/Lucene/Lucene-Solr-Tests-8.11/solr/core/src/test-files/solr/collection1/conf/stopwords.txt to /configs/conf1/stopwords.txt
[junit4] 2> 1601184 DEBUG (TEST-ShardSplitTest.testSplitStaticIndexReplicationLink-seed#[2C002CD9F9A483ED]) [ ] o.a.s.c.c.SolrZkClient makePath: /configs/conf1/stopwords.txt
[junit4] 2> 1601185 INFO (TEST-ShardSplitTest.testSplitStaticIndexReplicationLink-seed#[2C002CD9F9A483ED]) [ ] o.a.s.c.ZkTestServer put /home/jenkins/jenkins-slave/workspace/Lucene/Lucene-Solr-Tests-8.11/solr/core/src/test-files/solr/collection1/conf/protwords.txt to /configs/conf1/protwords.txt
[junit4] 2> 1601185 DEBUG (TEST-ShardSplitTest.testSplitStaticIndexReplicationLink-seed#[2C002CD9F9A483ED]) [ ] o.a.s.c.c.SolrZkClient makePath: /configs/conf1/protwords.txt
[junit4] 2> 1601186 INFO (TEST-ShardSplitTest.testSplitStaticIndexReplicationLink-seed#[2C002CD9F9A483ED]) [ ] o.a.s.c.ZkTestServer put /home/jenkins/jenkins-slave/workspace/Lucene/Lucene-Solr-Tests-8.11/solr/core/src/test-files/solr/collection1/conf/currency.xml to /configs/conf1/currency.xml
[junit4] 2> 1601186 DEBUG (TEST-ShardSplitTest.testSplitStaticIndexReplicationLink-seed#[2C002CD9F9A483ED]) [ ] o.a.s.c.c.SolrZkClient makePath: /configs/conf1/currency.xml
[junit4] 2> 1601187 INFO (TEST-ShardSplitTest.testSplitStaticIndexReplicationLink-seed#[2C002CD9F9A483ED]) [ ] o.a.s.c.ZkTestServer put /home/jenkins/jenkins-slave/workspace/Lucene/Lucene-Solr-Tests-8.11/solr/core/src/test-files/solr/collection1/conf/enumsConfig.xml to /configs/conf1/enumsConfig.xml
[junit4] 2> 1601187 DEBUG (TEST-ShardSplitTest.testSplitStaticIndexReplicationLink-seed#[2C002CD9F9A483ED]) [ ] o.a.s.c.c.SolrZkClient makePath: /configs/conf1/enumsConfig.xml
[junit4] 2> 1601188 INFO (TEST-ShardSplitTest.testSplitStaticIndexReplicationLink-seed#[2C002CD9F9A483ED]) [ ] o.a.s.c.ZkTestServer put /home/jenkins/jenkins-slave/workspace/Lucene/Lucene-Solr-Tests-8.11/solr/core/src/test-files/solr/collection1/conf/open-exchange-rates.json to /configs/conf1/open-exchange-rates.json
[junit4] 2> 1601188 DEBUG (TEST-ShardSplitTest.testSplitStaticIndexReplicationLink-seed#[2C002CD9F9A483ED]) [ ] o.a.s.c.c.SolrZkClient makePath: /configs/conf1/open-exchange-rates.json
[junit4] 2> 1601189 INFO (TEST-ShardSplitTest.testSplitStaticIndexReplicationLink-seed#[2C002CD9F9A483ED]) [ ] o.a.s.c.ZkTestServer put /home/jenkins/jenkins-slave/workspace/Lucene/Lucene-Solr-Tests-8.11/solr/core/src/test-files/solr/collection1/conf/mapping-ISOLatin1Accent.txt to /configs/conf1/mapping-ISOLatin1Accent.txt
[junit4] 2> 1601189 DEBUG (TEST-ShardSplitTest.testSplitStaticIndexReplicationLink-seed#[2C002CD9F9A483ED]) [ ] o.a.s.c.c.SolrZkClient makePath: /configs/conf1/mapping-ISOLatin1Accent.txt
[junit4] 2> 1601190 INFO (TEST-ShardSplitTest.testSplitStaticIndexReplicationLink-seed#[2C002CD9F9A483ED]) [ ] o.a.s.c.ZkTestServer put /home/jenkins/jenkins-slave/workspace/Lucene/Lucene-Solr-Tests-8.11/solr/core/src/test-files/solr/collection1/conf/old_synonyms.txt to /configs/conf1/old_synonyms.txt
[junit4] 2> 1601190 DEBUG (TEST-ShardSplitTest.testSplitStaticIndexReplicationLink-seed#[2C002CD9F9A483ED]) [ ] o.a.s.c.c.SolrZkClient makePath: /configs/conf1/old_synonyms.txt
[junit4] 2> 1601191 INFO (TEST-ShardSplitTest.testSplitStaticIndexReplicationLink-seed#[2C002CD9F9A483ED]) [ ] o.a.s.c.ZkTestServer put /home/jenkins/jenkins-slave/workspace/Lucene/Lucene-Solr-Tests-8.11/solr/core/src/test-files/solr/collection1/conf/synonyms.txt to /configs/conf1/synonyms.txt
[junit4] 2> 1601191 DEBUG (TEST-ShardSplitTest.testSplitStaticIndexReplicationLink-seed#[2C002CD9F9A483ED]) [ ] o.a.s.c.c.SolrZkClient makePath: /configs/conf1/synonyms.txt
[junit4] 2> 1601192 INFO (TEST-ShardSplitTest.testSplitStaticIndexReplicationLink-seed#[2C002CD9F9A483ED]) [ ] o.a.s.c.AbstractFullDistribZkTestBase Will use NRT replicas unless explicitly asked otherwise
[junit4] 2> 1601369 INFO (TEST-ShardSplitTest.testSplitStaticIndexReplicationLink-seed#[2C002CD9F9A483ED]) [ ] o.a.s.c.s.e.JettySolrRunner Start Jetty (configured port=0, binding port=0)
[junit4] 2> 1601369 INFO (TEST-ShardSplitTest.testSplitStaticIndexReplicationLink-seed#[2C002CD9F9A483ED]) [ ] o.a.s.c.s.e.JettySolrRunner Trying to start Jetty on port 0 try number 2 ...
[junit4] 2> 1601369 INFO (TEST-ShardSplitTest.testSplitStaticIndexReplicationLink-seed#[2C002CD9F9A483ED]) [ ] o.e.j.s.Server jetty-9.4.53.v20231009; built: 2023-10-09T12:29:09.265Z; git: 27bde00a0b95a1d5bbee0eae7984f891d2d0f8c9; jvm 1.8.0_362-b09
[junit4] 2> 1601376 INFO (TEST-ShardSplitTest.testSplitStaticIndexReplicationLink-seed#[2C002CD9F9A483ED]) [ ] o.e.j.s.session DefaultSessionIdManager workerName=node0
[junit4] 2> 1601376 INFO (TEST-ShardSplitTest.testSplitStaticIndexReplicationLink-seed#[2C002CD9F9A483ED]) [ ] o.e.j.s.session No SessionScavenger set, using defaults
[junit4] 2> 1601376 INFO (TEST-ShardSplitTest.testSplitStaticIndexReplicationLink-seed#[2C002CD9F9A483ED]) [ ] o.e.j.s.session node0 Scavenging every 600000ms
[junit4] 2> 1601376 INFO (TEST-ShardSplitTest.testSplitStaticIndexReplicationLink-seed#[2C002CD9F9A483ED]) [ ] o.e.j.s.h.ContextHandler Started o.e.j.s.ServletContextHandler@67101d83{/,null,AVAILABLE}
[junit4] 2> 1601377 INFO (TEST-ShardSplitTest.testSplitStaticIndexReplicationLink-seed#[2C002CD9F9A483ED]) [ ] o.e.j.s.AbstractConnector Started ServerConnector@3a1ed552{HTTP/1.1, (http/1.1, h2c)}{127.0.0.1:38407}
[junit4] 2> 1601377 INFO (TEST-ShardSplitTest.testSplitStaticIndexReplicationLink-seed#[2C002CD9F9A483ED]) [ ] o.e.j.s.Server Started @1601404ms
[junit4] 2> 1601377 INFO (TEST-ShardSplitTest.testSplitStaticIndexReplicationLink-seed#[2C002CD9F9A483ED]) [ ] o.a.s.c.s.e.JettySolrRunner Jetty properties: {solr.data.dir=/home/jenkins/jenkins-slave/workspace/Lucene/Lucene-Solr-Tests-8.11/solr/build/solr-core/test/J0/temp/solr.cloud.api.collections.ShardSplitTest_2C002CD9F9A483ED-001/tempDir-001/control/data, replicaType=NRT, hostContext=/, hostPort=38407, coreRootDirectory=/home/jenkins/jenkins-slave/workspace/Lucene/Lucene-Solr-Tests-8.11/solr/build/solr-core/test/J0/../../../../../../../../../../../home/jenkins/jenkins-slave/workspace/Lucene/Lucene-Solr-Tests-8.11/solr/build/solr-core/test/J0/temp/solr.cloud.api.collections.ShardSplitTest_2C002CD9F9A483ED-001/control-001/cores}
[junit4] 2> 1601377 ERROR (TEST-ShardSplitTest.testSplitStaticIndexReplicationLink-seed#[2C002CD9F9A483ED]) [ ] o.a.s.u.StartupLoggingUtils Missing Java Option solr.log.dir. Logging may be missing or incomplete.
[junit4] 2> 1601377 INFO (TEST-ShardSplitTest.testSplitStaticIndexReplicationLink-seed#[2C002CD9F9A483ED]) [ ] o.a.s.s.SolrDispatchFilter Using logger factory org.apache.logging.slf4j.Log4jLoggerFactory
[junit4] 2> 1601377 INFO (TEST-ShardSplitTest.testSplitStaticIndexReplicationLink-seed#[2C002CD9F9A483ED]) [ ] o.a.s.s.SolrDispatchFilter ___ _ Welcome to Apache Solr™ version 8.11.4
[junit4] 2> 1601377 INFO (TEST-ShardSplitTest.testSplitStaticIndexReplicationLink-seed#[2C002CD9F9A483ED]) [ ] o.a.s.s.SolrDispatchFilter / __| ___| |_ _ Starting in cloud mode on port null
[junit4] 2> 1601377 INFO (TEST-ShardSplitTest.testSplitStaticIndexReplicationLink-seed#[2C002CD9F9A483ED]) [ ] o.a.s.s.SolrDispatchFilter \__ \/ _ \ | '_| Install dir: /home/jenkins/jenkins-slave/workspace/Lucene/Lucene-Solr-Tests-8.11/solr
[junit4] 2> 1601377 INFO (TEST-ShardSplitTest.testSplitStaticIndexReplicationLink-seed#[2C002CD9F9A483ED]) [ ] o.a.s.s.SolrDispatchFilter |___/\___/_|_| Start time: 2024-03-11T15:15:30.168Z
[junit4] 2> 1601377 DEBUG (TEST-ShardSplitTest.testSplitStaticIndexReplicationLink-seed#[2C002CD9F9A483ED]) [ ] o.a.s.c.c.SolrZkClient Using default ZkCredentialsProvider
[junit4] 2> 1601378 INFO (TEST-ShardSplitTest.testSplitStaticIndexReplicationLink-seed#[2C002CD9F9A483ED]) [ ] o.a.s.c.c.ConnectionManager Waiting for client to connect to ZooKeeper
[junit4] 2> 1601378 DEBUG (TEST-ShardSplitTest.testSplitStaticIndexReplicationLink-seed#[2C002CD9F9A483ED]-EventThread) [ ] o.a.s.c.c.SolrZkClient Submitting job to respond to event WatchedEvent state:SyncConnected type:None path:null
[junit4] 2> 1601380 DEBUG (zkConnectionManagerCallback-15246-thread-1) [ ] o.a.s.c.c.ConnectionManager Watcher org.apache.solr.common.cloud.ConnectionManager@77f4657e name: ZooKeeperConnection Watcher:127.0.0.1:42821/solr got event WatchedEvent state:SyncConnected type:None path:null path: null type: None
[junit4] 2> 1601380 INFO (zkConnectionManagerCallback-15246-thread-1) [ ] o.a.s.c.c.ConnectionManager zkClient has connected
[junit4] 2> 1601380 INFO (TEST-ShardSplitTest.testSplitStaticIndexReplicationLink-seed#[2C002CD9F9A483ED]) [ ] o.a.s.c.c.ConnectionManager Client is connected to ZooKeeper
[junit4] 2> 1601380 DEBUG (TEST-ShardSplitTest.testSplitStaticIndexReplicationLink-seed#[2C002CD9F9A483ED]) [ ] o.a.s.c.c.SolrZkClient Using default ZkACLProvider
[junit4] 2> 1601481 DEBUG (TEST-ShardSplitTest.testSplitStaticIndexReplicationLink-seed#[2C002CD9F9A483ED]-EventThread) [ ] o.a.s.c.c.SolrZkClient Submitting job to respond to event WatchedEvent state:Closed type:None path:null
[junit4] 2> 1601481 INFO (TEST-ShardSplitTest.testSplitStaticIndexReplicationLink-seed#[2C002CD9F9A483ED]) [ ] o.a.s.s.SolrDispatchFilter Loading solr.xml from SolrHome (not found in ZooKeeper)
[junit4] 2> 1601481 INFO (TEST-ShardSplitTest.testSplitStaticIndexReplicationLink-seed#[2C002CD9F9A483ED]) [ ] o.a.s.c.SolrXmlConfig Loading container configuration from /home/jenkins/jenkins-slave/workspace/Lucene/Lucene-Solr-Tests-8.11/solr/build/solr-core/test/J0/../../../../../../../../../../../home/jenkins/jenkins-slave/workspace/Lucene/Lucene-Solr-Tests-8.11/solr/build/solr-core/test/J0/temp/solr.cloud.api.collections.ShardSplitTest_2C002CD9F9A483ED-001/control-001/solr.xml
[junit4] 2> 1601484 INFO (TEST-ShardSplitTest.testSplitStaticIndexReplicationLink-seed#[2C002CD9F9A483ED]) [ ] o.a.s.c.SolrXmlConfig Configuration parameter autoReplicaFailoverWorkLoopDelay is ignored
[junit4] 2> 1601484 INFO (TEST-ShardSplitTest.testSplitStaticIndexReplicationLink-seed#[2C002CD9F9A483ED]) [ ] o.a.s.c.SolrXmlConfig Configuration parameter autoReplicaFailoverBadNodeExpiration is ignored
[junit4] 2> 1601485 INFO (TEST-ShardSplitTest.testSplitStaticIndexReplicationLink-seed#[2C002CD9F9A483ED]) [ ] o.a.s.c.SolrXmlConfig MBean server found: com.sun.jmx.mbeanserver.JmxMBeanServer@61cad526, but no JMX reporters were configured - adding default JMX reporter.
[junit4] 2> 1602629 INFO (TEST-ShardSplitTest.testSplitStaticIndexReplicationLink-seed#[2C002CD9F9A483ED]) [ ] o.a.s.h.c.HttpShardHandlerFactory Host whitelist initialized: WhitelistHostChecker [whitelistHosts=null, whitelistHostCheckingEnabled=false]
[junit4] 2> 1602630 WARN (TEST-ShardSplitTest.testSplitStaticIndexReplicationLink-seed#[2C002CD9F9A483ED]) [ ] o.e.j.u.s.S.config Trusting all certificates configured for Client@3c03ec17[provider=null,keyStore=null,trustStore=null]
[junit4] 2> 1602630 WARN (TEST-ShardSplitTest.testSplitStaticIndexReplicationLink-seed#[2C002CD9F9A483ED]) [ ] o.e.j.u.s.S.config No Client EndPointIdentificationAlgorithm configured for Client@3c03ec17[provider=null,keyStore=null,trustStore=null]
[junit4] 2> 1602635 WARN (TEST-ShardSplitTest.testSplitStaticIndexReplicationLink-seed#[2C002CD9F9A483ED]) [ ] o.e.j.u.s.S.config Trusting all certificates configured for Client@178ba2c8[provider=null,keyStore=null,trustStore=null]
[junit4] 2> 1602635 WARN (TEST-ShardSplitTest.testSplitStaticIndexReplicationLink-seed#[2C002CD9F9A483ED]) [ ] o.e.j.u.s.S.config No Client EndPointIdentificationAlgorithm configured for Client@178ba2c8[provider=null,keyStore=null,trustStore=null]
[junit4] 2> 1602636 INFO (TEST-ShardSplitTest.testSplitStaticIndexReplicationLink-seed#[2C002CD9F9A483ED]) [ ] o.a.s.c.ZkContainer Zookeeper client=127.0.0.1:42821/solr
[junit4] 2> 1602636 DEBUG (TEST-ShardSplitTest.testSplitStaticIndexReplicationLink-seed#[2C002CD9F9A483ED]) [ ] o.a.s.c.c.SolrZkClient Using default ZkCredentialsProvider
[junit4] 2> 1602639 INFO (TEST-ShardSplitTest.testSplitStaticIndexReplicationLink-seed#[2C002CD9F9A483ED]) [ ] o.a.s.c.c.ConnectionManager Waiting for client to connect to ZooKeeper
[junit4] 2> 1602640 DEBUG (TEST-ShardSplitTest.testSplitStaticIndexReplicationLink-seed#[2C002CD9F9A483ED]-EventThread) [ ] o.a.s.c.c.SolrZkClient Submitting job to respond to event WatchedEvent state:SyncConnected type:None path:null
[junit4] 2> 1602648 DEBUG (zkConnectionManagerCallback-15257-thread-1) [ ] o.a.s.c.c.ConnectionManager Watcher org.apache.solr.common.cloud.ConnectionManager@4a13b075 name: ZooKeeperConnection Watcher:127.0.0.1:42821 got event WatchedEvent state:SyncConnected type:None path:null path: null type: None
[junit4] 2> 1602648 INFO (zkConnectionManagerCallback-15257-thread-1) [ ] o.a.s.c.c.ConnectionManager zkClient has connected
[junit4] 2> 1602648 INFO (TEST-ShardSplitTest.testSplitStaticIndexReplicationLink-seed#[2C002CD9F9A483ED]) [ ] o.a.s.c.c.ConnectionManager Client is connected to ZooKeeper
[junit4] 2> 1602648 DEBUG (TEST-ShardSplitTest.testSplitStaticIndexReplicationLink-seed#[2C002CD9F9A483ED]) [ ] o.a.s.c.c.SolrZkClient Using default ZkACLProvider
[junit4] 2> 1602649 WARN (TEST-ShardSplitTest.testSplitStaticIndexReplicationLink-seed#[2C002CD9F9A483ED]-SendThread(127.0.0.1:42821)) [ ] o.a.z.ClientCnxn An exception was thrown while closing send thread for session 0x100167df86e0003.
[junit4] 2> => EndOfStreamException: Unable to read additional data from server sessionid 0x100167df86e0003, likely server has closed socket
[junit4] 2> at org.apache.zookeeper.ClientCnxnSocketNIO.doIO(ClientCnxnSocketNIO.java:77)
[junit4] 2> org.apache.zookeeper.ClientCnxn$EndOfStreamException: Unable to read additional data from server sessionid 0x100167df86e0003, likely server has closed socket
[junit4] 2> at org.apache.zookeeper.ClientCnxnSocketNIO.doIO(ClientCnxnSocketNIO.java:77) ~[zookeeper-3.6.2.jar:3.6.2]
[junit4] 2> at org.apache.zookeeper.ClientCnxnSocketNIO.doTransport(ClientCnxnSocketNIO.java:350) ~[zookeeper-3.6.2.jar:3.6.2]
[junit4] 2> at org.apache.zookeeper.ClientCnxn$SendThread.run(ClientCnxn.java:1275) [zookeeper-3.6.2.jar:3.6.2]
[junit4] 2> 1602749 DEBUG (TEST-ShardSplitTest.testSplitStaticIndexReplicationLink-seed#[2C002CD9F9A483ED]-EventThread) [ ] o.a.s.c.c.SolrZkClient Submitting job to respond to event WatchedEvent state:Closed type:None path:null
[junit4] 2> 1602751 INFO (TEST-ShardSplitTest.testSplitStaticIndexReplicationLink-seed#[2C002CD9F9A483ED]) [n:127.0.0.1:38407_ ] o.a.s.c.c.ConnectionManager Waiting for client to connect to ZooKeeper
[junit4] 2> 1602754 DEBUG (TEST-ShardSplitTest.testSplitStaticIndexReplicationLink-seed#[2C002CD9F9A483ED]-EventThread) [ ] o.a.s.c.c.SolrZkClient Submitting job to respond to event WatchedEvent state:SyncConnected type:None path:null
[junit4] 2> 1602756 DEBUG (zkConnectionManagerCallback-15259-thread-1) [ ] o.a.s.c.c.ConnectionManager Watcher org.apache.solr.common.cloud.ConnectionManager@2de667ee name: ZooKeeperConnection Watcher:127.0.0.1:42821/solr got event WatchedEvent state:SyncConnected type:None path:null path: null type: None
[junit4] 2> 1602756 INFO (zkConnectionManagerCallback-15259-thread-1) [ ] o.a.s.c.c.ConnectionManager zkClient has connected
[junit4] 2> 1602756 INFO (TEST-ShardSplitTest.testSplitStaticIndexReplicationLink-seed#[2C002CD9F9A483ED]) [n:127.0.0.1:38407_ ] o.a.s.c.c.ConnectionManager Client is connected to ZooKeeper
[junit4] 2> 1602756 DEBUG (TEST-ShardSplitTest.testSplitStaticIndexReplicationLink-seed#[2C002CD9F9A483ED]) [n:127.0.0.1:38407_ ] o.a.s.c.c.SolrZkClient makePath: /overseer/collection-map-running
[junit4] 2> 1602758 DEBUG (TEST-ShardSplitTest.testSplitStaticIndexReplicationLink-seed#[2C002CD9F9A483ED]) [n:127.0.0.1:38407_ ] o.a.s.c.c.SolrZkClient makePath: /overseer/collection-map-completed
[junit4] 2> 1602759 DEBUG (TEST-ShardSplitTest.testSplitStaticIndexReplicationLink-seed#[2C002CD9F9A483ED]) [n:127.0.0.1:38407_ ] o.a.s.c.c.SolrZkClient makePath: /overseer/collection-map-failure
[junit4] 2> 1602760 DEBUG (TEST-ShardSplitTest.testSplitStaticIndexReplicationLink-seed#[2C002CD9F9A483ED]) [n:127.0.0.1:38407_ ] o.a.s.c.c.SolrZkClient makePath: /overseer/async_ids
[junit4] 2> 1602761 DEBUG (TEST-ShardSplitTest.testSplitStaticIndexReplicationLink-seed#[2C002CD9F9A483ED]) [n:127.0.0.1:38407_ ] o.a.s.c.c.SolrZkClient makePath: /live_nodes
[junit4] 2> 1602768 DEBUG (TEST-ShardSplitTest.testSplitStaticIndexReplicationLink-seed#[2C002CD9F9A483ED]) [n:127.0.0.1:38407_ ] o.a.s.c.c.SolrZkClient makePath: /node_roles
[junit4] 2> 1602769 DEBUG (TEST-ShardSplitTest.testSplitStaticIndexReplicationLink-seed#[2C002CD9F9A483ED]) [n:127.0.0.1:38407_ ] o.a.s.c.c.SolrZkClient makePath: /node_roles/data
[junit4] 2> 1602770 DEBUG (TEST-ShardSplitTest.testSplitStaticIndexReplicationLink-seed#[2C002CD9F9A483ED]) [n:127.0.0.1:38407_ ] o.a.s.c.c.SolrZkClient makePath: /node_roles/data/on
[junit4] 2> 1602771 DEBUG (TEST-ShardSplitTest.testSplitStaticIndexReplicationLink-seed#[2C002CD9F9A483ED]) [n:127.0.0.1:38407_ ] o.a.s.c.c.SolrZkClient makePath: /node_roles/data/off
[junit4] 2> 1602772 DEBUG (TEST-ShardSplitTest.testSplitStaticIndexReplicationLink-seed#[2C002CD9F9A483ED]) [n:127.0.0.1:38407_ ] o.a.s.c.c.SolrZkClient makePath: /node_roles/overseer
[junit4] 2> 1602773 DEBUG (TEST-ShardSplitTest.testSplitStaticIndexReplicationLink-seed#[2C002CD9F9A483ED]) [n:127.0.0.1:38407_ ] o.a.s.c.c.SolrZkClient makePath: /node_roles/overseer/allowed
[junit4] 2> 1602784 DEBUG (TEST-ShardSplitTest.testSplitStaticIndexReplicationLink-seed#[2C002CD9F9A483ED]) [n:127.0.0.1:38407_ ] o.a.s.c.c.SolrZkClient makePath: /node_roles/overseer/preferred
[junit4] 2> 1602785 DEBUG (TEST-ShardSplitTest.testSplitStaticIndexReplicationLink-seed#[2C002CD9F9A483ED]) [n:127.0.0.1:38407_ ] o.a.s.c.c.SolrZkClient makePath: /node_roles/overseer/disallowed
[junit4] 2> 1602786 DEBUG (TEST-ShardSplitTest.testSplitStaticIndexReplicationLink-seed#[2C002CD9F9A483ED]) [n:127.0.0.1:38407_ ] o.a.s.c.c.SolrZkClient makePath: /node_roles/coordinator
[junit4] 2> 1602787 DEBUG (TEST-ShardSplitTest.testSplitStaticIndexReplicationLink-seed#[2C002CD9F9A483ED]) [n:127.0.0.1:38407_ ] o.a.s.c.c.SolrZkClient makePath: /node_roles/coordinator/on
[junit4] 2> 1602788 DEBUG (TEST-ShardSplitTest.testSplitStaticIndexReplicationLink-seed#[2C002CD9F9A483ED]) [n:127.0.0.1:38407_ ] o.a.s.c.c.SolrZkClient makePath: /node_roles/coordinator/off
[junit4] 2> 1602790 DEBUG (TEST-ShardSplitTest.testSplitStaticIndexReplicationLink-seed#[2C002CD9F9A483ED]) [n:127.0.0.1:38407_ ] o.a.s.c.c.SolrZkClient makePath: /aliases.json
[junit4] 2> 1602790 DEBUG (TEST-ShardSplitTest.testSplitStaticIndexReplicationLink-seed#[2C002CD9F9A483ED]) [n:127.0.0.1:38407_ ] o.a.s.c.c.SolrZkClient makePath: /autoscaling/events
[junit4] 2> 1602791 DEBUG (TEST-ShardSplitTest.testSplitStaticIndexReplicationLink-seed#[2C002CD9F9A483ED]) [n:127.0.0.1:38407_ ] o.a.s.c.c.SolrZkClient makePath: /autoscaling/triggerState
[junit4] 2> 1602792 DEBUG (TEST-ShardSplitTest.testSplitStaticIndexReplicationLink-seed#[2C002CD9F9A483ED]) [n:127.0.0.1:38407_ ] o.a.s.c.c.SolrZkClient makePath: /autoscaling/nodeAdded
[junit4] 2> 1602793 DEBUG (TEST-ShardSplitTest.testSplitStaticIndexReplicationLink-seed#[2C002CD9F9A483ED]) [n:127.0.0.1:38407_ ] o.a.s.c.c.SolrZkClient makePath: /autoscaling/nodeLost
[junit4] 2> 1602793 DEBUG (TEST-ShardSplitTest.testSplitStaticIndexReplicationLink-seed#[2C002CD9F9A483ED]) [n:127.0.0.1:38407_ ] o.a.s.c.c.SolrZkClient makePath: /clusterstate.json
[junit4] 2> 1602794 DEBUG (TEST-ShardSplitTest.testSplitStaticIndexReplicationLink-seed#[2C002CD9F9A483ED]) [n:127.0.0.1:38407_ ] o.a.s.c.c.SolrZkClient makePath: /autoscaling.json
[junit4] 2> 1602795 DEBUG (TEST-ShardSplitTest.testSplitStaticIndexReplicationLink-seed#[2C002CD9F9A483ED]) [n:127.0.0.1:38407_ ] o.a.s.c.c.SolrZkClient makePath: /security.json
[junit4] 2> 1602796 DEBUG (TEST-ShardSplitTest.testSplitStaticIndexReplicationLink-seed#[2C002CD9F9A483ED]) [n:127.0.0.1:38407_ ] o.a.s.c.c.SolrZkClient makePath: /configs/_default/protwords.txt
[junit4] 2> 1602798 DEBUG (TEST-ShardSplitTest.testSplitStaticIndexReplicationLink-seed#[2C002CD9F9A483ED]) [n:127.0.0.1:38407_ ] o.a.s.c.c.SolrZkClient makePath: /configs/_default/solrconfig.xml
[junit4] 2> 1602800 DEBUG (TEST-ShardSplitTest.testSplitStaticIndexReplicationLink-seed#[2C002CD9F9A483ED]) [n:127.0.0.1:38407_ ] o.a.s.c.c.SolrZkClient makePath: /configs/_default/synonyms.txt
[junit4] 2> 1602802 DEBUG (TEST-ShardSplitTest.testSplitStaticIndexReplicationLink-seed#[2C002CD9F9A483ED]) [n:127.0.0.1:38407_ ] o.a.s.c.c.SolrZkClient makePath: /configs/_default/managed-schema
[junit4] 2> 1602803 DEBUG (TEST-ShardSplitTest.testSplitStaticIndexReplicationLink-seed#[2C002CD9F9A483ED]) [n:127.0.0.1:38407_ ] o.a.s.c.c.SolrZkClient makePath: /configs/_default/lang/stopwords_hi.txt
[junit4] 2> 1602805 DEBUG (TEST-ShardSplitTest.testSplitStaticIndexReplicationLink-seed#[2C002CD9F9A483ED]) [n:127.0.0.1:38407_ ] o.a.s.c.c.SolrZkClient makePath: /configs/_default/lang/stopwords_fa.txt
[junit4] 2> 1602808 DEBUG (TEST-ShardSplitTest.testSplitStaticIndexReplicationLink-seed#[2C002CD9F9A483ED]) [n:127.0.0.1:38407_ ] o.a.s.c.c.SolrZkClient makePath: /configs/_default/lang/stopwords_es.txt
[junit4] 2> 1602809 DEBUG (TEST-ShardSplitTest.testSplitStaticIndexReplicationLink-seed#[2C002CD9F9A483ED]) [n:127.0.0.1:38407_ ] o.a.s.c.c.SolrZkClient makePath: /configs/_default/lang/stopwords_sv.txt
[junit4] 2> 1602810 DEBUG (TEST-ShardSplitTest.testSplitStaticIndexReplicationLink-seed#[2C002CD9F9A483ED]) [n:127.0.0.1:38407_ ] o.a.s.c.c.SolrZkClient makePath: /configs/_default/lang/contractions_ca.txt
[junit4] 2> 1602812 DEBUG (TEST-ShardSplitTest.testSplitStaticIndexReplicationLink-seed#[2C002CD9F9A483ED]) [n:127.0.0.1:38407_ ] o.a.s.c.c.SolrZkClient makePath: /configs/_default/lang/stopwords_it.txt
[junit4] 2> 1602813 DEBUG (TEST-ShardSplitTest.testSplitStaticIndexReplicationLink-seed#[2C002CD9F9A483ED]) [n:127.0.0.1:38407_ ] o.a.s.c.c.SolrZkClient makePath: /configs/_default/lang/stopwords_eu.txt
[junit4] 2> 1602814 DEBUG (TEST-ShardSplitTest.testSplitStaticIndexReplicationLink-seed#[2C002CD9F9A483ED]) [n:127.0.0.1:38407_ ] o.a.s.c.c.SolrZkClient makePath: /configs/_default/lang/stopwords_no.txt
[junit4] 2> 1602816 DEBUG (TEST-ShardSplitTest.testSplitStaticIndexReplicationLink-seed#[2C002CD9F9A483ED]) [n:127.0.0.1:38407_ ] o.a.s.c.c.SolrZkClient makePath: /configs/_default/lang/stopwords_en.txt
[junit4] 2> 1602817 DEBUG (TEST-ShardSplitTest.testSplitStaticIndexReplicationLink-seed#[2C002CD9F9A483ED]) [n:127.0.0.1:38407_ ] o.a.s.c.c.SolrZkClient makePath: /configs/_default/lang/stopwords_et.txt
[junit4] 2> 1602818 DEBUG (TEST-ShardSplitTest.testSplitStaticIndexReplicationLink-seed#[2C002CD9F9A483ED]) [n:127.0.0.1:38407_ ] o.a.s.c.c.SolrZkClient makePath: /configs/_default/lang/stopwords_ar.txt
[junit4] 2> 1602820 DEBUG (TEST-ShardSplitTest.testSplitStaticIndexReplicationLink-seed#[2C002CD9F9A483ED]) [n:127.0.0.1:38407_ ] o.a.s.c.c.SolrZkClient makePath: /configs/_default/lang/stopwords_fi.txt
[junit4] 2> 1602821 DEBUG (TEST-ShardSplitTest.testSplitStaticIndexReplicationLink-seed#[2C002CD9F9A483ED]) [n:127.0.0.1:38407_ ] o.a.s.c.c.SolrZkClient makePath: /configs/_default/lang/stopwords_hu.txt
[junit4] 2> 1602822 DEBUG (TEST-ShardSplitTest.testSplitStaticIndexReplicationLink-seed#[2C002CD9F9A483ED]) [n:127.0.0.1:38407_ ] o.a.s.c.c.SolrZkClient makePath: /configs/_default/lang/hyphenations_ga.txt
[junit4] 2> 1602824 DEBUG (TEST-ShardSplitTest.testSplitStaticIndexReplicationLink-seed#[2C002CD9F9A483ED]) [n:127.0.0.1:38407_ ] o.a.s.c.c.SolrZkClient makePath: /configs/_default/lang/stopwords_nl.txt
[junit4] 2> 1602825 DEBUG (TEST-ShardSplitTest.testSplitStaticIndexReplicationLink-seed#[2C002CD9F9A483ED]) [n:127.0.0.1:38407_ ] o.a.s.c.c.SolrZkClient makePath: /configs/_default/lang/stopwords_de.txt
[junit4] 2> 1602833 DEBUG (TEST-ShardSplitTest.testSplitStaticIndexReplicationLink-seed#[2C002CD9F9A483ED]) [n:127.0.0.1:38407_ ] o.a.s.c.c.SolrZkClient makePath: /configs/_default/lang/stopwords_th.txt
[junit4] 2> 1602835 DEBUG (TEST-ShardSplitTest.testSplitStaticIndexReplicationLink-seed#[2C002CD9F9A483ED]) [n:127.0.0.1:38407_ ] o.a.s.c.c.SolrZkClient makePath: /configs/_default/lang/stemdict_nl.txt
[junit4] 2> 1602836 DEBUG (TEST-ShardSplitTest.testSplitStaticIndexReplicationLink-seed#[2C002CD9F9A483ED]) [n:127.0.0.1:38407_ ] o.a.s.c.c.SolrZkClient makePath: /configs/_default/lang/stopwords_ca.txt
[junit4] 2> 1602838 DEBUG (TEST-ShardSplitTest.testSplitStaticIndexReplicationLink-seed#[2C002CD9F9A483ED]) [n:127.0.0.1:38407_ ] o.a.s.c.c.SolrZkClient makePath: /configs/_default/lang/stopwords_bg.txt
[junit4] 2> 1602839 DEBUG (TEST-ShardSplitTest.testSplitStaticIndexReplicationLink-seed#[2C002CD9F9A483ED]) [n:127.0.0.1:38407_ ] o.a.s.c.c.SolrZkClient makePath: /configs/_default/lang/stopwords_gl.txt
[junit4] 2> 1602842 DEBUG (TEST-ShardSplitTest.testSplitStaticIndexReplicationLink-seed#[2C002CD9F9A483ED]) [n:127.0.0.1:38407_ ] o.a.s.c.c.SolrZkClient makePath: /configs/_default/lang/stopwords_da.txt
[junit4] 2> 1602844 DEBUG (TEST-ShardSplitTest.testSplitStaticIndexReplicationLink-seed#[2C002CD9F9A483ED]) [n:127.0.0.1:38407_ ] o.a.s.c.c.SolrZkClient makePath: /configs/_default/lang/stopwords_tr.txt
[junit4] 2> 1602847 DEBUG (TEST-ShardSplitTest.testSplitStaticIndexReplicationLink-seed#[2C002CD9F9A483ED]) [n:127.0.0.1:38407_ ] o.a.s.c.c.SolrZkClient makePath: /configs/_default/lang/contractions_fr.txt
[junit4] 2> 1602849 DEBUG (TEST-ShardSplitTest.testSplitStaticIndexReplicationLink-seed#[2C002CD9F9A483ED]) [n:127.0.0.1:38407_ ] o.a.s.c.c.SolrZkClient makePath: /configs/_default/lang/stopwords_ja.txt
[junit4] 2> 1602851 DEBUG (TEST-ShardSplitTest.testSplitStaticIndexReplicationLink-seed#[2C002CD9F9A483ED]) [n:127.0.0.1:38407_ ] o.a.s.c.c.SolrZkClient makePath: /configs/_default/lang/stopwords_hy.txt
[junit4] 2> 1602854 DEBUG (TEST-ShardSplitTest.testSplitStaticIndexReplicationLink-seed#[2C002CD9F9A483ED]) [n:127.0.0.1:38407_ ] o.a.s.c.c.SolrZkClient makePath: /configs/_default/lang/stoptags_ja.txt
[junit4] 2> 1602857 DEBUG (TEST-ShardSplitTest.testSplitStaticIndexReplicationLink-seed#[2C002CD9F9A483ED]) [n:127.0.0.1:38407_ ] o.a.s.c.c.SolrZkClient makePath: /configs/_default/lang/contractions_it.txt
[junit4] 2> 1602864 DEBUG (TEST-ShardSplitTest.testSplitStaticIndexReplicationLink-seed#[2C002CD9F9A483ED]) [n:127.0.0.1:38407_ ] o.a.s.c.c.SolrZkClient makePath: /configs/_default/lang/stopwords_cz.txt
[junit4] 2> 1602866 DEBUG (TEST-ShardSplitTest.testSplitStaticIndexReplicationLink-seed#[2C002CD9F9A483ED]) [n:127.0.0.1:38407_ ] o.a.s.c.c.SolrZkClient makePath: /configs/_default/lang/stopwords_id.txt
[junit4] 2> 1602868 DEBUG (TEST-ShardSplitTest.testSplitStaticIndexReplicationLink-seed#[2C002CD9F9A483ED]) [n:127.0.0.1:38407_ ] o.a.s.c.c.SolrZkClient makePath: /configs/_default/lang/stopwords_ro.txt
[junit4] 2> 1602870 DEBUG (TEST-ShardSplitTest.testSplitStaticIndexReplicationLink-seed#[2C002CD9F9A483ED]) [n:127.0.0.1:38407_ ] o.a.s.c.c.SolrZkClient makePath: /configs/_default/lang/userdict_ja.txt
[junit4] 2> 1602872 DEBUG (TEST-ShardSplitTest.testSplitStaticIndexReplicationLink-seed#[2C002CD9F9A483ED]) [n:127.0.0.1:38407_ ] o.a.s.c.c.SolrZkClient makePath: /configs/_default/lang/stopwords_el.txt
[junit4] 2> 1602875 DEBUG (TEST-ShardSplitTest.testSplitStaticIndexReplicationLink-seed#[2C002CD9F9A483ED]) [n:127.0.0.1:38407_ ] o.a.s.c.c.SolrZkClient makePath: /configs/_default/lang/stopwords_ga.txt
[junit4] 2> 1602877 DEBUG (TEST-ShardSplitTest.testSplitStaticIndexReplicationLink-seed#[2C002CD9F9A483ED]) [n:127.0.0.1:38407_ ] o.a.s.c.c.SolrZkClient makePath: /configs/_default/lang/stopwords_fr.txt
[junit4] 2> 1602879 DEBUG (TEST-ShardSplitTest.testSplitStaticIndexReplicationLink-seed#[2C002CD9F9A483ED]) [n:127.0.0.1:38407_ ] o.a.s.c.c.SolrZkClient makePath: /configs/_default/lang/contractions_ga.txt
[junit4] 2> 1602880 DEBUG (TEST-ShardSplitTest.testSplitStaticIndexReplicationLink-seed#[2C002CD9F9A483ED]) [n:127.0.0.1:38407_ ] o.a.s.c.c.SolrZkClient makePath: /configs/_default/lang/stopwords_lv.txt
[junit4] 2> 1602881 DEBUG (TEST-ShardSplitTest.testSplitStaticIndexReplicationLink-seed#[2C002CD9F9A483ED]) [n:127.0.0.1:38407_ ] o.a.s.c.c.SolrZkClient makePath: /configs/_default/lang/stopwords_ru.txt
[junit4] 2> 1602882 DEBUG (TEST-ShardSplitTest.testSplitStaticIndexReplicationLink-seed#[2C002CD9F9A483ED]) [n:127.0.0.1:38407_ ] o.a.s.c.c.SolrZkClient makePath: /configs/_default/lang/stopwords_pt.txt
[junit4] 2> 1602884 DEBUG (TEST-ShardSplitTest.testSplitStaticIndexReplicationLink-seed#[2C002CD9F9A483ED]) [n:127.0.0.1:38407_ ] o.a.s.c.c.SolrZkClient makePath: /configs/_default/stopwords.txt
[junit4] 2> 1602885 WARN (TEST-ShardSplitTest.testSplitStaticIndexReplicationLink-seed#[2C002CD9F9A483ED]) [n:127.0.0.1:38407_ ] o.a.s.c.ZkController Contents of zookeeper /security.json are world-readable; consider setting up ACLs as described in https://solr.apache.org/guide/zookeeper-access-control.html
[junit4] 2> 1602885 DEBUG (TEST-ShardSplitTest.testSplitStaticIndexReplicationLink-seed#[2C002CD9F9A483ED]) [n:127.0.0.1:38407_ ] o.a.s.c.c.ZkStateReader Updating cluster state from ZooKeeper...
[junit4] 2> 1602886 DEBUG (TEST-ShardSplitTest.testSplitStaticIndexReplicationLink-seed#[2C002CD9F9A483ED]) [n:127.0.0.1:38407_ ] o.a.s.c.c.ZkStateReader Loaded cluster properties: {legacyCloud=true}
[junit4] 2> 1602886 DEBUG (TEST-ShardSplitTest.testSplitStaticIndexReplicationLink-seed#[2C002CD9F9A483ED]) [n:127.0.0.1:38407_ ] o.a.s.c.c.ZkStateReader Updated live nodes from ZooKeeper... [] -> []
[junit4] 2> 1602887 DEBUG (TEST-ShardSplitTest.testSplitStaticIndexReplicationLink-seed#[2C002CD9F9A483ED]) [n:127.0.0.1:38407_ ] o.a.s.c.c.ZkStateReader clusterStateSet: legacy [0] interesting [0] watched [0] lazy [2] total [2]
[junit4] 2> 1602887 DEBUG (TEST-ShardSplitTest.testSplitStaticIndexReplicationLink-seed#[2C002CD9F9A483ED]) [n:127.0.0.1:38407_ ] o.a.s.c.c.ZkStateReader$AliasesManager Checking ZK for most up to date Aliases /aliases.json
[junit4] 2> 1602887 DEBUG (TEST-ShardSplitTest.testSplitStaticIndexReplicationLink-seed#[2C002CD9F9A483ED]) [n:127.0.0.1:38407_ ] o.a.s.c.c.ZkStateReader$AliasesManager Aliases: cmp=-1, new definition is: Aliases{collectionAliases={}, collectionAliasProperties={}, zNodeVersion=0}
[junit4] 2> 1602889 DEBUG (TEST-ShardSplitTest.testSplitStaticIndexReplicationLink-seed#[2C002CD9F9A483ED]) [n:127.0.0.1:38407_ ] o.a.s.c.c.SolrZkClient makePath: /overseer_elect
[junit4] 2> 1602889 DEBUG (TEST-ShardSplitTest.testSplitStaticIndexReplicationLink-seed#[2C002CD9F9A483ED]) [n:127.0.0.1:38407_ ] o.a.s.c.c.SolrZkClient makePath: /overseer_elect/election
[junit4] 2> 1602890 INFO (TEST-ShardSplitTest.testSplitStaticIndexReplicationLink-seed#[2C002CD9F9A483ED]) [n:127.0.0.1:38407_ ] o.a.s.c.OverseerElectionContext I am going to be the leader 127.0.0.1:38407_
[junit4] 2> 1602890 DEBUG (TEST-ShardSplitTest.testSplitStaticIndexReplicationLink-seed#[2C002CD9F9A483ED]) [n:127.0.0.1:38407_ ] o.a.s.c.c.SolrZkClient makePath: /overseer_elect/leader
[junit4] 2> 1602891 INFO (TEST-ShardSplitTest.testSplitStaticIndexReplicationLink-seed#[2C002CD9F9A483ED]) [n:127.0.0.1:38407_ ] o.a.s.c.Overseer Overseer (id=72082324332609540-127.0.0.1:38407_-n_0000000000) starting
[junit4] 2> 1602892 DEBUG (TEST-ShardSplitTest.testSplitStaticIndexReplicationLink-seed#[2C002CD9F9A483ED]) [n:127.0.0.1:38407_ ] o.a.s.c.c.SolrZkClient makePath: /overseer/queue
[junit4] 2> 1602892 DEBUG (TEST-ShardSplitTest.testSplitStaticIndexReplicationLink-seed#[2C002CD9F9A483ED]) [n:127.0.0.1:38407_ ] o.a.s.c.c.SolrZkClient makePath: /overseer/queue-work
[junit4] 2> 1602902 DEBUG (TEST-ShardSplitTest.testSplitStaticIndexReplicationLink-seed#[2C002CD9F9A483ED]) [n:127.0.0.1:38407_ ] o.a.s.c.c.SolrZkClient makePath: /overseer/collection-queue-work
[junit4] 2> 1602904 INFO (OverseerStateUpdate-72082324332609540-127.0.0.1:38407_-n_0000000000) [n:127.0.0.1:38407_ ] o.a.s.c.Overseer Starting to work on the main queue : 127.0.0.1:38407_
[junit4] 2> 1602904 DEBUG (OverseerCollectionConfigSetProcessor-72082324332609540-127.0.0.1:38407_-n_0000000000) [n:127.0.0.1:38407_ ] o.a.s.c.OverseerTaskProcessor Process current queue of overseer operations
[junit4] 2> 1602904 INFO (TEST-ShardSplitTest.testSplitStaticIndexReplicationLink-seed#[2C002CD9F9A483ED]) [n:127.0.0.1:38407_ ] o.a.s.c.ZkController Register node as live in ZooKeeper:/live_nodes/127.0.0.1:38407_
[junit4] 2> 1602905 DEBUG (OverseerStateUpdate-72082324332609540-127.0.0.1:38407_-n_0000000000) [n:127.0.0.1:38407_ ] o.a.s.c.c.ZkStateReader Updated live nodes from ZooKeeper... [] -> []
[junit4] 2> 1602905 DEBUG (TEST-ShardSplitTest.testSplitStaticIndexReplicationLink-seed#[2C002CD9F9A483ED]-EventThread) [ ] o.a.s.c.c.SolrZkClient Submitting job to respond to event WatchedEvent state:SyncConnected type:NodeChildrenChanged path:/live_nodes
[junit4] 2> 1602905 DEBUG (OverseerStateUpdate-72082324332609540-127.0.0.1:38407_-n_0000000000) [n:127.0.0.1:38407_ ] o.a.s.c.c.ZkStateReader clusterStateSet: legacy [0] interesting [0] watched [0] lazy [2] total [2]
[junit4] 2> 1602905 DEBUG (zkCallback-15258-thread-1) [ ] o.a.s.c.c.ZkStateReader A live node change: [WatchedEvent state:SyncConnected type:NodeChildrenChanged path:/live_nodes], has occurred - updating... (live nodes size: [0])
[junit4] 2> 1602906 DEBUG (OverseerCollectionConfigSetProcessor-72082324332609540-127.0.0.1:38407_-n_0000000000) [n:127.0.0.1:38407_ ] o.a.s.c.OverseerTaskProcessor Cleaning up work-queue. #Running tasks: 0 #Completed tasks: 0
[junit4] 2> 1602906 DEBUG (OverseerCollectionConfigSetProcessor-72082324332609540-127.0.0.1:38407_-n_0000000000) [n:127.0.0.1:38407_ ] o.a.s.c.OverseerTaskProcessor RunningTasks: []
[junit4] 2> 1602906 DEBUG (OverseerCollectionConfigSetProcessor-72082324332609540-127.0.0.1:38407_-n_0000000000) [n:127.0.0.1:38407_ ] o.a.s.c.OverseerTaskProcessor BlockedTasks: []
[junit4] 2> 1602906 DEBUG (OverseerCollectionConfigSetProcessor-72082324332609540-127.0.0.1:38407_-n_0000000000) [n:127.0.0.1:38407_ ] o.a.s.c.OverseerTaskProcessor CompletedTasks: []
[junit4] 2> 1602906 INFO (OverseerCollectionConfigSetProcessor-72082324332609540-127.0.0.1:38407_-n_0000000000) [n:127.0.0.1:38407_ ] o.a.s.c.OverseerTaskProcessor RunningZKTasks: []
[junit4] 2> 1602906 INFO (zkCallback-15258-thread-1) [ ] o.a.s.c.c.ZkStateReader Updated live nodes from ZooKeeper... (0) -> (1)
[junit4] 2> 1602906 DEBUG (zkCallback-15258-thread-1) [ ] o.a.s.c.c.ZkStateReader Updated live nodes from ZooKeeper... [] -> [127.0.0.1:38407_]
[junit4] 2> 1602907 DEBUG (OverseerAutoScalingTriggerThread-72082324332609540-127.0.0.1:38407_-n_0000000000) [ ] o.a.s.c.c.SolrZkClient makePath: /autoscaling/events/.scheduled_maintenance
[junit4] 2> 1602909 INFO (TEST-ShardSplitTest.testSplitStaticIndexReplicationLink-seed#[2C002CD9F9A483ED]) [n:127.0.0.1:38407_ ] o.a.s.c.ZkController non-data nodes now []
[junit4] 2> 1602912 DEBUG (OverseerAutoScalingTriggerThread-72082324332609540-127.0.0.1:38407_-n_0000000000) [ ] o.a.s.c.c.SolrZkClient makePath: /autoscaling/events/.auto_add_replicas
[junit4] 2> 1602913 INFO (TEST-ShardSplitTest.testSplitStaticIndexReplicationLink-seed#[2C002CD9F9A483ED]) [n:127.0.0.1:38407_ ] o.a.s.p.PackageLoader /packages.json updated to version -1
[junit4] 2> 1602914 WARN (TEST-ShardSplitTest.testSplitStaticIndexReplicationLink-seed#[2C002CD9F9A483ED]) [n:127.0.0.1:38407_ ] o.a.s.c.CoreContainer Not all security plugins configured! authentication=disabled authorization=disabled. Solr is only as secure as you make it. Consider configuring authentication/authorization before exposing Solr to users internal or external. See https://s.apache.org/solrsecurity for more info
[junit4] 2> 1602938 INFO (TEST-ShardSplitTest.testSplitStaticIndexReplicationLink-seed#[2C002CD9F9A483ED]) [n:127.0.0.1:38407_ ] o.a.s.h.a.MetricsHistoryHandler No .system collection, keeping metrics history in memory.
[junit4] 2> 1602959 INFO (TEST-ShardSplitTest.testSplitStaticIndexReplicationLink-seed#[2C002CD9F9A483ED]) [n:127.0.0.1:38407_ ] o.a.s.m.r.SolrJmxReporter JMX monitoring for 'solr.node' (registry 'solr.node') enabled at server: com.sun.jmx.mbeanserver.JmxMBeanServer@61cad526
[junit4] 2> 1602967 INFO (TEST-ShardSplitTest.testSplitStaticIndexReplicationLink-seed#[2C002CD9F9A483ED]) [n:127.0.0.1:38407_ ] o.a.s.m.r.SolrJmxReporter JMX monitoring for 'solr.jvm' (registry 'solr.jvm') enabled at server: com.sun.jmx.mbeanserver.JmxMBeanServer@61cad526
[junit4] 2> 1602967 INFO (TEST-ShardSplitTest.testSplitStaticIndexReplicationLink-seed#[2C002CD9F9A483ED]) [n:127.0.0.1:38407_ ] o.a.s.m.r.SolrJmxReporter JMX monitoring for 'solr.jetty' (registry 'solr.jetty') enabled at server: com.sun.jmx.mbeanserver.JmxMBeanServer@61cad526
[junit4] 2> 1602968 INFO (TEST-ShardSplitTest.testSplitStaticIndexReplicationLink-seed#[2C002CD9F9A483ED]) [n:127.0.0.1:38407_ ] o.a.s.c.CorePropertiesLocator Found 0 core definitions underneath /home/jenkins/jenkins-slave/workspace/Lucene/Lucene-Solr-Tests-8.11/solr/build/solr-core/test/J0/temp/solr.cloud.api.collections.ShardSplitTest_2C002CD9F9A483ED-001/control-001/cores
[junit4] 2> 1602982 DEBUG (TEST-ShardSplitTest.testSplitStaticIndexReplicationLink-seed#[2C002CD9F9A483ED]) [ ] o.a.s.c.c.SolrZkClient Using default ZkCredentialsProvider
[junit4] 2> 1602983 INFO (TEST-ShardSplitTest.testSplitStaticIndexReplicationLink-seed#[2C002CD9F9A483ED]) [ ] o.a.s.c.c.ConnectionManager Waiting for client to connect to ZooKeeper
[junit4] 2> 1602983 DEBUG (TEST-ShardSplitTest.testSplitStaticIndexReplicationLink-seed#[2C002CD9F9A483ED]-EventThread) [ ] o.a.s.c.c.SolrZkClient Submitting job to respond to event WatchedEvent state:SyncConnected type:None path:null
[junit4] 2> 1602984 DEBUG (zkConnectionManagerCallback-15276-thread-1) [ ] o.a.s.c.c.ConnectionManager Watcher org.apache.solr.common.cloud.ConnectionManager@506eccee name: ZooKeeperConnection Watcher:127.0.0.1:42821/solr got event WatchedEvent state:SyncConnected type:None path:null path: null type: None
[junit4] 2> 1602984 INFO (zkConnectionManagerCallback-15276-thread-1) [ ] o.a.s.c.c.ConnectionManager zkClient has connected
[junit4] 2> 1602984 INFO (TEST-ShardSplitTest.testSplitStaticIndexReplicationLink-seed#[2C002CD9F9A483ED]) [ ] o.a.s.c.c.ConnectionManager Client is connected to ZooKeeper
[junit4] 2> 1602984 DEBUG (TEST-ShardSplitTest.testSplitStaticIndexReplicationLink-seed#[2C002CD9F9A483ED]) [ ] o.a.s.c.c.SolrZkClient Using default ZkACLProvider
[junit4] 2> 1602984 DEBUG (TEST-ShardSplitTest.testSplitStaticIndexReplicationLink-seed#[2C002CD9F9A483ED]) [ ] o.a.s.c.c.ZkStateReader Updating cluster state from ZooKeeper...
[junit4] 2> 1602985 DEBUG (TEST-ShardSplitTest.testSplitStaticIndexReplicationLink-seed#[2C002CD9F9A483ED]) [ ] o.a.s.c.c.ZkStateReader Loaded cluster properties: {legacyCloud=true}
[junit4] 2> 1602985 INFO (TEST-ShardSplitTest.testSplitStaticIndexReplicationLink-seed#[2C002CD9F9A483ED]) [ ] o.a.s.c.c.ZkStateReader Updated live nodes from ZooKeeper... (0) -> (1)
[junit4] 2> 1602985 DEBUG (TEST-ShardSplitTest.testSplitStaticIndexReplicationLink-seed#[2C002CD9F9A483ED]) [ ] o.a.s.c.c.ZkStateReader Updated live nodes from ZooKeeper... [] -> [127.0.0.1:38407_]
[junit4] 2> 1602986 DEBUG (TEST-ShardSplitTest.testSplitStaticIndexReplicationLink-seed#[2C002CD9F9A483ED]) [ ] o.a.s.c.c.ZkStateReader clusterStateSet: legacy [0] interesting [0] watched [0] lazy [2] total [2]
[junit4] 2> 1602986 DEBUG (TEST-ShardSplitTest.testSplitStaticIndexReplicationLink-seed#[2C002CD9F9A483ED]) [ ] o.a.s.c.c.ZkStateReader$AliasesManager Checking ZK for most up to date Aliases /aliases.json
[junit4] 2> 1602986 DEBUG (TEST-ShardSplitTest.testSplitStaticIndexReplicationLink-seed#[2C002CD9F9A483ED]) [ ] o.a.s.c.c.ZkStateReader$AliasesManager Aliases: cmp=-1, new definition is: Aliases{collectionAliases={}, collectionAliasProperties={}, zNodeVersion=0}
[junit4] 2> 1602986 INFO (TEST-ShardSplitTest.testSplitStaticIndexReplicationLink-seed#[2C002CD9F9A483ED]) [ ] o.a.s.c.s.i.ZkClientClusterStateProvider Cluster at 127.0.0.1:42821/solr ready
[junit4] 2> 1602987 INFO (qtp1918162341-24269) [n:127.0.0.1:38407_ ] o.a.s.s.HttpSolrCall HttpSolrCall.init(http://127.0.0.1:38407/admin/collections?action=CREATE&name=control_collection&collection.configName=conf1&createNodeSet=127.0.0.1%3A38407_&numShards=1&nrtReplicas=1&wt=javabin&version=2)
[junit4] 2> 1602989 DEBUG (TEST-ShardSplitTest.testSplitStaticIndexReplicationLink-seed#[2C002CD9F9A483ED]-EventThread) [ ] o.a.s.c.c.SolrZkClient Submitting job to respond to event WatchedEvent state:SyncConnected type:NodeChildrenChanged path:/overseer/collection-queue-work
[junit4] 2> 1602989 DEBUG (TEST-ShardSplitTest.testSplitStaticIndexReplicationLink-seed#[2C002CD9F9A483ED]-EventThread) [ ] o.a.s.c.c.SolrZkClient Submitting job to respond to event WatchedEvent state:SyncConnected type:NodeChildrenChanged path:/overseer/collection-queue-work
[junit4] 2> 1602990 DEBUG (OverseerCollectionConfigSetProcessor-72082324332609540-127.0.0.1:38407_-n_0000000000) [n:127.0.0.1:38407_ ] o.a.s.c.OverseerTaskProcessor Got 1 tasks from work-queue : [[org.apache.solr.cloud.OverseerTaskQueue$QueueEvent@2e684ecf]]
[junit4] 2> 1602990 DEBUG (OverseerCollectionConfigSetProcessor-72082324332609540-127.0.0.1:38407_-n_0000000000) [n:127.0.0.1:38407_ ] o.a.s.c.OverseerTaskProcessor Marked task [/overseer/collection-queue-work/qn-0000000000] as running
[junit4] 2> 1602990 DEBUG (OverseerCollectionConfigSetProcessor-72082324332609540-127.0.0.1:38407_-n_0000000000) [n:127.0.0.1:38407_ ] o.a.s.c.OverseerTaskProcessor Overseer Collection Message Handler: Get the message id: /overseer/collection-queue-work/qn-0000000000 message: {
[junit4] 2> "name":"control_collection",
[junit4] 2> "fromApi":"true",
[junit4] 2> "collection.configName":"conf1",
[junit4] 2> "numShards":"1",
[junit4] 2> "createNodeSet":"127.0.0.1:38407_",
[junit4] 2> "nrtReplicas":"1",
[junit4] 2> "stateFormat":"2",
[junit4] 2> "replicationFactor":"1",
[junit4] 2> "operation":"create"}
[junit4] 2> 1602990 DEBUG (OverseerThreadFactory-15266-thread-1-processing-n:127.0.0.1:38407_) [n:127.0.0.1:38407_ ] o.a.s.c.OverseerTaskProcessor Runner processing /overseer/collection-queue-work/qn-0000000000
[junit4] 2> 1602990 DEBUG (OverseerThreadFactory-15266-thread-1-processing-n:127.0.0.1:38407_) [n:127.0.0.1:38407_ ] o.a.s.c.a.c.OverseerCollectionMessageHandler OverseerCollectionMessageHandler.processMessage : create , {
[junit4] 2> "name":"control_collection",
[junit4] 2> "fromApi":"true",
[junit4] 2> "collection.configName":"conf1",
[junit4] 2> "numShards":"1",
[junit4] 2> "createNodeSet":"127.0.0.1:38407_",
[junit4] 2> "nrtReplicas":"1",
[junit4] 2> "stateFormat":"2",
[junit4] 2> "replicationFactor":"1",
[junit4] 2> "operation":"create"}
[junit4] 2> 1602990 DEBUG (OverseerThreadFactory-15266-thread-1-processing-n:127.0.0.1:38407_) [n:127.0.0.1:38407_ ] o.a.s.c.c.ZkStateReader$AliasesManager Checking ZK for most up to date Aliases /aliases.json
[junit4] 2> 1602990 DEBUG (OverseerCollectionConfigSetProcessor-72082324332609540-127.0.0.1:38407_-n_0000000000) [n:127.0.0.1:38407_ ] o.a.s.c.OverseerTaskProcessor Cleaning up work-queue. #Running tasks: 1 #Completed tasks: 0
[junit4] 2> 1602990 DEBUG (OverseerCollectionConfigSetProcessor-72082324332609540-127.0.0.1:38407_-n_0000000000) [n:127.0.0.1:38407_ ] o.a.s.c.OverseerTaskProcessor RunningTasks: [/overseer/collection-queue-work/qn-0000000000]
[junit4] 2> 1602990 DEBUG (OverseerCollectionConfigSetProcessor-72082324332609540-127.0.0.1:38407_-n_0000000000) [n:127.0.0.1:38407_ ] o.a.s.c.OverseerTaskProcessor BlockedTasks: []
[junit4] 2> 1602990 DEBUG (OverseerCollectionConfigSetProcessor-72082324332609540-127.0.0.1:38407_-n_0000000000) [n:127.0.0.1:38407_ ] o.a.s.c.OverseerTaskProcessor CompletedTasks: []
[junit4] 2> 1602990 INFO (OverseerCollectionConfigSetProcessor-72082324332609540-127.0.0.1:38407_-n_0000000000) [n:127.0.0.1:38407_ ] o.a.s.c.OverseerTaskProcessor RunningZKTasks: [/overseer/collection-queue-work/qn-0000000000]
[junit4] 2> 1602991 DEBUG (OverseerThreadFactory-15266-thread-1-processing-n:127.0.0.1:38407_) [n:127.0.0.1:38407_ ] o.a.s.c.c.ZkStateReader$AliasesManager Aliases: cmp=0, not overwriting ZK version.
[junit4] 2> 1602991 INFO (OverseerThreadFactory-15266-thread-1-processing-n:127.0.0.1:38407_) [n:127.0.0.1:38407_ ] o.a.s.c.a.c.CreateCollectionCmd Create collection control_collection
[junit4] 2> 1602991 DEBUG (OverseerThreadFactory-15266-thread-1-processing-n:127.0.0.1:38407_) [n:127.0.0.1:38407_ ] o.a.s.c.a.c.OverseerCollectionMessageHandler creating collections conf node /collections/control_collection
[junit4] 2> 1602992 DEBUG (OverseerThreadFactory-15266-thread-1-processing-n:127.0.0.1:38407_) [n:127.0.0.1:38407_ ] o.a.s.c.a.c.CreateCollectionCmd Check for collection zkNode: control_collection
[junit4] 2> 1602992 DEBUG (OverseerThreadFactory-15266-thread-1-processing-n:127.0.0.1:38407_) [n:127.0.0.1:38407_ ] o.a.s.c.a.c.CreateCollectionCmd Collection zkNode exists
[junit4] 2> 1602993 DEBUG (TEST-ShardSplitTest.testSplitStaticIndexReplicationLink-seed#[2C002CD9F9A483ED]-EventThread) [ ] o.a.s.c.c.SolrZkClient Submitting job to respond to event WatchedEvent state:SyncConnected type:NodeChildrenChanged path:/overseer/queue
[junit4] 2> 1602993 DEBUG (OverseerStateUpdate-72082324332609540-127.0.0.1:38407_-n_0000000000) [n:127.0.0.1:38407_ ] o.a.s.c.Overseer processMessage: queueSize: 1, message = {
[junit4] 2> "name":"control_collection",
[junit4] 2> "fromApi":"true",
[junit4] 2> "collection.configName":"conf1",
[junit4] 2> "numShards":"1",
[junit4] 2> "createNodeSet":"127.0.0.1:38407_",
[junit4] 2> "nrtReplicas":"1",
[junit4] 2> "stateFormat":"2",
[junit4] 2> "replicationFactor":"1",
[junit4] 2> "operation":"create"} current state version: 0
[junit4] 2> 1602994 DEBUG (OverseerStateUpdate-72082324332609540-127.0.0.1:38407_-n_0000000000) [n:127.0.0.1:38407_ ] o.a.s.c.o.ClusterStateMutator building a new cName: control_collection
[junit4] 2> 1602994 DEBUG (OverseerStateUpdate-72082324332609540-127.0.0.1:38407_-n_0000000000) [n:127.0.0.1:38407_ ] o.a.s.c.o.ZkStateWriter going to create_collection /collections/control_collection/state.json
[junit4] 2> 1602995 DEBUG (TEST-ShardSplitTest.testSplitStaticIndexReplicationLink-seed#[2C002CD9F9A483ED]-EventThread) [ ] o.a.s.c.c.SolrZkClient Submitting job to respond to event WatchedEvent state:SyncConnected type:NodeChildrenChanged path:/overseer/queue
[junit4] 2> 1603095 DEBUG (OverseerThreadFactory-15266-thread-1-processing-n:127.0.0.1:38407_) [n:127.0.0.1:38407_ ] o.a.s.c.a.c.CreateCollectionCmd Creating SolrCores for new collection control_collection, shardNames [shard1] , message : {
[junit4] 2> "name":"control_collection",
[junit4] 2> "fromApi":"true",
[junit4] 2> "collection.configName":"conf1",
[junit4] 2> "numShards":"1",
[junit4] 2> "createNodeSet":"127.0.0.1:38407_",
[junit4] 2> "nrtReplicas":"1",
[junit4] 2> "stateFormat":"2",
[junit4] 2> "replicationFactor":"1",
[junit4] 2> "operation":"create"}
[junit4] 2> 1603096 DEBUG (OverseerThreadFactory-15266-thread-1-processing-n:127.0.0.1:38407_) [n:127.0.0.1:38407_ ] o.a.s.c.a.c.CreateCollectionCmd Creating core control_collection_shard1_replica_n1 as part of shard shard1 of collection control_collection on 127.0.0.1:38407_
[junit4] 2> 1603097 INFO (qtp1918162341-24271) [n:127.0.0.1:38407_ ] o.a.s.s.HttpSolrCall HttpSolrCall.init(http://127.0.0.1:38407/admin/cores?null)
[junit4] 2> 1603098 INFO (qtp1918162341-24271) [n:127.0.0.1:38407_ x:control_collection_shard1_replica_n1 ] o.a.s.h.a.CoreAdminOperation core create command qt=/admin/cores&collection.configName=conf1&newCollection=true&name=control_collection_shard1_replica_n1&action=CREATE&numShards=1&collection=control_collection&shard=shard1&wt=javabin&version=2&replicaType=NRT
[junit4] 2> 1603098 INFO (qtp1918162341-24271) [n:127.0.0.1:38407_ x:control_collection_shard1_replica_n1 ] o.a.s.c.TransientSolrCoreCacheDefault Allocating transient core cache for max 4 cores with initial capacity of 4
[junit4] 2> 1603100 DEBUG (TEST-ShardSplitTest.testSplitStaticIndexReplicationLink-seed#[2C002CD9F9A483ED]-EventThread) [ ] o.a.s.c.c.SolrZkClient Submitting job to respond to event WatchedEvent state:SyncConnected type:NodeChildrenChanged path:/overseer/queue
[junit4] 2> 1603101 DEBUG (OverseerStateUpdate-72082324332609540-127.0.0.1:38407_-n_0000000000) [n:127.0.0.1:38407_ ] o.a.s.c.Overseer processMessage: queueSize: 1, message = {
[junit4] 2> "core":"control_collection_shard1_replica_n1",
[junit4] 2> "roles":null,
[junit4] 2> "node_name":"127.0.0.1:38407_",
[junit4] 2> "base_url":"http://127.0.0.1:38407",
[junit4] 2> "numShards":"1",
[junit4] 2> "state":"down",
[junit4] 2> "shard":"shard1",
[junit4] 2> "collection":"control_collection",
[junit4] 2> "type":"NRT",
[junit4] 2> "operation":"state"} current state version: 0
[junit4] 2> 1603101 DEBUG (OverseerStateUpdate-72082324332609540-127.0.0.1:38407_-n_0000000000) [n:127.0.0.1:38407_ ] o.a.s.c.o.ReplicaMutator Update state numShards=1 message={
[junit4] 2> "core":"control_collection_shard1_replica_n1",
[junit4] 2> "roles":null,
[junit4] 2> "node_name":"127.0.0.1:38407_",
[junit4] 2> "base_url":"http://127.0.0.1:38407",
[junit4] 2> "numShards":"1",
[junit4] 2> "state":"down",
[junit4] 2> "shard":"shard1",
[junit4] 2> "collection":"control_collection",
[junit4] 2> "type":"NRT",
[junit4] 2> "operation":"state"}
[junit4] 2> 1603102 DEBUG (OverseerStateUpdate-72082324332609540-127.0.0.1:38407_-n_0000000000) [n:127.0.0.1:38407_ ] o.a.s.c.o.ReplicaMutator Will update state for replica: core_node2:{
[junit4] 2> "core":"control_collection_shard1_replica_n1",
[junit4] 2> "node_name":"127.0.0.1:38407_",
[junit4] 2> "base_url":"http://127.0.0.1:38407",
[junit4] 2> "state":"down",
[junit4] 2> "type":"NRT"}
[junit4] 2> 1603102 DEBUG (OverseerStateUpdate-72082324332609540-127.0.0.1:38407_-n_0000000000) [n:127.0.0.1:38407_ ] o.a.s.c.o.ReplicaMutator Collection is now: DocCollection(control_collection//collections/control_collection/state.json/0 )={
[junit4] 2> "pullReplicas":"0",
[junit4] 2> "replicationFactor":"1",
[junit4] 2> "router":{"name":"compositeId"},
[junit4] 2> "maxShardsPerNode":"1",
[junit4] 2> "autoAddReplicas":"false",
[junit4] 2> "nrtReplicas":"1",
[junit4] 2> "tlogReplicas":"0",
[junit4] 2> "shards":{"shard1":{
[junit4] 2> "range":"80000000-7fffffff",
[junit4] 2> "state":"active",
[junit4] 2> "replicas":{"core_node2":{
[junit4] 2> "core":"control_collection_shard1_replica_n1",
[junit4] 2> "node_name":"127.0.0.1:38407_",
[junit4] 2> "base_url":"http://127.0.0.1:38407",
[junit4] 2> "state":"down",
[junit4] 2> "type":"NRT"}}}}}
[junit4] 2> 1603203 DEBUG (OverseerStateUpdate-72082324332609540-127.0.0.1:38407_-n_0000000000) [n:127.0.0.1:38407_ ] o.a.s.c.o.ZkStateWriter going to update_collection /collections/control_collection/state.json version: 0
[junit4] 2> 1603203 DEBUG (TEST-ShardSplitTest.testSplitStaticIndexReplicationLink-seed#[2C002CD9F9A483ED]-EventThread) [ ] o.a.s.c.c.SolrZkClient Submitting job to respond to event WatchedEvent state:SyncConnected type:NodeChildrenChanged path:/overseer/queue
[junit4] 2> 1604102 DEBUG (qtp1918162341-24271) [n:127.0.0.1:38407_ c:control_collection s:shard1 x:control_collection_shard1_replica_n1 ] o.a.s.c.c.ZkStateReader Loading collection config from: [/collections/control_collection]
[junit4] 2> 1604110 INFO (qtp1918162341-24271) [n:127.0.0.1:38407_ c:control_collection s:shard1 x:control_collection_shard1_replica_n1 ] o.a.s.c.SolrConfig Using Lucene MatchVersion: 8.11.4
[junit4] 2> 1604110 WARN (qtp1918162341-24271) [n:127.0.0.1:38407_ c:control_collection s:shard1 x:control_collection_shard1_replica_n1 ] o.a.s.c.SolrConfig solrconfig.xml: <jmx> is no longer supported, use solr.xml:/metrics/reporter section instead
[junit4] 2> 1604113 INFO (qtp1918162341-24271) [n:127.0.0.1:38407_ c:control_collection s:shard1 x:control_collection_shard1_replica_n1 ] o.a.s.s.IndexSchema Schema name=test
[junit4] 2> 1604117 INFO (qtp1918162341-24271) [n:127.0.0.1:38407_ c:control_collection s:shard1 x:control_collection_shard1_replica_n1 ] o.a.s.s.IndexSchema Loaded schema test/1.6 with uniqueid field id
[junit4] 2> 1604134 INFO (qtp1918162341-24271) [n:127.0.0.1:38407_ c:control_collection s:shard1 x:control_collection_shard1_replica_n1 ] o.a.s.c.CoreContainer Creating SolrCore 'control_collection_shard1_replica_n1' using configuration from configset conf1, trusted=true
[junit4] 2> 1604134 INFO (qtp1918162341-24271) [n:127.0.0.1:38407_ c:control_collection s:shard1 x:control_collection_shard1_replica_n1 ] o.a.s.m.r.SolrJmxReporter JMX monitoring for 'solr.core.control_collection.shard1.replica_n1' (registry 'solr.core.control_collection.shard1.replica_n1') enabled at server: com.sun.jmx.mbeanserver.JmxMBeanServer@61cad526
[junit4] 2> 1604134 INFO (qtp1918162341-24271) [n:127.0.0.1:38407_ c:control_collection s:shard1 x:control_collection_shard1_replica_n1 ] o.a.s.c.SolrCore [[control_collection_shard1_replica_n1] ] Opening new SolrCore at [/home/jenkins/jenkins-slave/workspace/Lucene/Lucene-Solr-Tests-8.11/solr/build/solr-core/test/J0/temp/solr.cloud.api.collections.ShardSplitTest_2C002CD9F9A483ED-001/control-001/cores/control_collection_shard1_replica_n1], dataDir=[/home/jenkins/jenkins-slave/workspace/Lucene/Lucene-Solr-Tests-8.11/solr/build/solr-core/test/J0/temp/solr.cloud.api.collections.ShardSplitTest_2C002CD9F9A483ED-001/control-001/cores/control_collection_shard1_replica_n1/data/]
[junit4] 2> 1604137 INFO (qtp1918162341-24271) [n:127.0.0.1:38407_ c:control_collection s:shard1 x:control_collection_shard1_replica_n1 ] o.a.s.u.RandomMergePolicy RandomMergePolicy wrapping class org.apache.lucene.index.TieredMergePolicy: [TieredMergePolicy: maxMergeAtOnce=16, maxMergeAtOnceExplicit=20, maxMergedSegmentMB=17.63671875, floorSegmentMB=1.92578125, forceMergeDeletesPctAllowed=25.634228574367686, segmentsPerTier=19.0, maxCFSSegmentSizeMB=8.796093022207999E12, noCFSRatio=1.0, deletesPctAllowed=43.85848294920645
[junit4] 2> 1604411 WARN (qtp1918162341-24271) [n:127.0.0.1:38407_ c:control_collection s:shard1 x:control_collection_shard1_replica_n1 ] o.a.s.c.RequestHandlers INVALID paramSet a in requestHandler {type = requestHandler,name = /dump,class = DumpRequestHandler,attributes = {initParams=a, name=/dump, class=DumpRequestHandler},args = {defaults={a=A,b=B}}}
[junit4] 2> 1604456 INFO (qtp1918162341-24271) [n:127.0.0.1:38407_ c:control_collection s:shard1 x:control_collection_shard1_replica_n1 ] o.a.s.u.UpdateHandler Using UpdateLog implementation: org.apache.solr.update.UpdateLog
[junit4] 2> 1604456 INFO (qtp1918162341-24271) [n:127.0.0.1:38407_ c:control_collection s:shard1 x:control_collection_shard1_replica_n1 ] o.a.s.u.UpdateLog Initializing UpdateLog: dataDir= defaultSyncLevel=FLUSH numRecordsToKeep=100 maxNumLogsToKeep=10 numVersionBuckets=65536
[junit4] 2> 1604457 INFO (qtp1918162341-24271) [n:127.0.0.1:38407_ c:control_collection s:shard1 x:control_collection_shard1_replica_n1 ] o.a.s.u.CommitTracker Hard AutoCommit: disabled
[junit4] 2> 1604457 INFO (qtp1918162341-24271) [n:127.0.0.1:38407_ c:control_collection s:shard1 x:control_collection_shard1_replica_n1 ] o.a.s.u.CommitTracker Soft AutoCommit: disabled
[junit4] 2> 1604458 INFO (qtp1918162341-24271) [n:127.0.0.1:38407_ c:control_collection s:shard1 x:control_collection_shard1_replica_n1 ] o.a.s.u.RandomMergePolicy RandomMergePolicy wrapping class org.apache.lucene.index.TieredMergePolicy: [TieredMergePolicy: maxMergeAtOnce=46, maxMergeAtOnceExplicit=24, maxMergedSegmentMB=62.5244140625, floorSegmentMB=0.73828125, forceMergeDeletesPctAllowed=12.496415342957606, segmentsPerTier=19.0, maxCFSSegmentSizeMB=8.796093022207999E12, noCFSRatio=0.8751658799467819, deletesPctAllowed=32.71841902801273
[junit4] 2> 1604461 DEBUG (qtp1918162341-24271) [n:127.0.0.1:38407_ c:control_collection s:shard1 x:control_collection_shard1_replica_n1 ] o.a.s.c.c.ZkStateReader Loading collection config from: [/collections/control_collection]
[junit4] 2> 1604461 INFO (qtp1918162341-24271) [n:127.0.0.1:38407_ c:control_collection s:shard1 x:control_collection_shard1_replica_n1 ] o.a.s.r.ManagedResourceStorage Configured ZooKeeperStorageIO with znodeBase: /configs/conf1
[junit4] 2> 1604462 INFO (qtp1918162341-24271) [n:127.0.0.1:38407_ c:control_collection s:shard1 x:control_collection_shard1_replica_n1 ] o.a.s.r.ManagedResourceStorage Loaded null at path _rest_managed.json using ZooKeeperStorageIO:path=/configs/conf1
[junit4] 2> 1604462 INFO (qtp1918162341-24271) [n:127.0.0.1:38407_ c:control_collection s:shard1 x:control_collection_shard1_replica_n1 ] o.a.s.h.ReplicationHandler Commits will be reserved for 10000 ms
[junit4] 2> 1604462 INFO (qtp1918162341-24271) [n:127.0.0.1:38407_ c:control_collection s:shard1 x:control_collection_shard1_replica_n1 ] o.a.s.u.UpdateLog Could not find max version in index or recent updates, using new clock 1793243357645897728
[junit4] 2> 1604464 DEBUG (qtp1918162341-24271) [n:127.0.0.1:38407_ c:control_collection s:shard1 x:control_collection_shard1_replica_n1 ] o.a.s.c.c.ZkStateReader Waiting up to 60000ms for state org.apache.solr.cloud.ZkController$$Lambda$767/818785395@750d4dbd
[junit4] 2> 1604464 DEBUG (qtp1918162341-24271) [n:127.0.0.1:38407_ c:control_collection s:shard1 x:control_collection_shard1_replica_n1 ] o.a.s.c.c.ZkStateReader Found org.apache.solr.cloud.ZkController$$Lambda$767/818785395@750d4dbd directly in clusterState
[junit4] 2> 1604465 DEBUG (qtp1918162341-24271) [n:127.0.0.1:38407_ c:control_collection s:shard1 x:control_collection_shard1_replica_n1 ] o.a.s.c.c.SolrZkClient makePath: /collections/control_collection/terms/shard1
[junit4] 2> 1604465 INFO (searcherExecutor-15278-thread-1-processing-n:127.0.0.1:38407_ x:control_collection_shard1_replica_n1 c:control_collection s:shard1) [n:127.0.0.1:38407_ c:control_collection s:shard1 x:control_collection_shard1_replica_n1 ] o.a.s.c.SolrCore [control_collection_shard1_replica_n1] Registered new searcher autowarm time: 0 ms
[junit4] 2> 1604467 DEBUG (TEST-ShardSplitTest.testSplitStaticIndexReplicationLink-seed#[2C002CD9F9A483ED]-EventThread) [ ] o.a.s.c.c.SolrZkClient Submitting job to respond to event WatchedEvent state:SyncConnected type:NodeDataChanged path:/collections/control_collection/terms/shard1
[junit4] 2> 1604467 INFO (qtp1918162341-24271) [n:127.0.0.1:38407_ c:control_collection s:shard1 x:control_collection_shard1_replica_n1 ] o.a.s.c.ZkShardTerms Successful update of terms at /collections/control_collection/terms/shard1 to Terms{values={core_node2=0}, version=0}
[junit4] 2> 1604467 INFO (qtp1918162341-24271) [n:127.0.0.1:38407_ c:control_collection s:shard1 x:control_collection_shard1_replica_n1 ] o.a.s.c.ShardLeaderElectionContextBase make sure parent is created /collections/control_collection/leaders/shard1
[junit4] 2> 1604468 DEBUG (qtp1918162341-24271) [n:127.0.0.1:38407_ c:control_collection s:shard1 x:control_collection_shard1_replica_n1 ] o.a.s.c.c.SolrZkClient makePath: /collections/control_collection/leaders/shard1
[junit4] 2> 1604469 DEBUG (qtp1918162341-24271) [n:127.0.0.1:38407_ c:control_collection s:shard1 x:control_collection_shard1_replica_n1 ] o.a.s.c.c.SolrZkClient makePath: /collections/control_collection/leader_elect/shard1/election
[junit4] 2> 1604472 INFO (qtp1918162341-24271) [n:127.0.0.1:38407_ c:control_collection s:shard1 x:control_collection_shard1_replica_n1 ] o.a.s.c.ShardLeaderElectionContext Enough replicas found to continue.
[junit4] 2> 1604472 INFO (qtp1918162341-24271) [n:127.0.0.1:38407_ c:control_collection s:shard1 x:control_collection_shard1_replica_n1 ] o.a.s.c.ShardLeaderElectionContext I may be the new leader - try and sync
[junit4] 2> 1604472 INFO (qtp1918162341-24271) [n:127.0.0.1:38407_ c:control_collection s:shard1 x:control_collection_shard1_replica_n1 ] o.a.s.c.SyncStrategy Sync replicas to http://127.0.0.1:38407/control_collection_shard1_replica_n1/
[junit4] 2> 1604472 INFO (qtp1918162341-24271) [n:127.0.0.1:38407_ c:control_collection s:shard1 x:control_collection_shard1_replica_n1 ] o.a.s.c.SyncStrategy Sync Success - now sync replicas to me
[junit4] 2> 1604472 INFO (qtp1918162341-24271) [n:127.0.0.1:38407_ c:control_collection s:shard1 x:control_collection_shard1_replica_n1 ] o.a.s.c.SyncStrategy http://127.0.0.1:38407/control_collection_shard1_replica_n1/ has no replicas
[junit4] 2> 1604472 INFO (qtp1918162341-24271) [n:127.0.0.1:38407_ c:control_collection s:shard1 x:control_collection_shard1_replica_n1 ] o.a.s.c.ShardLeaderElectionContextBase Creating leader registration node /collections/control_collection/leaders/shard1/leader after winning as /collections/control_collection/leader_elect/shard1/election/72082324332609540-core_node2-n_0000000000
[junit4] 2> 1604476 DEBUG (TEST-ShardSplitTest.testSplitStaticIndexReplicationLink-seed#[2C002CD9F9A483ED]-EventThread) [ ] o.a.s.c.c.SolrZkClient Submitting job to respond to event WatchedEvent state:SyncConnected type:NodeChildrenChanged path:/overseer/queue
[junit4] 2> 1604476 INFO (qtp1918162341-24271) [n:127.0.0.1:38407_ c:control_collection s:shard1 x:control_collection_shard1_replica_n1 ] o.a.s.c.ShardLeaderElectionContext I am the new leader: http://127.0.0.1:38407/control_collection_shard1_replica_n1/ shard1
[junit4] 2> 1604476 DEBUG (OverseerStateUpdate-72082324332609540-127.0.0.1:38407_-n_0000000000) [n:127.0.0.1:38407_ ] o.a.s.c.Overseer processMessage: queueSize: 1, message = {
[junit4] 2> "operation":"leader",
[junit4] 2> "shard":"shard1",
[junit4] 2> "collection":"control_collection",
[junit4] 2> "node_name":"127.0.0.1:38407_",
[junit4] 2> "base_url":"http://127.0.0.1:38407",
[junit4] 2> "core":"control_collection_shard1_replica_n1",
[junit4] 2> "state":"active"} current state version: 0
[junit4] 2> 1604476 DEBUG (qtp1918162341-24271) [n:127.0.0.1:38407_ c:control_collection s:shard1 x:control_collection_shard1_replica_n1 ] o.a.s.c.c.ZkStateReader already watching , added to stateWatchers
[junit4] 2> 1604477 DEBUG (qtp1918162341-24271) [n:127.0.0.1:38407_ c:control_collection s:shard1 x:control_collection_shard1_replica_n1 ] o.a.s.c.c.ZkStateReader Add data for [control_collection] ver [1]
[junit4] 2> 1604477 DEBUG (qtp1918162341-24271) [n:127.0.0.1:38407_ c:control_collection s:shard1 x:control_collection_shard1_replica_n1 ] o.a.s.c.c.ZkStateReader clusterStateSet: legacy [0] interesting [1] watched [1] lazy [2] total [2]
[junit4] 2> 1604477 DEBUG (qtp1918162341-24271) [n:127.0.0.1:38407_ c:control_collection s:shard1 x:control_collection_shard1_replica_n1 ] o.a.s.c.c.ZkStateReader updated per-replica states changed for: control_collection, ver: 0 , new vals: []
[junit4] 2> 1604477 DEBUG (watches-15260-thread-1-processing-n:127.0.0.1:38407_ x:control_collection_shard1_replica_n1 c:control_collection s:shard1) [n:127.0.0.1:38407_ c:control_collection s:shard1 x:control_collection_shard1_replica_n1 ] o.a.s.c.c.ZkStateReader CollectionStatePredicate failed for control_collection, cversion : -1
[junit4] 2> 1604478 DEBUG (qtp1918162341-24271) [n:127.0.0.1:38407_ c:control_collection s:shard1 x:control_collection_shard1_replica_n1 ] o.a.s.c.c.ZkStateReader clusterStateSet: legacy [0] interesting [1] watched [1] lazy [2] total [2]
[junit4] 2> 1604478 DEBUG (qtp1918162341-24271) [n:127.0.0.1:38407_ c:control_collection s:shard1 x:control_collection_shard1_replica_n1 ] o.a.s.c.c.ZkStateReader CollectionStatePredicate failed for control_collection, cversion : -1
[junit4] 2> 1604478 DEBUG (watches-15260-thread-1-processing-n:127.0.0.1:38407_ x:control_collection_shard1_replica_n1 c:control_collection s:shard1) [n:127.0.0.1:38407_ c:control_collection s:shard1 x:control_collection_shard1_replica_n1 ] o.a.s.c.c.ZkStateReader CollectionStatePredicate failed for control_collection, cversion : -1
[junit4] 2> 1604478 DEBUG (qtp1918162341-24271) [n:127.0.0.1:38407_ c:control_collection s:shard1 x:control_collection_shard1_replica_n1 ] o.a.s.c.c.ZkStateReader CollectionStatePredicate failed for control_collection, cversion : -1
[junit4] 2> 1604478 DEBUG (qtp1918162341-24271) [n:127.0.0.1:38407_ c:control_collection s:shard1 x:control_collection_shard1_replica_n1 ] o.a.s.c.c.ZkStateReader CollectionStatePredicate failed for control_collection, cversion : -1
[junit4] 2> 1604577 DEBUG (OverseerStateUpdate-72082324332609540-127.0.0.1:38407_-n_0000000000) [n:127.0.0.1:38407_ ] o.a.s.c.o.ZkStateWriter going to update_collection /collections/control_collection/state.json version: 1
[junit4] 2> 1604580 DEBUG (TEST-ShardSplitTest.testSplitStaticIndexReplicationLink-seed#[2C002CD9F9A483ED]-EventThread) [ ] o.a.s.c.c.SolrZkClient Submitting job to respond to event WatchedEvent state:SyncConnected type:NodeDataChanged path:/collections/control_collection/state.json
[junit4] 2> 1604580 INFO (zkCallback-15258-thread-1) [ ] o.a.s.c.c.ZkStateReader A cluster state change: [WatchedEvent state:SyncConnected type:NodeDataChanged path:/collections/control_collection/state.json] for collection [control_collection] has occurred - updating... (live nodes size: [1])
[junit4] 2> 1604581 DEBUG (zkCallback-15258-thread-1) [ ] o.a.s.c.c.ZkStateReader Updating data for [control_collection] from [1] to [2]
[junit4] 2> 1604581 DEBUG (zkCallback-15258-thread-1) [ ] o.a.s.c.c.ZkStateReader clusterStateSet: legacy [0] interesting [1] watched [1] lazy [2] total [2]
[junit4] 2> 1604581 DEBUG (watches-15260-thread-1) [ ] o.a.s.c.c.ZkStateReader leader found for control_collection/shard1 to be core_node2:{
[junit4] 2> "core":"control_collection_shard1_replica_n1",
[junit4] 2> "node_name":"127.0.0.1:38407_",
[junit4] 2> "base_url":"http://127.0.0.1:38407",
[junit4] 2> "state":"down",
[junit4] 2> "type":"NRT",
[junit4] 2> "leader":"true"}
[junit4] 2> 1604581 DEBUG (watches-15260-thread-1) [ ] o.a.s.c.c.ZkStateReader clusterStateSet: legacy [0] interesting [0] watched [0] lazy [2] total [2]
[junit4] 2> 1604581 DEBUG (TEST-ShardSplitTest.testSplitStaticIndexReplicationLink-seed#[2C002CD9F9A483ED]-EventThread) [ ] o.a.s.c.c.SolrZkClient Submitting job to respond to event WatchedEvent state:SyncConnected type:NodeChildrenChanged path:/overseer/queue
[junit4] 2> 1604581 INFO (qtp1918162341-24271) [n:127.0.0.1:38407_ c:control_collection s:shard1 x:control_collection_shard1_replica_n1 ] o.a.s.c.ZkController I am the leader, no recovery necessary
[junit4] 2> 1604582 DEBUG (TEST-ShardSplitTest.testSplitStaticIndexReplicationLink-seed#[2C002CD9F9A483ED]-EventThread) [ ] o.a.s.c.c.SolrZkClient Submitting job to respond to event WatchedEvent state:SyncConnected type:NodeChildrenChanged path:/overseer/queue
[junit4] 2> 1604582 DEBUG (qtp1918162341-24271) [n:127.0.0.1:38407_ c:control_collection s:shard1 x:control_collection_shard1_replica_n1 ] o.a.s.c.c.ZkStateReader Refreshing lazily-loaded state for collection control_collection
[junit4] 2> 1604583 DEBUG (qtp1918162341-24271) [n:127.0.0.1:38407_ c:control_collection s:shard1 x:control_collection_shard1_replica_n1 ] o.a.s.c.c.ZkStateReader already watching , added to stateWatchers
[junit4] 2> 1604583 DEBUG (OverseerStateUpdate-72082324332609540-127.0.0.1:38407_-n_0000000000) [n:127.0.0.1:38407_ ] o.a.s.c.Overseer processMessage: queueSize: 1, message = {
[junit4] 2> "core":"control_collection_shard1_replica_n1",
[junit4] 2> "core_node_name":"core_node2",
[junit4] 2> "roles":null,
[junit4] 2> "node_name":"127.0.0.1:38407_",
[junit4] 2> "base_url":"http://127.0.0.1:38407",
[junit4] 2> "numShards":"1",
[junit4] 2> "state":"active",
[junit4] 2> "shard":"shard1",
[junit4] 2> "collection":"control_collection",
[junit4] 2> "type":"NRT",
[junit4] 2> "operation":"state"} current state version: 0
[junit4] 2> 1604583 DEBUG (OverseerStateUpdate-72082324332609540-127.0.0.1:38407_-n_0000000000) [n:127.0.0.1:38407_ ] o.a.s.c.o.ReplicaMutator Update state numShards=1 message={
[junit4] 2> "core":"control_collection_shard1_replica_n1",
[junit4] 2> "core_node_name":"core_node2",
[junit4] 2> "roles":null,
[junit4] 2> "node_name":"127.0.0.1:38407_",
[junit4] 2> "base_url":"http://127.0.0.1:38407",
[junit4] 2> "numShards":"1",
[junit4] 2> "state":"active",
[junit4] 2> "shard":"shard1",
[junit4] 2> "collection":"control_collection",
[junit4] 2> "type":"NRT",
[junit4] 2> "operation":"state"}
[junit4] 2> 1604583 DEBUG (OverseerStateUpdate-72082324332609540-127.0.0.1:38407_-n_0000000000) [n:127.0.0.1:38407_ ] o.a.s.c.o.ReplicaMutator Will update state for replica: core_node2:{
[junit4] 2> "core":"control_collection_shard1_replica_n1",
[junit4] 2> "node_name":"127.0.0.1:38407_",
[junit4] 2> "base_url":"http://127.0.0.1:38407",
[junit4] 2> "state":"active",
[junit4] 2> "type":"NRT",
[junit4] 2> "leader":"true"}
[junit4] 2> 1604583 DEBUG (OverseerStateUpdate-72082324332609540-127.0.0.1:38407_-n_0000000000) [n:127.0.0.1:38407_ ] o.a.s.c.o.ReplicaMutator Collection is now: DocCollection(control_collection//collections/control_collection/state.json/2 )={
[junit4] 2> "pullReplicas":"0",
[junit4] 2> "replicationFactor":"1",
[junit4] 2> "router":{"name":"compositeId"},
[junit4] 2> "maxShardsPerNode":"1",
[junit4] 2> "autoAddReplicas":"false",
[junit4] 2> "nrtReplicas":"1",
[junit4] 2> "tlogReplicas":"0",
[junit4] 2> "shards":{"shard1":{
[junit4] 2> "range":"80000000-7fffffff",
[junit4] 2> "state":"active",
[junit4] 2> "replicas":{"core_node2":{
[junit4] 2> "core":"control_collection_shard1_replica_n1",
[junit4] 2> "node_name":"127.0.0.1:38407_",
[junit4] 2> "base_url":"htt
[...truncated too long message...]
to event WatchedEvent state:Closed type:None path:null
[junit4] 2> 1898383 DEBUG (closeThreadPool-17045-thread-3-EventThread) [ ] o.a.s.c.c.SolrZkClient Submitting job to respond to event WatchedEvent state:Closed type:None path:null
[junit4] 2> 1898383 DEBUG (closeThreadPool-17045-thread-3-EventThread) [ ] o.a.s.c.c.SolrZkClient Submitting job to respond to event WatchedEvent state:Closed type:None path:null
[junit4] 2> 1898383 DEBUG (closeThreadPool-17045-thread-3-EventThread) [ ] o.a.s.c.c.SolrZkClient Submitting job to respond to event WatchedEvent state:Closed type:None path:null
[junit4] 2> 1898383 DEBUG (closeThreadPool-17045-thread-3-EventThread) [ ] o.a.s.c.c.SolrZkClient Submitting job to respond to event WatchedEvent state:Closed type:None path:null
[junit4] 2> 1898383 DEBUG (closeThreadPool-17045-thread-3-EventThread) [ ] o.a.s.c.c.SolrZkClient Submitting job to respond to event WatchedEvent state:Closed type:None path:null
[junit4] 2> 1898383 DEBUG (closeThreadPool-17045-thread-3-EventThread) [ ] o.a.s.c.c.SolrZkClient Submitting job to respond to event WatchedEvent state:Closed type:None path:null
[junit4] 2> 1898384 INFO (closeThreadPool-17265-thread-7) [ ] o.e.j.s.AbstractConnector Stopped ServerConnector@2eace618{HTTP/1.1, (http/1.1, h2c)}{127.0.0.1:0}
[junit4] 2> 1898385 INFO (closeThreadPool-17265-thread-7) [ ] o.e.j.s.h.ContextHandler Stopped o.e.j.s.ServletContextHandler@3ac04de1{/,null,STOPPED}
[junit4] 2> 1898385 INFO (closeThreadPool-17265-thread-7) [ ] o.e.j.s.session node0 Stopped scavenging
[junit4] 2> 1898386 INFO (TEST-ShardSplitTest.testSplitMixedReplicaTypesLink-seed#[2C002CD9F9A483ED]) [ ] o.a.s.u.ErrorLogMuter Closing ErrorLogMuter-regex-344 after mutting 0 log messages
[junit4] 2> 1898386 INFO (TEST-ShardSplitTest.testSplitMixedReplicaTypesLink-seed#[2C002CD9F9A483ED]) [ ] o.a.s.u.ErrorLogMuter Creating ErrorLogMuter-regex-345 for ERROR logs matching regex: ignore_exception
[junit4] 2> 1898386 INFO (TEST-ShardSplitTest.testSplitMixedReplicaTypesLink-seed#[2C002CD9F9A483ED]) [ ] o.a.s.c.ZkTestServer Shutting down ZkTestServer.
[junit4] 2> 1898487 DEBUG (TEST-ShardSplitTest.testSplitMixedReplicaTypesLink-seed#[2C002CD9F9A483ED]-EventThread) [ ] o.a.s.c.c.SolrZkClient Submitting job to respond to event WatchedEvent state:Closed type:None path:null
[junit4] 2> 1898588 DEBUG (TEST-ShardSplitTest.testSplitMixedReplicaTypesLink-seed#[2C002CD9F9A483ED]-EventThread) [ ] o.a.s.c.c.SolrZkClient Submitting job to respond to event WatchedEvent state:Closed type:None path:null
[junit4] 2> 1898590 WARN (ZkTestServer Run Thread) [ ] o.a.s.c.ZkTestServer Watch limit violations:
[junit4] 2> Maximum concurrent create/delete watches above limit:
[junit4] 2>
[junit4] 2> 16 /solr/collections/testSplitMixedReplicaTypes_link/terms/shard1
[junit4] 2> 14 /solr/collections/testSplitMixedReplicaTypes_link/terms/shard1_0
[junit4] 2> 10 /solr/collections/testSplitMixedReplicaTypes_link/terms/shard1_1
[junit4] 2> 7 /solr/aliases.json
[junit4] 2> 5 /solr/packages.json
[junit4] 2> 5 /solr/security.json
[junit4] 2> 5 /solr/configs/conf1
[junit4] 2> 5 /solr/collections/collection1/terms/shard1
[junit4] 2> 5 /solr/collections/collection1/terms/shard2
[junit4] 2> 4 /solr/collections/collection1/collectionprops.json
[junit4] 2> 2 /solr/collections/control_collection/terms/shard1
[junit4] 2> 2 /solr/collections/testSplitMixedReplicaTypes_link/collectionprops.json
[junit4] 2>
[junit4] 2> Maximum concurrent data watches above limit:
[junit4] 2>
[junit4] 2> 207 /solr/collections/testSplitMixedReplicaTypes_link/state.json
[junit4] 2> 55 /solr/collections/collection1/state.json
[junit4] 2> 7 /solr/clusterprops.json
[junit4] 2> 7 /solr/collections/control_collection/state.json
[junit4] 2> 7 /solr/clusterstate.json
[junit4] 2> 2 /solr/overseer_elect/election/72082342295961612-127.0.0.1:37343_-n_0000000001
[junit4] 2>
[junit4] 2> Maximum concurrent children watches above limit:
[junit4] 2>
[junit4] 2> 242 /solr/collections/testSplitMixedReplicaTypes_link/state.json
[junit4] 2> 77 /solr/overseer/queue
[junit4] 2> 33 /solr/live_nodes
[junit4] 2> 22 /solr/overseer/collection-queue-work
[junit4] 2> 13 /solr/collections
[junit4] 2> 7 /solr/collections/collection1/state.json
[junit4] 2> 2 /solr/collections/control_collection/state.json
[junit4] 2>
[junit4] 2> 1898595 INFO (TEST-ShardSplitTest.testSplitMixedReplicaTypesLink-seed#[2C002CD9F9A483ED]) [ ] o.a.s.c.ZkTestServer waitForServerDown: 127.0.0.1:36515
[junit4] 2> 1898595 INFO (TEST-ShardSplitTest.testSplitMixedReplicaTypesLink-seed#[2C002CD9F9A483ED]) [ ] o.a.s.c.ZkTestServer parse host and port list: 127.0.0.1:36515
[junit4] 2> 1898595 INFO (TEST-ShardSplitTest.testSplitMixedReplicaTypesLink-seed#[2C002CD9F9A483ED]) [ ] o.a.s.c.ZkTestServer connecting to 127.0.0.1 36515
[junit4] IGNOR/A 0.00s J0 | ShardSplitTest.test
[junit4] > Assumption #1: 'nightly' test group is disabled (@Nightly())
[junit4] 2> 1898597 INFO (SUITE-ShardSplitTest-seed#[2C002CD9F9A483ED]-worker) [ ] o.a.s.u.ErrorLogMuter Closing ErrorLogMuter-regex-345 after mutting 0 log messages
[junit4] 2> 1898597 INFO (SUITE-ShardSplitTest-seed#[2C002CD9F9A483ED]-worker) [ ] o.a.s.u.ErrorLogMuter Creating ErrorLogMuter-regex-346 for ERROR logs matching regex: ignore_exception
[junit4] 2> NOTE: leaving temporary files on disk at: /home/jenkins/jenkins-slave/workspace/Lucene/Lucene-Solr-Tests-8.11/solr/build/solr-core/test/J0/temp/solr.cloud.api.collections.ShardSplitTest_2C002CD9F9A483ED-001
[junit4] 2> Mar 11, 2024 3:20:27 PM com.carrotsearch.randomizedtesting.ThreadLeakControl checkThreadLeaks
[junit4] 2> WARNING: Will linger awaiting termination of 1 leaked thread(s).
[junit4] 2> NOTE: test params are: codec=Lucene87, sim=Asserting(RandomSimilarity(queryNorm=false): {}), locale=ar-MA, timezone=Europe/Paris
[junit4] 2> NOTE: Linux 5.4.0-173-generic amd64/Temurin 1.8.0_362 (64-bit)/cpus=4,threads=1,free=209581048,total=519045120
[junit4] 2> NOTE: All tests run in this JVM: [RequestLoggingTest, TestFieldCache, TestStressLucene, DistributedDebugComponentTest, TestXIncludeConfig, SolrMetricReporterTest, TestTlogReplica, TestSlowCompositeReaderWrapper, DimensionalRoutedAliasUpdateProcessorTest, BaseCdcrDistributedZkTest, JavabinLoaderTest, TestPhraseSuggestions, TriLevelCompositeIdRoutingTest, FacetPivotSmallTest, SolrJmxReporterTest, TestSkipOverseerOperations, ExternalFileFieldSortTest, TestPullReplica, HdfsDirectoryTest, TestGraphTermsQParserPlugin, TestDocSet, TestCustomDocTransformer, TestSearcherReuse, TestSolrDeletionPolicy1, StatsReloadRaceTest, TestCodecSupport, TestSSLRandomization, RankQParserPluginTest, DisMaxRequestHandlerTest, ChaosMonkeySafeLeaderWithPullReplicasTest, DistributedFacetPivotLongTailTest, TestLMDirichletSimilarityFactory, QueryComponentPartialResultsTest, PreAnalyzedFieldManagedSchemaCloudTest, CacheHeaderTest, TestSimDistributedQueue, DistributedVersionInfoTest, ClusterStateMockUtilTest, HighlighterWithoutStoredIdTest, CopyFieldTest, TestPivotHelperCode, TestConfigSetImmutable, BasicZkTest, ReplaceNodeTest, DistributedSpellCheckComponentTest, RecoveryZkTest, TestSchemaDesignerAPI, TestJettySolrRunner, FullSolrCloudDistribCmdsTest, SolrCoreCheckLockOnStartupTest, TestBlockCollapse, TestConfigSetsAPIShareSchema, SliceStateTest, TestDefaultStatsCache, TestNumericTerms64, MultiDestinationAuditLoggerTest, InfoHandlerTest, UUIDUpdateProcessorFallbackTest, PeerSyncWithIndexFingerprintCachingTest, AliasIntegrationTest, BlobRepositoryCloudTest, TestDynamicLoadingUrl, FieldAnalysisRequestHandlerTest, OverriddenZkACLAndCredentialsProvidersTest, SolrTestCaseJ4Test, TestMinimalConfig, IgnoreCommitOptimizeUpdateProcessorFactoryTest, OutputWriterTest, CurrencyRangeFacetCloudTest, TestOverriddenPrefixQueryForCustomFieldType, DirectSolrSpellCheckerTest, TestPerFieldSimilarity, TestDistribPackageStore, TestOrdValues, SuggestComponentContextFilterQueryTest, TermsComponentTest, TestCloudSearcherWarming, TestMinHashQParser, TestUnInvertedFieldException, TestManagedResource, MetricsHandlerTest, TestJsonFacets, TestSchemalessBufferedUpdates, CreateCollectionCleanupTest, UpdateLogTest, TestImpersonationWithHadoopAuth, TestReloadAndDeleteDocs, CloudReplicaSourceTest, SuggesterWFSTTest, PathHierarchyTokenizerFactoryTest, TestDistribDocBasedVersion, OverseerTest, TemplateUpdateProcessorTest, HdfsCollectionsAPIDistributedZkTest, DocumentBuilderTest, TestSchemaResource, TestCircuitBreaker, AtomicUpdateProcessorFactoryTest, DistanceUnitsTest, SimpleCollectionCreateDeleteTest, TestSimpleTrackingShardHandler, TestOmitPositions, TestIndexingPerformance, TestFileDictionaryLookup, SplitShardTest, AggValueSourceTest, TestComplexPhraseQParserPlugin, ExecutePlanActionTest, TestCloudPivotFacet, TestPHPSerializedResponseWriter, TestObjectReleaseTracker, WordBreakSolrSpellCheckerTest, CollectionStateFormat2Test, BlockJoinFacetDistribTest, SolrIndexSplitterTest, TestRetrieveFieldsOptimizer, FastVectorHighlighterTest, SolrIndexSearcherTest, ShardRoutingCustomTest, DistribCursorPagingTest, LeaderElectionTest, LeaderFailureAfterFreshStartTest, MultiThreadedOCPTest, TestCloudInspectUtil, TestCloudRecovery2, TestLockTree, TestMiniSolrCloudClusterSSL, TestStressCloudBlindAtomicUpdates, TestTlogReplayVsRecovery, TestWaitForStateWithJettyShutdowns, ZkControllerTest, AssignTest, AsyncCallRequestStatusResponseTest, CollectionReloadTest, CollectionsAPIAsyncDistributedZkTest, ShardSplitTest]
[junit4] Completed [603/959 (1!)] on J0 in 297.71s, 11 tests, 1 error, 3 skipped <<< FAILURES!
[...truncated 55602 lines...]