You are viewing a plain text version of this content. The canonical link for it is here.
Posted to builds@solr.apache.org by Apache Jenkins Server <je...@builds.apache.org> on 2025/04/02 22:05:12 UTC

[JENKINS] Solr » Solr-Test-main-s390x - Build # 923 - Still Failing!

Build: https://ci-builds.apache.org/job/Solr/job/Solr-Test-main-s390x/923/

No tests ran.

Build Log:
[...truncated 58 lines...]
BUILD FAILED in 1m 17s
4 actionable tasks: 4 executed

Publishing build scan...
https://develocity.apache.org/s/ujdxux5xl4lts

Build step 'Invoke Gradle script' changed build result to FAILURE
Build step 'Invoke Gradle script' marked build as failure
Archiving artifacts
Recording test results
ERROR: Step ‘Publish JUnit test result report’ failed: No test report files were found. Configuration error?
Email was triggered for: Failure - Any
Sending email for trigger: Failure - Any

[JENKINS] Solr » Solr-Test-main-s390x - Build # 924 - Still Failing!

Posted by Apache Jenkins Server <je...@builds.apache.org>.
Build: https://ci-builds.apache.org/job/Solr/job/Solr-Test-main-s390x/924/

No tests ran.

Build Log:
[...truncated 58 lines...]
BUILD FAILED in 49s
4 actionable tasks: 4 executed

Publishing build scan...
https://develocity.apache.org/s/sd4mdjtfiagau

Build step 'Invoke Gradle script' changed build result to FAILURE
Build step 'Invoke Gradle script' marked build as failure
Archiving artifacts
Recording test results
ERROR: Step ‘Publish JUnit test result report’ failed: No test report files were found. Configuration error?
Email was triggered for: Failure - Any
Sending email for trigger: Failure - Any