You are viewing a plain text version of this content. The canonical link for it is here.
Posted to commits@kafka.apache.org by Apache Jenkins Server <je...@builds.apache.org> on 2012/10/23 20:06:44 UTC

Build failed in Jenkins: Kafka-0.8 #86

See <https://builds.apache.org/job/Kafka-0.8/86/changes>

Changes:

[junrao] system test testcase_0122 under replication fails due to large # of data loss; patched by Jun Rao; reviewed by Neha Narkhede; KAFKA-580

------------------------------------------
[...truncated 1214 lines...]
[info] Test Passed: testIterationOverPartialAndTruncation
[info] Test Starting: testIterationDoesntChangePosition
[info] Test Passed: testIterationDoesntChangePosition
[info] Test Starting: testRead
[info] Test Passed: testRead
[info] Test Starting: testSearch
[info] Test Passed: testSearch
[info] == core-kafka / kafka.log.FileMessageSetTest ==
[info] 
[info] == core-kafka / kafka.producer.ProducerTest ==
[info] Test Starting: testUpdateBrokerPartitionInfo(kafka.producer.ProducerTest)
[info] Test Passed: testUpdateBrokerPartitionInfo(kafka.producer.ProducerTest)
[info] Test Starting: testSendToNewTopic(kafka.producer.ProducerTest)
[info] Test Passed: testSendToNewTopic(kafka.producer.ProducerTest)
[info] Test Starting: testSendWithDeadBroker(kafka.producer.ProducerTest)
[info] Test Passed: testSendWithDeadBroker(kafka.producer.ProducerTest)
[info] Test Starting: testAsyncSendCanCorrectlyFailWithTimeout(kafka.producer.ProducerTest)
[info] Test Passed: testAsyncSendCanCorrectlyFailWithTimeout(kafka.producer.ProducerTest)
[info] == core-kafka / kafka.producer.ProducerTest ==
[info] 
[info] == core-kafka / kafka.message.MessageCompressionTest ==
[info] Test Starting: testSimpleCompressDecompress
[info] Test Passed: testSimpleCompressDecompress
[info] Test Starting: testComplexCompressDecompress
[info] Test Passed: testComplexCompressDecompress
[info] == core-kafka / kafka.message.MessageCompressionTest ==
[info] 
[info] == core-kafka / kafka.zk.ZKEphemeralTest ==
[info] Test Starting: testEphemeralNodeCleanup(kafka.zk.ZKEphemeralTest)
[info] Test Passed: testEphemeralNodeCleanup(kafka.zk.ZKEphemeralTest)
[info] == core-kafka / kafka.zk.ZKEphemeralTest ==
[info] 
[info] == core-kafka / kafka.message.ByteBufferMessageSetTest ==
[info] Test Starting: testWrittenEqualsRead
[info] Test Passed: testWrittenEqualsRead
[info] Test Starting: testIteratorIsConsistent
[info] Test Passed: testIteratorIsConsistent
[info] Test Starting: testSizeInBytes
[info] Test Passed: testSizeInBytes
[info] Test Starting: testEquals
[info] Test Passed: testEquals
[info] Test Starting: testWriteTo
[info] Test Passed: testWriteTo
[info] Test Starting: testValidBytes
[info] Test Passed: testValidBytes
[info] Test Starting: testValidBytesWithCompression
[info] Test Passed: testValidBytesWithCompression
[info] Test Starting: testIterator
[info] Test Passed: testIterator
[info] Test Starting: testOffsetAssignment
[info] Test Passed: testOffsetAssignment
[info] == core-kafka / kafka.message.ByteBufferMessageSetTest ==
[info] 
[info] == core-kafka / kafka.server.IsrExpirationTest ==
[info] Test Starting: testIsrExpirationForStuckFollowers(kafka.server.IsrExpirationTest)
[info] Test Passed: testIsrExpirationForStuckFollowers(kafka.server.IsrExpirationTest)
[info] Test Starting: testIsrExpirationForSlowFollowers(kafka.server.IsrExpirationTest)
[info] Test Passed: testIsrExpirationForSlowFollowers(kafka.server.IsrExpirationTest)
[info] == core-kafka / kafka.server.IsrExpirationTest ==
[info] 
[info] == core-kafka / kafka.log.OffsetIndexTest ==
[info] Test Starting: truncate
[info] Test Passed: truncate
[info] Test Starting: randomLookupTest
[info] Test Passed: randomLookupTest
[info] Test Starting: lookupExtremeCases
[info] Test Passed: lookupExtremeCases
[info] Test Starting: appendTooMany
[info] Test Passed: appendTooMany
[info] Test Starting: appendOutOfOrder
[info] Test Passed: appendOutOfOrder
[info] Test Starting: testReopen
[info] Test Passed: testReopen
[info] == core-kafka / kafka.log.OffsetIndexTest ==
[info] 
[info] == core-kafka / kafka.integration.LazyInitProducerTest ==
[info] Test Starting: testProduceAndMultiFetch(kafka.integration.LazyInitProducerTest)
[info] Test Passed: testProduceAndMultiFetch(kafka.integration.LazyInitProducerTest)
[info] Test Starting: testMultiProduce(kafka.integration.LazyInitProducerTest)
[info] Test Passed: testMultiProduce(kafka.integration.LazyInitProducerTest)
[info] Test Starting: testProduceAndFetch(kafka.integration.LazyInitProducerTest)
[info] Test Passed: testProduceAndFetch(kafka.integration.LazyInitProducerTest)
[info] Test Starting: testMultiProduceResend(kafka.integration.LazyInitProducerTest)
[info] Test Passed: testMultiProduceResend(kafka.integration.LazyInitProducerTest)
[info] == core-kafka / kafka.integration.LazyInitProducerTest ==
[info] 
[info] == core-kafka / kafka.integration.AutoOffsetResetTest ==
[info] Test Starting: testResetToEarliestWhenOffsetTooHigh(kafka.integration.AutoOffsetResetTest)
[info] Test Passed: testResetToEarliestWhenOffsetTooHigh(kafka.integration.AutoOffsetResetTest)
[info] Test Starting: testResetToEarliestWhenOffsetTooLow(kafka.integration.AutoOffsetResetTest)
[info] Test Passed: testResetToEarliestWhenOffsetTooLow(kafka.integration.AutoOffsetResetTest)
[info] Test Starting: testResetToLatestWhenOffsetTooHigh(kafka.integration.AutoOffsetResetTest)
[info] Test Passed: testResetToLatestWhenOffsetTooHigh(kafka.integration.AutoOffsetResetTest)
[info] Test Starting: testResetToLatestWhenOffsetTooLow(kafka.integration.AutoOffsetResetTest)
[info] Test Passed: testResetToLatestWhenOffsetTooLow(kafka.integration.AutoOffsetResetTest)
[info] == core-kafka / kafka.integration.AutoOffsetResetTest ==
[info] 
[info] == core-kafka / kafka.utils.UtilsTest ==
[info] Test Starting: testSwallow
[info] Test Passed: testSwallow
[info] Test Starting: testCircularIterator
[info] Test Passed: testCircularIterator
[info] == core-kafka / kafka.utils.UtilsTest ==
[info] 
[info] == core-kafka / kafka.log.LogManagerTest ==
[info] Test Starting: testCreateLog(kafka.log.LogManagerTest)
[info] Test Passed: testCreateLog(kafka.log.LogManagerTest)
[info] Test Starting: testGetLog(kafka.log.LogManagerTest)
[info] Test Passed: testGetLog(kafka.log.LogManagerTest)
[info] Test Starting: testCleanupExpiredSegments(kafka.log.LogManagerTest)
[info] Test Passed: testCleanupExpiredSegments(kafka.log.LogManagerTest)
[info] Test Starting: testCleanupSegmentsToMaintainSize(kafka.log.LogManagerTest)
[info] Test Passed: testCleanupSegmentsToMaintainSize(kafka.log.LogManagerTest)
[info] Test Starting: testTimeBasedFlush(kafka.log.LogManagerTest)
now = 1351015552255 last flush = 1351015552245
[info] Test Passed: testTimeBasedFlush(kafka.log.LogManagerTest)
[info] == core-kafka / kafka.log.LogManagerTest ==
[info] 
[info] == core-kafka / kafka.producer.SyncProducerTest ==
[info] Test Starting: testReachableServer(kafka.producer.SyncProducerTest)
[info] Test Passed: testReachableServer(kafka.producer.SyncProducerTest)
[info] Test Starting: testEmptyProduceRequest(kafka.producer.SyncProducerTest)
[info] Test Passed: testEmptyProduceRequest(kafka.producer.SyncProducerTest)
[info] Test Starting: testMessageSizeTooLarge(kafka.producer.SyncProducerTest)
[info] Test Passed: testMessageSizeTooLarge(kafka.producer.SyncProducerTest)
[info] Test Starting: testProduceCorrectlyReceivesResponse(kafka.producer.SyncProducerTest)
[info] Test Passed: testProduceCorrectlyReceivesResponse(kafka.producer.SyncProducerTest)
[info] Test Starting: testProducerCanTimeout(kafka.producer.SyncProducerTest)
[info] Test Passed: testProducerCanTimeout(kafka.producer.SyncProducerTest)
[info] == core-kafka / kafka.producer.SyncProducerTest ==
[info] 
[info] == core-kafka / kafka.server.LogRecoveryTest ==
[info] Test Starting: testHWCheckpointNoFailuresSingleLogSegment(kafka.server.LogRecoveryTest)
[info] Test Passed: testHWCheckpointNoFailuresSingleLogSegment(kafka.server.LogRecoveryTest)
[info] Test Starting: testHWCheckpointWithFailuresSingleLogSegment(kafka.server.LogRecoveryTest)
[error] Test Failed: testHWCheckpointWithFailuresSingleLogSegment(kafka.server.LogRecoveryTest)
java.lang.AssertionError: expected:<2> but was:<1>
	at org.junit.Assert.fail(Assert.java:69)
	at org.junit.Assert.failNotEquals(Assert.java:314)
	at org.junit.Assert.assertEquals(Assert.java:94)
	at org.junit.Assert.assertEquals(Assert.java:104)
	at kafka.server.LogRecoveryTest.testHWCheckpointWithFailuresSingleLogSegment(LogRecoveryTest.scala:149)
	at sun.reflect.NativeMethodAccessorImpl.invoke0(Native Method)
	at sun.reflect.NativeMethodAccessorImpl.invoke(NativeMethodAccessorImpl.java:39)
	at sun.reflect.DelegatingMethodAccessorImpl.invoke(DelegatingMethodAccessorImpl.java:25)
	at java.lang.reflect.Method.invoke(Method.java:597)
	at junit.framework.TestCase.runTest(TestCase.java:164)
	at junit.framework.TestCase.runBare(TestCase.java:130)
	at junit.framework.TestResult$1.protect(TestResult.java:110)
	at junit.framework.TestResult.runProtected(TestResult.java:128)
	at junit.framework.TestResult.run(TestResult.java:113)
	at junit.framework.TestCase.run(TestCase.java:120)
	at junit.framework.TestSuite.runTest(TestSuite.java:228)
	at junit.framework.TestSuite.run(TestSuite.java:223)
	at junit.framework.TestSuite.runTest(TestSuite.java:228)
	at junit.framework.TestSuite.run(TestSuite.java:223)
	at org.scalatest.junit.JUnit3Suite.run(JUnit3Suite.scala:309)
	at org.scalatest.tools.ScalaTestFramework$ScalaTestRunner.run(ScalaTestFramework.scala:40)
	at sbt.TestRunner.run(TestFramework.scala:53)
	at sbt.TestRunner.runTest$1(TestFramework.scala:67)
	at sbt.TestRunner.run(TestFramework.scala:76)
	at sbt.TestFramework$$anonfun$10$$anonfun$apply$11.runTest$2(TestFramework.scala:194)
	at sbt.TestFramework$$anonfun$10$$anonfun$apply$11$$anonfun$apply$12.apply(TestFramework.scala:205)
	at sbt.TestFramework$$anonfun$10$$anonfun$apply$11$$anonfun$apply$12.apply(TestFramework.scala:205)
	at sbt.NamedTestTask.run(TestFramework.scala:92)
	at sbt.ScalaProject$$anonfun$sbt$ScalaProject$$toTask$1.apply(ScalaProject.scala:193)
	at sbt.ScalaProject$$anonfun$sbt$ScalaProject$$toTask$1.apply(ScalaProject.scala:193)
	at sbt.TaskManager$Task.invoke(TaskManager.scala:62)
	at sbt.impl.RunTask.doRun$1(RunTask.scala:77)
	at sbt.impl.RunTask.runTask(RunTask.scala:85)
	at sbt.impl.RunTask.sbt$impl$RunTask$$runIfNotRoot(RunTask.scala:60)
	at sbt.impl.RunTask$$anonfun$runTasksExceptRoot$2.apply(RunTask.scala:48)
	at sbt.impl.RunTask$$anonfun$runTasksExceptRoot$2.apply(RunTask.scala:48)
	at sbt.Distributor$Run$Worker$$anonfun$2.apply(ParallelRunner.scala:131)
	at sbt.Distributor$Run$Worker$$anonfun$2.apply(ParallelRunner.scala:131)
	at sbt.Control$.trapUnit(Control.scala:19)
	at sbt.Distributor$Run$Worker.run(ParallelRunner.scala:131)
[info] Test Starting: testHWCheckpointNoFailuresMultipleLogSegments(kafka.server.LogRecoveryTest)
[info] Test Passed: testHWCheckpointNoFailuresMultipleLogSegments(kafka.server.LogRecoveryTest)
[info] Test Starting: testHWCheckpointWithFailuresMultipleLogSegments(kafka.server.LogRecoveryTest)
[info] Test Passed: testHWCheckpointWithFailuresMultipleLogSegments(kafka.server.LogRecoveryTest)
[info] == core-kafka / kafka.server.LogRecoveryTest ==
[info] 
[info] == core-kafka / kafka.api.RequestResponseSerializationTest ==
[info] Test Starting: testSerializationAndDeserialization
[info] Test Passed: testSerializationAndDeserialization
[info] == core-kafka / kafka.api.RequestResponseSerializationTest ==
[info] 
[info] == core-kafka / kafka.admin.AdminTest ==
[info] Test Starting: testReplicaAssignment(kafka.admin.AdminTest)
[info] Test Passed: testReplicaAssignment(kafka.admin.AdminTest)
[info] Test Starting: testManualReplicaAssignment(kafka.admin.AdminTest)
[info] Test Passed: testManualReplicaAssignment(kafka.admin.AdminTest)
[info] Test Starting: testTopicCreationInZK(kafka.admin.AdminTest)
[info] Test Passed: testTopicCreationInZK(kafka.admin.AdminTest)
[info] Test Starting: testGetTopicMetadata(kafka.admin.AdminTest)
[info] Test Passed: testGetTopicMetadata(kafka.admin.AdminTest)
[info] Test Starting: testPartitionReassignmentWithLeaderInNewReplicas(kafka.admin.AdminTest)
[info] Test Passed: testPartitionReassignmentWithLeaderInNewReplicas(kafka.admin.AdminTest)
[info] Test Starting: testPartitionReassignmentWithLeaderNotInNewReplicas(kafka.admin.AdminTest)
[info] Test Passed: testPartitionReassignmentWithLeaderNotInNewReplicas(kafka.admin.AdminTest)
[info] Test Starting: testPartitionReassignmentNonOverlappingReplicas(kafka.admin.AdminTest)
[info] Test Passed: testPartitionReassignmentNonOverlappingReplicas(kafka.admin.AdminTest)
[info] Test Starting: testReassigningNonExistingPartition(kafka.admin.AdminTest)
[info] Test Passed: testReassigningNonExistingPartition(kafka.admin.AdminTest)
[info] Test Starting: testResumePartitionReassignmentThatWasCompleted(kafka.admin.AdminTest)
[info] Test Passed: testResumePartitionReassignmentThatWasCompleted(kafka.admin.AdminTest)
[info] Test Starting: testPreferredReplicaJsonData(kafka.admin.AdminTest)
[info] Test Passed: testPreferredReplicaJsonData(kafka.admin.AdminTest)
[info] Test Starting: testBasicPreferredReplicaElection(kafka.admin.AdminTest)
[info] Test Passed: testBasicPreferredReplicaElection(kafka.admin.AdminTest)
[info] == core-kafka / kafka.admin.AdminTest ==
[info] 
[info] == core-kafka / kafka.integration.FetcherTest ==
[info] Test Starting: testFetcher(kafka.integration.FetcherTest)
[info] Test Passed: testFetcher(kafka.integration.FetcherTest)
[info] == core-kafka / kafka.integration.FetcherTest ==
[info] 
[info] == core-kafka / kafka.metrics.KafkaTimerTest ==
[info] Test Starting: testKafkaTimer(kafka.metrics.KafkaTimerTest)
[info] Test Passed: testKafkaTimer(kafka.metrics.KafkaTimerTest)
[info] == core-kafka / kafka.metrics.KafkaTimerTest ==
[info] 
[info] == core-kafka / kafka.server.RequestPurgatoryTest ==
[info] Test Starting: testRequestSatisfaction(kafka.server.RequestPurgatoryTest)
[info] Test Passed: testRequestSatisfaction(kafka.server.RequestPurgatoryTest)
[info] Test Starting: testRequestExpiry(kafka.server.RequestPurgatoryTest)
[info] Test Passed: testRequestExpiry(kafka.server.RequestPurgatoryTest)
[info] == core-kafka / kafka.server.RequestPurgatoryTest ==
[info] 
[info] == core-kafka / Test cleanup 1 ==
[info] Deleting directory /tmp/sbt_82013cdc
[info] == core-kafka / Test cleanup 1 ==
[info] 
[info] == core-kafka / test-finish ==
[error] Failed: : Total 159, Failed 2, Errors 0, Passed 157, Skipped 0
[info] == core-kafka / test-finish ==
[info] 
[info] == core-kafka / test-cleanup ==
[info] == core-kafka / test-cleanup ==
[error] Error running kafka.log.LogTest: Test FAILED
[error] Error running kafka.server.LogRecoveryTest: Test FAILED
[error] Error running test: One or more subtasks failed
[info] 
[info] Total time: 257 s, completed Oct 23, 2012 6:06:43 PM
[info] 
[info] Total session time: 258 s, completed Oct 23, 2012 6:06:43 PM
[error] Error during build.
Build step 'Execute shell' marked build as failure

Jenkins build is back to normal : Kafka-0.8 #89

Posted by Apache Jenkins Server <je...@builds.apache.org>.
See <https://builds.apache.org/job/Kafka-0.8/89/changes>


Build failed in Jenkins: Kafka-0.8 #88

Posted by Apache Jenkins Server <je...@builds.apache.org>.
See <https://builds.apache.org/job/Kafka-0.8/88/changes>

Changes:

[junrao] provides windows batch script for starting Kafka/Zookeeper; patched by Antoine Vianey; reviewed by Jun Rao; kafka-581

[junrao] remove connection timeout in SyncProducer; patched by Swapnil Ghike; reviewed by Jun Rao; kafka-579

[junrao] Change MessageSet.sizeInBytes to Int; patched by Swapnil Ghike; reviewed by Jun Rao; kafka-556

------------------------------------------
[...truncated 1452 lines...]
[info] Test Passed: testLeaderElectionAndEpoch(kafka.server.LeaderElectionTest)
[info] == core-kafka / kafka.server.LeaderElectionTest ==
[info] 
[info] == core-kafka / kafka.producer.ProducerTest ==
[info] Test Starting: testUpdateBrokerPartitionInfo(kafka.producer.ProducerTest)
[info] Test Passed: testUpdateBrokerPartitionInfo(kafka.producer.ProducerTest)
[info] Test Starting: testSendToNewTopic(kafka.producer.ProducerTest)
[info] Test Passed: testSendToNewTopic(kafka.producer.ProducerTest)
[info] Test Starting: testSendWithDeadBroker(kafka.producer.ProducerTest)
[info] Test Passed: testSendWithDeadBroker(kafka.producer.ProducerTest)
[info] Test Starting: testAsyncSendCanCorrectlyFailWithTimeout(kafka.producer.ProducerTest)
[info] Test Passed: testAsyncSendCanCorrectlyFailWithTimeout(kafka.producer.ProducerTest)
[info] == core-kafka / kafka.producer.ProducerTest ==
[info] 
[info] == core-kafka / kafka.integration.TopicMetadataTest ==
[info] Test Starting: testTopicMetadataRequest(kafka.integration.TopicMetadataTest)
[info] Test Passed: testTopicMetadataRequest(kafka.integration.TopicMetadataTest)
[info] Test Starting: testBasicTopicMetadata(kafka.integration.TopicMetadataTest)
[info] Test Passed: testBasicTopicMetadata(kafka.integration.TopicMetadataTest)
[info] Test Starting: testAutoCreateTopic(kafka.integration.TopicMetadataTest)
[info] Test Passed: testAutoCreateTopic(kafka.integration.TopicMetadataTest)
[info] == core-kafka / kafka.integration.TopicMetadataTest ==
[info] 
[info] == core-kafka / kafka.log.OffsetIndexTest ==
[info] Test Starting: truncate
[info] Test Passed: truncate
[info] Test Starting: randomLookupTest
[info] Test Passed: randomLookupTest
[info] Test Starting: lookupExtremeCases
[info] Test Passed: lookupExtremeCases
[info] Test Starting: appendTooMany
[info] Test Passed: appendTooMany
[info] Test Starting: appendOutOfOrder
[info] Test Passed: appendOutOfOrder
[info] Test Starting: testReopen
[info] Test Passed: testReopen
[info] == core-kafka / kafka.log.OffsetIndexTest ==
[info] 
[info] == core-kafka / kafka.log.LogManagerTest ==
[info] Test Starting: testCreateLog(kafka.log.LogManagerTest)
[info] Test Passed: testCreateLog(kafka.log.LogManagerTest)
[info] Test Starting: testGetLog(kafka.log.LogManagerTest)
[info] Test Passed: testGetLog(kafka.log.LogManagerTest)
[info] Test Starting: testCleanupExpiredSegments(kafka.log.LogManagerTest)
[info] Test Passed: testCleanupExpiredSegments(kafka.log.LogManagerTest)
[info] Test Starting: testCleanupSegmentsToMaintainSize(kafka.log.LogManagerTest)
[info] Test Passed: testCleanupSegmentsToMaintainSize(kafka.log.LogManagerTest)
[info] Test Starting: testTimeBasedFlush(kafka.log.LogManagerTest)
now = 1351098304352 last flush = 1351098304342
[info] Test Passed: testTimeBasedFlush(kafka.log.LogManagerTest)
[info] == core-kafka / kafka.log.LogManagerTest ==
[info] 
[info] == core-kafka / kafka.server.IsrExpirationTest ==
[info] Test Starting: testIsrExpirationForStuckFollowers(kafka.server.IsrExpirationTest)
[info] Test Passed: testIsrExpirationForStuckFollowers(kafka.server.IsrExpirationTest)
[info] Test Starting: testIsrExpirationForSlowFollowers(kafka.server.IsrExpirationTest)
[info] Test Passed: testIsrExpirationForSlowFollowers(kafka.server.IsrExpirationTest)
[info] == core-kafka / kafka.server.IsrExpirationTest ==
[info] 
[info] == core-kafka / kafka.javaapi.message.ByteBufferMessageSetTest ==
[info] Test Starting: testWrittenEqualsRead
[info] Test Passed: testWrittenEqualsRead
[info] Test Starting: testIteratorIsConsistent
[info] Test Passed: testIteratorIsConsistent
[info] Test Starting: testSizeInBytes
[info] Test Passed: testSizeInBytes
[info] Test Starting: testEquals
[info] Test Passed: testEquals
[info] Test Starting: testIteratorIsConsistentWithCompression
[info] Test Passed: testIteratorIsConsistentWithCompression
[info] Test Starting: testSizeInBytesWithCompression
[info] Test Passed: testSizeInBytesWithCompression
[info] Test Starting: testEqualsWithCompression
[info] Test Passed: testEqualsWithCompression
[info] == core-kafka / kafka.javaapi.message.ByteBufferMessageSetTest ==
[info] 
[info] == core-kafka / kafka.javaapi.consumer.ZookeeperConsumerConnectorTest ==
[info] Test Starting: testBasic(kafka.javaapi.consumer.ZookeeperConsumerConnectorTest)
[info] Test Passed: testBasic(kafka.javaapi.consumer.ZookeeperConsumerConnectorTest)
[info] == core-kafka / kafka.javaapi.consumer.ZookeeperConsumerConnectorTest ==
[info] 
[info] == core-kafka / kafka.message.MessageCompressionTest ==
[info] Test Starting: testSimpleCompressDecompress
[info] Test Passed: testSimpleCompressDecompress
[info] Test Starting: testComplexCompressDecompress
[info] Test Passed: testComplexCompressDecompress
[info] == core-kafka / kafka.message.MessageCompressionTest ==
[info] 
[info] == core-kafka / kafka.log.FileMessageSetTest ==
[info] Test Starting: testWrittenEqualsRead
[info] Test Passed: testWrittenEqualsRead
[info] Test Starting: testIteratorIsConsistent
[info] Test Passed: testIteratorIsConsistent
[info] Test Starting: testSizeInBytes
[info] Test Passed: testSizeInBytes
[info] Test Starting: testWriteTo
[info] Test Passed: testWriteTo
[info] Test Starting: testFileSize
[info] Test Passed: testFileSize
[info] Test Starting: testIterationOverPartialAndTruncation
[info] Test Passed: testIterationOverPartialAndTruncation
[info] Test Starting: testIterationDoesntChangePosition
[info] Test Passed: testIterationDoesntChangePosition
[info] Test Starting: testRead
[info] Test Passed: testRead
[info] Test Starting: testSearch
[info] Test Passed: testSearch
[info] == core-kafka / kafka.log.FileMessageSetTest ==
[info] 
[info] == core-kafka / kafka.utils.UtilsTest ==
[info] Test Starting: testSwallow
[info] Test Passed: testSwallow
[info] Test Starting: testCircularIterator
[info] Test Passed: testCircularIterator
[info] == core-kafka / kafka.utils.UtilsTest ==
[info] 
[info] == core-kafka / kafka.metrics.KafkaTimerTest ==
[info] Test Starting: testKafkaTimer(kafka.metrics.KafkaTimerTest)
[info] Test Passed: testKafkaTimer(kafka.metrics.KafkaTimerTest)
[info] == core-kafka / kafka.metrics.KafkaTimerTest ==
[info] 
[info] == core-kafka / kafka.server.SimpleFetchTest ==
[info] Test Starting: testNonReplicaSeesHwWhenFetching(kafka.server.SimpleFetchTest)
[info] Test Passed: testNonReplicaSeesHwWhenFetching(kafka.server.SimpleFetchTest)
[info] Test Starting: testReplicaSeesLeoWhenFetching(kafka.server.SimpleFetchTest)
[info] Test Passed: testReplicaSeesLeoWhenFetching(kafka.server.SimpleFetchTest)
[info] == core-kafka / kafka.server.SimpleFetchTest ==
[info] 
[info] == core-kafka / kafka.integration.PrimitiveApiTest ==
[info] Test Starting: testProduceAndMultiFetch(kafka.integration.PrimitiveApiTest)
[info] Test Passed: testProduceAndMultiFetch(kafka.integration.PrimitiveApiTest)
[info] Test Starting: testMultiProduce(kafka.integration.PrimitiveApiTest)
[info] Test Passed: testMultiProduce(kafka.integration.PrimitiveApiTest)
[info] Test Starting: testFetchRequestCanProperlySerialize(kafka.integration.PrimitiveApiTest)
[info] Test Passed: testFetchRequestCanProperlySerialize(kafka.integration.PrimitiveApiTest)
[info] Test Starting: testEmptyFetchRequest(kafka.integration.PrimitiveApiTest)
[info] Test Passed: testEmptyFetchRequest(kafka.integration.PrimitiveApiTest)
[info] Test Starting: testDefaultEncoderProducerAndFetch(kafka.integration.PrimitiveApiTest)
[info] Test Passed: testDefaultEncoderProducerAndFetch(kafka.integration.PrimitiveApiTest)
[info] Test Starting: testDefaultEncoderProducerAndFetchWithCompression(kafka.integration.PrimitiveApiTest)
[info] Test Passed: testDefaultEncoderProducerAndFetchWithCompression(kafka.integration.PrimitiveApiTest)
[info] Test Starting: testProduceAndMultiFetchWithCompression(kafka.integration.PrimitiveApiTest)
[info] Test Passed: testProduceAndMultiFetchWithCompression(kafka.integration.PrimitiveApiTest)
[info] Test Starting: testMultiProduceWithCompression(kafka.integration.PrimitiveApiTest)
[info] Test Passed: testMultiProduceWithCompression(kafka.integration.PrimitiveApiTest)
[info] Test Starting: testConsumerEmptyTopic(kafka.integration.PrimitiveApiTest)
[info] Test Passed: testConsumerEmptyTopic(kafka.integration.PrimitiveApiTest)
[info] == core-kafka / kafka.integration.PrimitiveApiTest ==
[info] 
[info] == core-kafka / kafka.admin.AdminTest ==
[info] Test Starting: testReplicaAssignment(kafka.admin.AdminTest)
[info] Test Passed: testReplicaAssignment(kafka.admin.AdminTest)
[info] Test Starting: testManualReplicaAssignment(kafka.admin.AdminTest)
[info] Test Passed: testManualReplicaAssignment(kafka.admin.AdminTest)
[info] Test Starting: testTopicCreationInZK(kafka.admin.AdminTest)
[info] Test Passed: testTopicCreationInZK(kafka.admin.AdminTest)
[info] Test Starting: testGetTopicMetadata(kafka.admin.AdminTest)
[info] Test Passed: testGetTopicMetadata(kafka.admin.AdminTest)
[info] Test Starting: testPartitionReassignmentWithLeaderInNewReplicas(kafka.admin.AdminTest)
[info] Test Passed: testPartitionReassignmentWithLeaderInNewReplicas(kafka.admin.AdminTest)
[info] Test Starting: testPartitionReassignmentWithLeaderNotInNewReplicas(kafka.admin.AdminTest)
[info] Test Passed: testPartitionReassignmentWithLeaderNotInNewReplicas(kafka.admin.AdminTest)
[info] Test Starting: testPartitionReassignmentNonOverlappingReplicas(kafka.admin.AdminTest)
[info] Test Passed: testPartitionReassignmentNonOverlappingReplicas(kafka.admin.AdminTest)
[info] Test Starting: testReassigningNonExistingPartition(kafka.admin.AdminTest)
[info] Test Passed: testReassigningNonExistingPartition(kafka.admin.AdminTest)
[info] Test Starting: testResumePartitionReassignmentThatWasCompleted(kafka.admin.AdminTest)
[info] Test Passed: testResumePartitionReassignmentThatWasCompleted(kafka.admin.AdminTest)
[info] Test Starting: testPreferredReplicaJsonData(kafka.admin.AdminTest)
[info] Test Passed: testPreferredReplicaJsonData(kafka.admin.AdminTest)
[info] Test Starting: testBasicPreferredReplicaElection(kafka.admin.AdminTest)
[info] Test Passed: testBasicPreferredReplicaElection(kafka.admin.AdminTest)
[info] == core-kafka / kafka.admin.AdminTest ==
[info] 
[info] == core-kafka / kafka.server.HighwatermarkPersistenceTest ==
[info] Test Starting: testHighWatermarkPersistenceSinglePartition(kafka.server.HighwatermarkPersistenceTest)
[info] Test Passed: testHighWatermarkPersistenceSinglePartition(kafka.server.HighwatermarkPersistenceTest)
[info] Test Starting: testHighWatermarkPersistenceMultiplePartitions(kafka.server.HighwatermarkPersistenceTest)
[info] Test Passed: testHighWatermarkPersistenceMultiplePartitions(kafka.server.HighwatermarkPersistenceTest)
[info] == core-kafka / kafka.server.HighwatermarkPersistenceTest ==
[info] 
[info] == core-kafka / kafka.api.RequestResponseSerializationTest ==
[info] Test Starting: testSerializationAndDeserialization
[info] Test Passed: testSerializationAndDeserialization
[info] == core-kafka / kafka.api.RequestResponseSerializationTest ==
[info] 
[info] == core-kafka / kafka.message.MessageTest ==
[info] Test Starting: testFieldValues
[info] Test Passed: testFieldValues
[info] Test Starting: testChecksum
[info] Test Passed: testChecksum
[info] Test Starting: testEquality
[info] Test Passed: testEquality
[info] Test Starting: testIsHashable
[info] Test Passed: testIsHashable
[info] == core-kafka / kafka.message.MessageTest ==
[info] 
[info] == core-kafka / kafka.zk.ZKEphemeralTest ==
[info] Test Starting: testEphemeralNodeCleanup(kafka.zk.ZKEphemeralTest)
[info] Test Passed: testEphemeralNodeCleanup(kafka.zk.ZKEphemeralTest)
[info] == core-kafka / kafka.zk.ZKEphemeralTest ==
[info] 
[info] == core-kafka / kafka.integration.AutoOffsetResetTest ==
[info] Test Starting: testResetToEarliestWhenOffsetTooHigh(kafka.integration.AutoOffsetResetTest)
[info] Test Passed: testResetToEarliestWhenOffsetTooHigh(kafka.integration.AutoOffsetResetTest)
[info] Test Starting: testResetToEarliestWhenOffsetTooLow(kafka.integration.AutoOffsetResetTest)
[info] Test Passed: testResetToEarliestWhenOffsetTooLow(kafka.integration.AutoOffsetResetTest)
[info] Test Starting: testResetToLatestWhenOffsetTooHigh(kafka.integration.AutoOffsetResetTest)
[info] Test Passed: testResetToLatestWhenOffsetTooHigh(kafka.integration.AutoOffsetResetTest)
[info] Test Starting: testResetToLatestWhenOffsetTooLow(kafka.integration.AutoOffsetResetTest)
[info] Test Passed: testResetToLatestWhenOffsetTooLow(kafka.integration.AutoOffsetResetTest)
[info] == core-kafka / kafka.integration.AutoOffsetResetTest ==
[info] 
[info] == core-kafka / kafka.producer.SyncProducerTest ==
[info] Test Starting: testReachableServer(kafka.producer.SyncProducerTest)
[info] Test Passed: testReachableServer(kafka.producer.SyncProducerTest)
[info] Test Starting: testEmptyProduceRequest(kafka.producer.SyncProducerTest)
[info] Test Passed: testEmptyProduceRequest(kafka.producer.SyncProducerTest)
[info] Test Starting: testMessageSizeTooLarge(kafka.producer.SyncProducerTest)
[info] Test Passed: testMessageSizeTooLarge(kafka.producer.SyncProducerTest)
[info] Test Starting: testProduceCorrectlyReceivesResponse(kafka.producer.SyncProducerTest)
[info] Test Passed: testProduceCorrectlyReceivesResponse(kafka.producer.SyncProducerTest)
[info] Test Starting: testProducerCanTimeout(kafka.producer.SyncProducerTest)
[info] Test Passed: testProducerCanTimeout(kafka.producer.SyncProducerTest)
[info] == core-kafka / kafka.producer.SyncProducerTest ==
[info] 
[info] == core-kafka / kafka.server.ReplicaFetchTest ==
[info] Test Starting: testReplicaFetcherThread(kafka.server.ReplicaFetchTest)
[info] Test Passed: testReplicaFetcherThread(kafka.server.ReplicaFetchTest)
[info] == core-kafka / kafka.server.ReplicaFetchTest ==
[info] 
[info] == core-kafka / test-finish ==
[error] Failed: : Total 159, Failed 1, Errors 0, Passed 158, Skipped 0
[info] == core-kafka / test-finish ==
[info] 
[info] == core-kafka / Test cleanup 1 ==
[info] Deleting directory /tmp/sbt_441ddc90
[info] == core-kafka / Test cleanup 1 ==
[info] 
[info] == core-kafka / test-cleanup ==
[info] == core-kafka / test-cleanup ==
[error] Error running kafka.server.LogRecoveryTest: Test FAILED
[error] Error running test: One or more subtasks failed
[info] 
[info] Total time: 224 s, completed Oct 24, 2012 5:05:51 PM
[info] 
[info] Total session time: 225 s, completed Oct 24, 2012 5:05:51 PM
[error] Error during build.
Build step 'Execute shell' marked build as failure

Build failed in Jenkins: Kafka-0.8 #87

Posted by Apache Jenkins Server <je...@builds.apache.org>.
See <https://builds.apache.org/job/Kafka-0.8/87/changes>

Changes:

[junrao] SimpleConsumer throws UnsupportedOperationException: empty.head; patched by Yang Ye; reviewed by Jun Rao; kafka-576

------------------------------------------
[...truncated 1760 lines...]
[info] Test Passed: testLogRolls
[info] Test Starting: testCompressedMessages
[info] Test Passed: testCompressedMessages
[info] Test Starting: testFindSegment
[info] Test Passed: testFindSegment
[info] Test Starting: testEdgeLogRollsStartingAtZero
[info] Test Passed: testEdgeLogRollsStartingAtZero
[info] Test Starting: testEdgeLogRollsStartingAtNonZero
[info] Test Passed: testEdgeLogRollsStartingAtNonZero
[info] Test Starting: testMessageSizeCheck
[info] Test Passed: testMessageSizeCheck
[info] Test Starting: testLogRecoversToCorrectOffset
[info] Test Passed: testLogRecoversToCorrectOffset
[info] Test Starting: testTruncateTo
[info] Test Passed: testTruncateTo
[info] Test Starting: testAppendWithoutOffsetAssignment
[info] Test Passed: testAppendWithoutOffsetAssignment
[info] Test Starting: testReopenThenTruncate
[info] Test Passed: testReopenThenTruncate
[info] == core-kafka / kafka.log.LogTest ==
[info] 
[info] == core-kafka / kafka.javaapi.message.ByteBufferMessageSetTest ==
[info] Test Starting: testWrittenEqualsRead
[info] Test Passed: testWrittenEqualsRead
[info] Test Starting: testIteratorIsConsistent
[info] Test Passed: testIteratorIsConsistent
[info] Test Starting: testSizeInBytes
[info] Test Passed: testSizeInBytes
[info] Test Starting: testIteratorIsConsistentWithCompression
[info] Test Passed: testIteratorIsConsistentWithCompression
[info] Test Starting: testSizeInBytesWithCompression
[info] Test Passed: testSizeInBytesWithCompression
[info] Test Starting: testEquals
[info] Test Passed: testEquals
[info] Test Starting: testEqualsWithCompression
[info] Test Passed: testEqualsWithCompression
[info] == core-kafka / kafka.javaapi.message.ByteBufferMessageSetTest ==
[info] 
[info] == core-kafka / kafka.message.ByteBufferMessageSetTest ==
[info] Test Starting: testWrittenEqualsRead
[info] Test Passed: testWrittenEqualsRead
[info] Test Starting: testIteratorIsConsistent
[info] Test Passed: testIteratorIsConsistent
[info] Test Starting: testSizeInBytes
[info] Test Passed: testSizeInBytes
[info] Test Starting: testWriteTo
[info] Test Passed: testWriteTo
[info] Test Starting: testEquals
[info] Test Passed: testEquals
[info] Test Starting: testValidBytes
[info] Test Passed: testValidBytes
[info] Test Starting: testValidBytesWithCompression
[info] Test Passed: testValidBytesWithCompression
[info] Test Starting: testIterator
[info] Test Passed: testIterator
[info] Test Starting: testOffsetAssignment
[info] Test Passed: testOffsetAssignment
[info] == core-kafka / kafka.message.ByteBufferMessageSetTest ==
[info] 
[info] == core-kafka / kafka.api.RequestResponseSerializationTest ==
[info] Test Starting: testSerializationAndDeserialization
[info] Test Passed: testSerializationAndDeserialization
[info] == core-kafka / kafka.api.RequestResponseSerializationTest ==
[info] 
[info] == core-kafka / kafka.server.ReplicaFetchTest ==
[info] Test Starting: testReplicaFetcherThread(kafka.server.ReplicaFetchTest)
[info] Test Passed: testReplicaFetcherThread(kafka.server.ReplicaFetchTest)
[info] == core-kafka / kafka.server.ReplicaFetchTest ==
[info] 
[info] == core-kafka / kafka.producer.SyncProducerTest ==
[info] Test Starting: testReachableServer(kafka.producer.SyncProducerTest)
[info] Test Passed: testReachableServer(kafka.producer.SyncProducerTest)
[info] Test Starting: testEmptyProduceRequest(kafka.producer.SyncProducerTest)
[info] Test Passed: testEmptyProduceRequest(kafka.producer.SyncProducerTest)
[info] Test Starting: testMessageSizeTooLarge(kafka.producer.SyncProducerTest)
[info] Test Passed: testMessageSizeTooLarge(kafka.producer.SyncProducerTest)
[info] Test Starting: testProduceCorrectlyReceivesResponse(kafka.producer.SyncProducerTest)
[info] Test Passed: testProduceCorrectlyReceivesResponse(kafka.producer.SyncProducerTest)
[info] Test Starting: testProducerCanTimeout(kafka.producer.SyncProducerTest)
[info] Test Passed: testProducerCanTimeout(kafka.producer.SyncProducerTest)
[info] == core-kafka / kafka.producer.SyncProducerTest ==
[info] 
[info] == core-kafka / kafka.admin.AdminTest ==
[info] Test Starting: testReplicaAssignment(kafka.admin.AdminTest)
[info] Test Passed: testReplicaAssignment(kafka.admin.AdminTest)
[info] Test Starting: testManualReplicaAssignment(kafka.admin.AdminTest)
[info] Test Passed: testManualReplicaAssignment(kafka.admin.AdminTest)
[info] Test Starting: testTopicCreationInZK(kafka.admin.AdminTest)
[info] Test Passed: testTopicCreationInZK(kafka.admin.AdminTest)
[info] Test Starting: testGetTopicMetadata(kafka.admin.AdminTest)
[info] Test Passed: testGetTopicMetadata(kafka.admin.AdminTest)
[info] Test Starting: testPartitionReassignmentWithLeaderInNewReplicas(kafka.admin.AdminTest)
[info] Test Passed: testPartitionReassignmentWithLeaderInNewReplicas(kafka.admin.AdminTest)
[info] Test Starting: testPartitionReassignmentWithLeaderNotInNewReplicas(kafka.admin.AdminTest)
[info] Test Passed: testPartitionReassignmentWithLeaderNotInNewReplicas(kafka.admin.AdminTest)
[info] Test Starting: testPartitionReassignmentNonOverlappingReplicas(kafka.admin.AdminTest)
[info] Test Passed: testPartitionReassignmentNonOverlappingReplicas(kafka.admin.AdminTest)
[info] Test Starting: testReassigningNonExistingPartition(kafka.admin.AdminTest)
[info] Test Passed: testReassigningNonExistingPartition(kafka.admin.AdminTest)
[info] Test Starting: testResumePartitionReassignmentThatWasCompleted(kafka.admin.AdminTest)
[info] Test Passed: testResumePartitionReassignmentThatWasCompleted(kafka.admin.AdminTest)
[info] Test Starting: testPreferredReplicaJsonData(kafka.admin.AdminTest)
[info] Test Passed: testPreferredReplicaJsonData(kafka.admin.AdminTest)
[info] Test Starting: testBasicPreferredReplicaElection(kafka.admin.AdminTest)
[info] Test Passed: testBasicPreferredReplicaElection(kafka.admin.AdminTest)
[info] == core-kafka / kafka.admin.AdminTest ==
[info] 
[info] == core-kafka / kafka.network.SocketServerTest ==
[info] Test Starting: simpleRequest
[info] Test Passed: simpleRequest
[info] Test Starting: tooBigRequestIsRejected
[info] Test Passed: tooBigRequestIsRejected
[info] == core-kafka / kafka.network.SocketServerTest ==
[info] 
[info] == core-kafka / kafka.log.LogManagerTest ==
[info] Test Starting: testCreateLog(kafka.log.LogManagerTest)
[info] Test Passed: testCreateLog(kafka.log.LogManagerTest)
[info] Test Starting: testGetLog(kafka.log.LogManagerTest)
[info] Test Passed: testGetLog(kafka.log.LogManagerTest)
[info] Test Starting: testCleanupExpiredSegments(kafka.log.LogManagerTest)
[info] Test Passed: testCleanupExpiredSegments(kafka.log.LogManagerTest)
[info] Test Starting: testCleanupSegmentsToMaintainSize(kafka.log.LogManagerTest)
[info] Test Passed: testCleanupSegmentsToMaintainSize(kafka.log.LogManagerTest)
[info] Test Starting: testTimeBasedFlush(kafka.log.LogManagerTest)
now = 1351092321183 last flush = 1351092321174
[info] Test Passed: testTimeBasedFlush(kafka.log.LogManagerTest)
[info] == core-kafka / kafka.log.LogManagerTest ==
[info] 
[info] == core-kafka / kafka.integration.FetcherTest ==
[info] Test Starting: testFetcher(kafka.integration.FetcherTest)
[info] Test Passed: testFetcher(kafka.integration.FetcherTest)
[info] == core-kafka / kafka.integration.FetcherTest ==
[info] 
[info] == core-kafka / kafka.server.RequestPurgatoryTest ==
[info] Test Starting: testRequestSatisfaction(kafka.server.RequestPurgatoryTest)
[info] Test Passed: testRequestSatisfaction(kafka.server.RequestPurgatoryTest)
[info] Test Starting: testRequestExpiry(kafka.server.RequestPurgatoryTest)
[info] Test Passed: testRequestExpiry(kafka.server.RequestPurgatoryTest)
[info] == core-kafka / kafka.server.RequestPurgatoryTest ==
[info] 
[info] == core-kafka / kafka.message.MessageTest ==
[info] Test Starting: testFieldValues
[info] Test Passed: testFieldValues
[info] Test Starting: testChecksum
[info] Test Passed: testChecksum
[info] Test Starting: testEquality
[info] Test Passed: testEquality
[info] Test Starting: testIsHashable
[info] Test Passed: testIsHashable
[info] == core-kafka / kafka.message.MessageTest ==
[info] 
[info] == core-kafka / kafka.server.LeaderElectionTest ==
[info] Test Starting: testLeaderElectionAndEpoch(kafka.server.LeaderElectionTest)
[info] Test Passed: testLeaderElectionAndEpoch(kafka.server.LeaderElectionTest)
[info] == core-kafka / kafka.server.LeaderElectionTest ==
[info] 
[info] == core-kafka / kafka.consumer.ZookeeperConsumerConnectorTest ==
[info] Test Starting: testBasic(kafka.consumer.ZookeeperConsumerConnectorTest)
[info] Test Passed: testBasic(kafka.consumer.ZookeeperConsumerConnectorTest)
[info] Test Starting: testCompression(kafka.consumer.ZookeeperConsumerConnectorTest)
[error] Test Failed: testCompression(kafka.consumer.ZookeeperConsumerConnectorTest)
junit.framework.AssertionFailedError: expected:<List((0,group1_consumer1-0), (1,group1_consumer2-0))> but was:<ArrayBuffer((1,group1_consumer2-0))>
	at junit.framework.Assert.fail(Assert.java:47)
	at junit.framework.Assert.failNotEquals(Assert.java:277)
	at junit.framework.Assert.assertEquals(Assert.java:64)
	at junit.framework.Assert.assertEquals(Assert.java:71)
	at kafka.consumer.ZookeeperConsumerConnectorTest.testCompression(ZookeeperConsumerConnectorTest.scala:227)
	at sun.reflect.NativeMethodAccessorImpl.invoke0(Native Method)
	at sun.reflect.NativeMethodAccessorImpl.invoke(NativeMethodAccessorImpl.java:39)
	at sun.reflect.DelegatingMethodAccessorImpl.invoke(DelegatingMethodAccessorImpl.java:25)
	at java.lang.reflect.Method.invoke(Method.java:597)
	at junit.framework.TestCase.runTest(TestCase.java:164)
	at junit.framework.TestCase.runBare(TestCase.java:130)
	at junit.framework.TestResult$1.protect(TestResult.java:110)
	at junit.framework.TestResult.runProtected(TestResult.java:128)
	at junit.framework.TestResult.run(TestResult.java:113)
	at junit.framework.TestCase.run(TestCase.java:120)
	at junit.framework.TestSuite.runTest(TestSuite.java:228)
	at junit.framework.TestSuite.run(TestSuite.java:223)
	at junit.framework.TestSuite.runTest(TestSuite.java:228)
	at junit.framework.TestSuite.run(TestSuite.java:223)
	at org.scalatest.junit.JUnit3Suite.run(JUnit3Suite.scala:309)
	at org.scalatest.tools.ScalaTestFramework$ScalaTestRunner.run(ScalaTestFramework.scala:40)
	at sbt.TestRunner.run(TestFramework.scala:53)
	at sbt.TestRunner.runTest$1(TestFramework.scala:67)
	at sbt.TestRunner.run(TestFramework.scala:76)
	at sbt.TestFramework$$anonfun$10$$anonfun$apply$11.runTest$2(TestFramework.scala:194)
	at sbt.TestFramework$$anonfun$10$$anonfun$apply$11$$anonfun$apply$12.apply(TestFramework.scala:205)
	at sbt.TestFramework$$anonfun$10$$anonfun$apply$11$$anonfun$apply$12.apply(TestFramework.scala:205)
	at sbt.NamedTestTask.run(TestFramework.scala:92)
	at sbt.ScalaProject$$anonfun$sbt$ScalaProject$$toTask$1.apply(ScalaProject.scala:193)
	at sbt.ScalaProject$$anonfun$sbt$ScalaProject$$toTask$1.apply(ScalaProject.scala:193)
	at sbt.TaskManager$Task.invoke(TaskManager.scala:62)
	at sbt.impl.RunTask.doRun$1(RunTask.scala:77)
	at sbt.impl.RunTask.runTask(RunTask.scala:85)
	at sbt.impl.RunTask.sbt$impl$RunTask$$runIfNotRoot(RunTask.scala:60)
	at sbt.impl.RunTask$$anonfun$runTasksExceptRoot$2.apply(RunTask.scala:48)
	at sbt.impl.RunTask$$anonfun$runTasksExceptRoot$2.apply(RunTask.scala:48)
	at sbt.Distributor$Run$Worker$$anonfun$2.apply(ParallelRunner.scala:131)
	at sbt.Distributor$Run$Worker$$anonfun$2.apply(ParallelRunner.scala:131)
	at sbt.Control$.trapUnit(Control.scala:19)
	at sbt.Distributor$Run$Worker.run(ParallelRunner.scala:131)
[info] Test Starting: testCompressionSetConsumption(kafka.consumer.ZookeeperConsumerConnectorTest)
[info] Test Passed: testCompressionSetConsumption(kafka.consumer.ZookeeperConsumerConnectorTest)
[info] Test Starting: testConsumerDecoder(kafka.consumer.ZookeeperConsumerConnectorTest)
[info] Test Passed: testConsumerDecoder(kafka.consumer.ZookeeperConsumerConnectorTest)
[info] Test Starting: testLeaderSelectionForPartition(kafka.consumer.ZookeeperConsumerConnectorTest)
[info] Test Passed: testLeaderSelectionForPartition(kafka.consumer.ZookeeperConsumerConnectorTest)
[info] == core-kafka / kafka.consumer.ZookeeperConsumerConnectorTest ==
[info] 
[info] == perf / copy-test-resources ==
[info] == perf / copy-test-resources ==
[info] 
[info] == perf / test-compile ==
[info]   Source analysis: 0 new/modified, 0 indirectly invalidated, 0 removed.
[info] Compiling test sources...
[info] Nothing to compile.
[info]   Post-analysis: 0 classes.
[info] == perf / test-compile ==
[info] 
[info] == hadoop consumer / copy-resources ==
[info] == hadoop consumer / copy-resources ==
[info] 
[info] == hadoop producer / copy-resources ==
[info] == hadoop producer / copy-resources ==
[info] 
[info] == hadoop consumer / copy-test-resources ==
[info] == hadoop consumer / copy-test-resources ==
[info] 
[info] == core-kafka / test-finish ==
[error] Failed: : Total 159, Failed 3, Errors 0, Passed 156, Skipped 0
[info] == core-kafka / test-finish ==
[info] 
[info] == core-kafka / Test cleanup 1 ==
[info] Deleting directory /tmp/sbt_5ed4e400
[info] == core-kafka / Test cleanup 1 ==
[info] 
[info] == core-kafka / test-cleanup ==
[info] == core-kafka / test-cleanup ==
[error] Error running kafka.server.LogRecoveryTest: Test FAILED
[error] Error running kafka.integration.AutoOffsetResetTest: Test FAILED
[error] Error running kafka.consumer.ZookeeperConsumerConnectorTest: Test FAILED
[error] Error running test: One or more subtasks failed
[info] 
[info] Total time: 221 s, completed Oct 24, 2012 3:25:52 PM
[info] 
[info] Total session time: 222 s, completed Oct 24, 2012 3:25:52 PM
[error] Error during build.
Build step 'Execute shell' marked build as failure