You are viewing a plain text version of this content. The canonical link for it is here.
Posted to dev@sling.apache.org by Apache Jenkins Server <je...@builds.apache.org> on 2015/04/10 10:08:31 UTC

Build failed in Jenkins: sling-trunk-1.6 #3277

See <https://builds.apache.org/job/sling-trunk-1.6/3277/changes>

Changes:

[cziegeler] Remove unused code and add failing project to exception

[cziegeler] SLING-4598 : Migrate launchpad testing to provisioning model

[cziegeler] Revert release

[cziegeler] [maven-release-plugin] prepare for next development iteration

[cziegeler] [maven-release-plugin] prepare release org.apache.sling.commons.testing-2.0.18

------------------------------------------
Started by an SCM change
Building remotely on ubuntu-6 (docker Ubuntu ubuntu) in workspace <https://builds.apache.org/job/sling-trunk-1.6/ws/>
Updating http://svn.apache.org/repos/asf/sling/trunk at revision '2015-04-10T08:03:45.434 +0000'
D         launchpad/testing/src/main/resources
U         launchpad/integration-tests/pom.xml
A         launchpad/test-bundles/src/main/provisioning
AU        launchpad/test-bundles/src/main/provisioning/bundles.txt
U         contrib/extensions/i18n/src/main/java/org/apache/sling/i18n/impl/JcrResourceBundle.java
U         tooling/maven/slingstart-maven-plugin/src/main/java/org/apache/sling/maven/slingstart/DependencyLifecycleParticipant.java
At revision 1672580
Parsing POMs
Modules changed, recalculating dependency graph
maven3-agent.jar already up to date
maven3-interceptor.jar already up to date
maven3-interceptor-commons.jar already up to date
[trunk] $ /home/jenkins/tools/java/latest1.6/bin/java -Xmx512M -XX:MaxPermSize=256M -enableassertions -cp /home/jenkins/jenkins-slave/maven3-agent.jar:/home/jenkins/jenkins-slave/tools/hudson.tasks.Maven_MavenInstallation/Maven_3.0.5/boot/plexus-classworlds-2.4.jar org.jvnet.hudson.maven3.agent.Maven3Main /home/jenkins/jenkins-slave/tools/hudson.tasks.Maven_MavenInstallation/Maven_3.0.5 /home/jenkins/jenkins-slave/slave.jar /home/jenkins/jenkins-slave/maven3-interceptor.jar /home/jenkins/jenkins-slave/maven3-interceptor-commons.jar 47160
<===[JENKINS REMOTING CAPACITY]===>   channel started
Executing Maven:  -B -f <https://builds.apache.org/job/sling-trunk-1.6/ws/trunk/pom.xml> -Dmaven.repo.local=/home/jenkins/jenkins-slave/maven-repositories/0 -DobrRepository=false clean deploy -DHttpTestBase.readyTimeoutSeconds=300
[INFO] Scanning for projects...
[WARNING] 
[WARNING] Some problems were encountered while building the effective model for org.apache.sling:org.apache.sling.discovery.impl:bundle:1.1.1-SNAPSHOT
[WARNING] 'dependencies.dependency.(groupId:artifactId:type:classifier)' must be unique: org.apache.sling:org.apache.sling.testing.tools:jar -> duplicate declaration of version 1.0.2 @ line 259, column 21
[WARNING] 
[WARNING] It is highly recommended to fix these problems because they threaten the stability of your build.
[WARNING] 
[WARNING] For this reason, future Maven versions might no longer support building such malformed projects.
[WARNING] 
[INFO] Searching for slingstart projects...
[ERROR] Unable to determine plugin-based dependencies: No launchpad feature found. -> [Help 1]
[ERROR] 
[ERROR] To see the full stack trace of the errors, re-run Maven with the -e switch.
[ERROR] Re-run Maven using the -X switch to enable full debug logging.
[ERROR] 
[ERROR] For more information about the errors and possible solutions, please read the following articles:
[ERROR] [Help 1] http://cwiki.apache.org/confluence/display/MAVEN/MavenExecutionException
channel stopped

Jenkins build is still unstable: sling-trunk-1.6 #3288

Posted by Apache Jenkins Server <je...@builds.apache.org>.
See <https://builds.apache.org/job/sling-trunk-1.6/changes>


Jenkins build is unstable: sling-trunk-1.6 #3287

Posted by Apache Jenkins Server <je...@builds.apache.org>.
See <https://builds.apache.org/job/sling-trunk-1.6/3287/changes>


Build failed in Jenkins: sling-trunk-1.6 #3286

Posted by Apache Jenkins Server <je...@builds.apache.org>.
See <https://builds.apache.org/job/sling-trunk-1.6/3286/changes>

Changes:

[kwin] fix warnings

------------------------------------------
[...truncated 53296 lines...]
[INFO] Apache Sling Repository API Bundle ................ SUCCESS [7.465s]
[INFO] Apache Sling Testing JCR Mock ..................... SUCCESS [4.627s]
[INFO] Apache Sling JCR Base Bundle ...................... SUCCESS [7.785s]
[INFO] Apache Sling JCR ClassLoader ...................... SUCCESS [8.717s]
[INFO] Apache Sling Initial Content Loader ............... SUCCESS [11.302s]
[INFO] Apache Sling Jackrabbit Embedded Repository ....... SUCCESS [36.606s]
[INFO] Apache Sling Jackrabbit UserManager Support ....... SUCCESS [5.488s]
[INFO] Apache Sling Jackrabbit JSR-283 Access Control Manager Support  SUCCESS [9.525s]
[INFO] Apache Sling Wrapper Bundle for the JCR API ....... SUCCESS [4.830s]
[INFO] Apache Sling JCR Resource Resolver ................ SUCCESS [37.976s]
[INFO] Apache Sling Testing Sling Mock Jackrabbit-based Resource Resolver  SUCCESS [15.233s]
[INFO] Apache Sling Versioning Integration Tests ......... SUCCESS [15.721s]
[INFO] Apache Sling JCR Repository Registration .......... SUCCESS [5.339s]
[INFO] Apache Sling Simple WebDAV Access to repositories . SUCCESS [5.223s]
[INFO] Apache Sling DavEx Access to repositories ......... SUCCESS [5.080s]
[INFO] Apache Sling JCR WebConsole Bundle ................ SUCCESS [6.920s]
[INFO] Apache Sling Oak Repository Server ................ SUCCESS [10.913s]
[INFO] Apache Sling SlingRepository Integration Tests .... SUCCESS [53.047s]
[INFO] Apache Sling Servlet Resolver ..................... SUCCESS [6.786s]
[INFO] Apache Sling Default GET Servlets ................. SUCCESS [12.569s]
[INFO] Apache Sling Default POST Servlets ................ SUCCESS [5.866s]
[INFO] Apache Sling Compat Servlets ...................... SUCCESS [5.785s]
[INFO] Apache Sling Scripting Implementation API ......... SUCCESS [5.404s]
[INFO] Apache Sling Scripting Core implementation ........ SUCCESS [15.694s]
[INFO] Apache Sling Scripting JavaScript Support ......... SUCCESS [14.166s]
[INFO] Apache Sling Scripting JSP Support ................ SUCCESS [9.496s]
[INFO] Apache Sling JSP Tag Library ...................... SUCCESS [7.886s]
[INFO] Apache Sling JSP Standard Tag Library ............. SUCCESS [9.008s]
[INFO] Apache Sling Adapter Manager Implementation ....... SUCCESS [4.503s]
[INFO] Apache Sling Bundle Resource Provider ............. SUCCESS [4.601s]
[INFO] Apache Sling Distributed Event Admin .............. SUCCESS [11.401s]
[INFO] Apache Sling Discovery API ........................ SUCCESS [4.438s]
[INFO] Apache Sling Resource-Based Discovery Service ..... SUCCESS [4:36.341s]
[INFO] Apache Sling Discovery Support Bundle ............. SUCCESS [4.077s]
[INFO] Apache Sling Discovery Standalone Implementation .. SUCCESS [4.474s]
[INFO] Apache Sling Event Support ........................ SUCCESS [11:25.635s]
[INFO] Apache Sling Feature Flags ........................ SUCCESS [3.736s]
[INFO] Apache Sling Filesystem Resource Provider ......... SUCCESS [4.832s]
[INFO] Apache Sling javax.activation bundle .............. SUCCESS [3.690s]
[INFO] Apache Sling Service User Mapper .................. SUCCESS [4.150s]
[INFO] Apache Sling Settings ............................. SUCCESS [11.743s]
[INFO] Apache Sling Web Console Branding ................. SUCCESS [6.678s]
[INFO] Apache Sling Web Console Security Provider ........ SUCCESS [14.172s]
[INFO] Apache Sling Explorer ............................. SUCCESS [9.521s]
[INFO] Apache Sling Health Check Core .................... SUCCESS [7.959s]
[INFO] Apache Sling Health Check Annotations ............. SUCCESS [6.995s]
[INFO] Apache Sling Health Check Samples ................. SUCCESS [11.219s]
[INFO] Apache Sling Health Check Support Components ...... SUCCESS [13.075s]
[INFO] Apache Sling Health Check Webconsole Plugin ....... SUCCESS [5.007s]
[INFO] Apache Sling Health Check JUnit Bridge ............ SUCCESS [6.115s]
[INFO] Apache Sling Health Check Integration Tests ....... SUCCESS [36.810s]
[INFO] Apache Sling Health Check Reactor POM ............. SUCCESS [2.863s]
[INFO] Apache Sling Resource Access Security ............. SUCCESS [4.202s]
[INFO] Apache Sling Resource Access Security Integration Tests  SUCCESS [25.251s]
[INFO] Apache Sling Validation Framework API ............. SUCCESS [4.952s]
[INFO] Apache Sling Validation Framework Core Implementation  SUCCESS [16.207s]
[INFO] Apache Sling Validation Framework Testing Services  SUCCESS [8.362s]
[INFO] Apache Sling Validation Framework Integration Tests  SUCCESS [22.916s]
[INFO] Apache Sling Validation Framework Examples ........ SUCCESS [4.629s]
[INFO] Apache Sling Validation Framework Builder ......... SUCCESS [4.123s]
[INFO] Apache Sling Models API ........................... SUCCESS [6.575s]
[INFO] Apache Sling Models Implementation ................ SUCCESS [7.095s]
[INFO] Apache Sling Test Tools ........................... SUCCESS [5.757s]
[INFO] Apache Sling Models Integration Tests ............. SUCCESS [39.542s]
[INFO] Apache Sling JUnit Core ........................... SUCCESS [4.838s]
[INFO] Apache Sling JUnit Scriptable Tests Provider ...... SUCCESS [5.607s]
[INFO] Apache Sling JUnit Health Checks .................. SUCCESS [4.821s]
[INFO] Apache Sling JUnit Remote Tests Runners ........... SUCCESS [3.351s]
[INFO] Apache Sling JUnit Performance .................... SUCCESS [4.141s]
[INFO] Apache Sling Testing Resource Resolver Mock ....... SUCCESS [3.659s]
[INFO] Apache Sling Testing OSGi Mock .................... SUCCESS [10.379s]
[INFO] Apache Sling Testing Sling Mock ................... SUCCESS [8.050s]
[INFO] Apache Sling Pax Exam Utilities ................... SUCCESS [25.316s]
[INFO] Apache Sling Sample Server-Side Tests ............. SUCCESS [5.706s]
[INFO] Apache Sling Failing Server-Side Tests ............ SUCCESS [5.594s]
[INFO] Apache Sling Launchpad Base ....................... SUCCESS [15.199s]
[INFO] Apache Sling Launchpad Application Builder ........ SUCCESS [46.200s]
[INFO] Apache Sling Sample Integration Tests ............. SUCCESS [1:06.486s]
[INFO] Apache Sling Testing Modules Reactor .............. SUCCESS [2.192s]
[INFO] Apache Sling Installer ............................ SUCCESS [6.381s]
[INFO] Apache Sling Installer WebConsole Plugin .......... SUCCESS [3.926s]
[INFO] Apache Sling File Installer ....................... SUCCESS [10.327s]
[INFO] Apache Sling JCR Installer ........................ FAILURE [2:52.279s]
[INFO] Apache Sling Installer Configuration Admin Support  SKIPPED
[INFO] Apache Sling Deployment Package Installer ......... SKIPPED
[INFO] Apache Sling Subsystems Installer ................. SKIPPED
[INFO] Apache Sling Installer Integration Tests .......... SKIPPED
[INFO] Apache Sling Launchpad API ........................ SKIPPED
[INFO] Apache Sling Launchpad Installer .................. SKIPPED
[INFO] Apache Sling Launchpad Content .................... SKIPPED
[INFO] Apache Sling Launchpad Testing Services ........... SKIPPED
[INFO] Apache Sling Launchpad Testing Services WAR ....... SKIPPED
[INFO] Apache Sling Launchpad Testing Fragment Bundle .... SKIPPED
[INFO] Apache Sling Launchpad Test Bundles ............... SKIPPED
[INFO] Apache Sling Integration Tests .................... SKIPPED
[INFO] Apache Sling Launchpad Testing .................... SKIPPED
[INFO] Apache Sling (Builder) ............................ SKIPPED
[INFO] ------------------------------------------------------------------------
[INFO] BUILD FAILURE
[INFO] ------------------------------------------------------------------------
[INFO] Total time: 40:18.536s
[INFO] Finished at: Sat Apr 11 12:46:11 UTC 2015
[INFO] Final Memory: 186M/404M
[INFO] ------------------------------------------------------------------------
[JENKINS] Archiving disabled
[JENKINS] Archiving disabled
[JENKINS] Archiving disabled
[JENKINS] Archiving disabled
[JENKINS] Archiving disabled
[JENKINS] Archiving disabled
[JENKINS] Archiving disabled
[JENKINS] Archiving disabled
[JENKINS] Archiving disabled
[JENKINS] Archiving disabled
[JENKINS] Archiving disabled
[JENKINS] Archiving disabled
[JENKINS] Archiving disabled
[JENKINS] Archiving disabled
[JENKINS] Archiving disabled
[JENKINS] Archiving disabled
[JENKINS] Archiving disabled
[JENKINS] Archiving disabled
[JENKINS] Archiving disabled
[JENKINS] Archiving disabled
[JENKINS] Archiving disabled
[JENKINS] Archiving disabled
[JENKINS] Archiving disabled
[JENKINS] Archiving disabled
[JENKINS] Archiving disabled
[JENKINS] Archiving disabled
[JENKINS] Archiving disabled
[JENKINS] Archiving disabled
[JENKINS] Archiving disabled
[JENKINS] Archiving disabled
[JENKINS] Archiving disabled
[JENKINS] Archiving disabled
[JENKINS] Archiving disabled
[JENKINS] Archiving disabled
[JENKINS] Archiving disabled
[JENKINS] Archiving disabled
[JENKINS] Archiving disabled
[JENKINS] Archiving disabled
[JENKINS] Archiving disabled
[JENKINS] Archiving disabled
[JENKINS] Archiving disabled
[JENKINS] Archiving disabled
[JENKINS] Archiving disabled
[JENKINS] Archiving disabled
[JENKINS] Archiving disabled
[JENKINS] Archiving disabled
[JENKINS] Archiving disabled
[JENKINS] Archiving disabled
[JENKINS] Archiving disabled
[JENKINS] Archiving disabled
[JENKINS] Archiving disabled
[JENKINS] Archiving disabled
[JENKINS] Archiving disabled
[JENKINS] Archiving disabled
[JENKINS] Archiving disabled
[JENKINS] Archiving disabled
[JENKINS] Archiving disabled
[JENKINS] Archiving disabled
[JENKINS] Archiving disabled
[JENKINS] Archiving disabled
[JENKINS] Archiving disabled
[JENKINS] Archiving disabled
[JENKINS] Archiving disabled
[JENKINS] Archiving disabled
[JENKINS] Archiving disabled
[JENKINS] Archiving disabled
[JENKINS] Archiving disabled
[JENKINS] Archiving disabled
[JENKINS] Archiving disabled
[JENKINS] Archiving disabled
[JENKINS] Archiving disabled
[JENKINS] Archiving disabled
[JENKINS] Archiving disabled
[JENKINS] Archiving disabled
[JENKINS] Archiving disabled
[JENKINS] Archiving disabled
[JENKINS] Archiving disabled
[JENKINS] Archiving disabled
[JENKINS] Archiving disabled
[JENKINS] Archiving disabled
[JENKINS] Archiving disabled
[JENKINS] Archiving disabled
[JENKINS] Archiving disabled
[JENKINS] Archiving disabled
[JENKINS] Archiving disabled
[JENKINS] Archiving disabled
[JENKINS] Archiving disabled
[JENKINS] Archiving disabled
[JENKINS] Archiving disabled
[JENKINS] Archiving disabled
[JENKINS] Archiving disabled
[JENKINS] Archiving disabled
[JENKINS] Archiving disabled
[JENKINS] Archiving disabled
[JENKINS] Archiving disabled
[JENKINS] Archiving disabled
[JENKINS] Archiving disabled
[JENKINS] Archiving disabled
[JENKINS] Archiving disabled
[JENKINS] Archiving disabled
[JENKINS] Archiving disabled
[JENKINS] Archiving disabled
[JENKINS] Archiving disabled
[JENKINS] Archiving disabled
[JENKINS] Archiving disabled
[JENKINS] Archiving disabled
[JENKINS] Archiving disabled
[JENKINS] Archiving disabled
[JENKINS] Archiving disabled
[JENKINS] Archiving disabled
[JENKINS] Archiving disabled
[JENKINS] Archiving disabled
[JENKINS] Archiving disabled
[JENKINS] Archiving disabled
[JENKINS] Archiving disabled
[JENKINS] Archiving disabled
[JENKINS] Archiving disabled
[JENKINS] Archiving disabled
[JENKINS] Archiving disabled
[JENKINS] Archiving disabled
[JENKINS] Archiving disabled
[JENKINS] Archiving disabled
[JENKINS] Archiving disabled
[JENKINS] Archiving disabled
[JENKINS] Archiving disabled
[JENKINS] Archiving disabled
[JENKINS] Archiving disabled
[JENKINS] Archiving disabled
[JENKINS] Archiving disabled
[JENKINS] Archiving disabled
[JENKINS] Archiving disabled
[JENKINS] Archiving disabled
[JENKINS] Archiving disabled
Waiting for Jenkins to finish collecting data
[ERROR] Failed to execute goal org.apache.maven.plugins:maven-deploy-plugin:2.8.1:deploy (default-deploy) on project org.apache.sling.installer.provider.jcr: Failed to retrieve remote metadata org.apache.sling:org.apache.sling.installer.provider.jcr:3.1.17-SNAPSHOT/maven-metadata.xml: Could not transfer metadata org.apache.sling:org.apache.sling.installer.provider.jcr:3.1.17-SNAPSHOT/maven-metadata.xml from/to apache.snapshots.https (https://repository.apache.org/content/repositories/snapshots): repository.apache.org: Unknown host repository.apache.org -> [Help 1]
[ERROR] 
[ERROR] To see the full stack trace of the errors, re-run Maven with the -e switch.
[ERROR] Re-run Maven using the -X switch to enable full debug logging.
[ERROR] 
[ERROR] For more information about the errors and possible solutions, please read the following articles:
[ERROR] [Help 1] http://cwiki.apache.org/confluence/display/MAVEN/MojoExecutionException
[ERROR] 
[ERROR] After correcting the problems, you can resume the build with the command
[ERROR]   mvn <goals> -rf :org.apache.sling.installer.provider.jcr
channel stopped

Jenkins build is still unstable: sling-trunk-1.6 #3285

Posted by Apache Jenkins Server <je...@builds.apache.org>.
See <https://builds.apache.org/job/sling-trunk-1.6/changes>


Jenkins build is unstable: sling-trunk-1.6 #3284

Posted by Apache Jenkins Server <je...@builds.apache.org>.
See <https://builds.apache.org/job/sling-trunk-1.6/3284/changes>


Build failed in Jenkins: sling-trunk-1.6 #3283

Posted by Apache Jenkins Server <je...@builds.apache.org>.
See <https://builds.apache.org/job/sling-trunk-1.6/3283/changes>

Changes:

[cziegeler] SLING-4602 : Migrate launchpad/testing-war to provisioning model

------------------------------------------
[...truncated 43450 lines...]
[INFO] Apache Sling Repository API Bundle ................ SUCCESS [4.737s]
[INFO] Apache Sling Testing JCR Mock ..................... SUCCESS [4.110s]
[INFO] Apache Sling JCR Base Bundle ...................... SUCCESS [10.823s]
[INFO] Apache Sling JCR ClassLoader ...................... SUCCESS [2.963s]
[INFO] Apache Sling Initial Content Loader ............... SUCCESS [4.449s]
[INFO] Apache Sling Jackrabbit Embedded Repository ....... SUCCESS [16.162s]
[INFO] Apache Sling Jackrabbit UserManager Support ....... SUCCESS [5.949s]
[INFO] Apache Sling Jackrabbit JSR-283 Access Control Manager Support  SUCCESS [6.476s]
[INFO] Apache Sling Wrapper Bundle for the JCR API ....... SUCCESS [6.078s]
[INFO] Apache Sling JCR Resource Resolver ................ SUCCESS [39.284s]
[INFO] Apache Sling Testing Sling Mock Jackrabbit-based Resource Resolver  SUCCESS [14.550s]
[INFO] Apache Sling Versioning Integration Tests ......... SUCCESS [12.322s]
[INFO] Apache Sling JCR Repository Registration .......... SUCCESS [7.911s]
[INFO] Apache Sling Simple WebDAV Access to repositories . SUCCESS [5.613s]
[INFO] Apache Sling DavEx Access to repositories ......... SUCCESS [5.096s]
[INFO] Apache Sling JCR WebConsole Bundle ................ SUCCESS [3.091s]
[INFO] Apache Sling Oak Repository Server ................ SUCCESS [3.831s]
[INFO] Apache Sling SlingRepository Integration Tests .... SUCCESS [54.298s]
[INFO] Apache Sling Servlet Resolver ..................... SUCCESS [5.198s]
[INFO] Apache Sling Default GET Servlets ................. SUCCESS [4.918s]
[INFO] Apache Sling Default POST Servlets ................ SUCCESS [8.431s]
[INFO] Apache Sling Compat Servlets ...................... SUCCESS [3.247s]
[INFO] Apache Sling Scripting Implementation API ......... SUCCESS [2.949s]
[INFO] Apache Sling Scripting Core implementation ........ SUCCESS [11.404s]
[INFO] Apache Sling Scripting JavaScript Support ......... SUCCESS [10.351s]
[INFO] Apache Sling Scripting JSP Support ................ SUCCESS [6.311s]
[INFO] Apache Sling JSP Tag Library ...................... SUCCESS [8.392s]
[INFO] Apache Sling JSP Standard Tag Library ............. SUCCESS [3.770s]
[INFO] Apache Sling Adapter Manager Implementation ....... SUCCESS [4.636s]
[INFO] Apache Sling Bundle Resource Provider ............. SUCCESS [5.524s]
[INFO] Apache Sling Distributed Event Admin .............. SUCCESS [5.928s]
[INFO] Apache Sling Discovery API ........................ SUCCESS [3.430s]
[INFO] Apache Sling Resource-Based Discovery Service ..... SUCCESS [4:38.077s]
[INFO] Apache Sling Discovery Support Bundle ............. SUCCESS [2.959s]
[INFO] Apache Sling Discovery Standalone Implementation .. SUCCESS [5.026s]
[INFO] Apache Sling Event Support ........................ SUCCESS [11:35.003s]
[INFO] Apache Sling Feature Flags ........................ SUCCESS [3.613s]
[INFO] Apache Sling Filesystem Resource Provider ......... SUCCESS [4.139s]
[INFO] Apache Sling javax.activation bundle .............. SUCCESS [3.949s]
[INFO] Apache Sling Service User Mapper .................. SUCCESS [4.428s]
[INFO] Apache Sling Settings ............................. SUCCESS [4.955s]
[INFO] Apache Sling Web Console Branding ................. SUCCESS [3.066s]
[INFO] Apache Sling Web Console Security Provider ........ SUCCESS [4.153s]
[INFO] Apache Sling Explorer ............................. SUCCESS [3.930s]
[INFO] Apache Sling Health Check Core .................... SUCCESS [7.655s]
[INFO] Apache Sling Health Check Annotations ............. SUCCESS [3.336s]
[INFO] Apache Sling Health Check Samples ................. SUCCESS [4.201s]
[INFO] Apache Sling Health Check Support Components ...... SUCCESS [4.175s]
[INFO] Apache Sling Health Check Webconsole Plugin ....... SUCCESS [9.148s]
[INFO] Apache Sling Health Check JUnit Bridge ............ SUCCESS [4.132s]
[INFO] Apache Sling Health Check Integration Tests ....... SUCCESS [26.413s]
[INFO] Apache Sling Health Check Reactor POM ............. SUCCESS [1.830s]
[INFO] Apache Sling Resource Access Security ............. SUCCESS [3.679s]
[INFO] Apache Sling Resource Access Security Integration Tests  SUCCESS [23.244s]
[INFO] Apache Sling Validation Framework API ............. SUCCESS [4.601s]
[INFO] Apache Sling Validation Framework Core Implementation  SUCCESS [13.554s]
[INFO] Apache Sling Validation Framework Testing Services  SUCCESS [3.676s]
[INFO] Apache Sling Validation Framework Integration Tests  SUCCESS [25.012s]
[INFO] Apache Sling Validation Framework Examples ........ SUCCESS [3.044s]
[INFO] Apache Sling Validation Framework Builder ......... FAILURE [0.141s]
[INFO] Apache Sling Models API ........................... SKIPPED
[INFO] Apache Sling Models Implementation ................ SKIPPED
[INFO] Apache Sling Test Tools ........................... SKIPPED
[INFO] Apache Sling Models Integration Tests ............. SKIPPED
[INFO] Apache Sling JUnit Core ........................... SKIPPED
[INFO] Apache Sling JUnit Scriptable Tests Provider ...... SKIPPED
[INFO] Apache Sling JUnit Health Checks .................. SKIPPED
[INFO] Apache Sling JUnit Remote Tests Runners ........... SKIPPED
[INFO] Apache Sling JUnit Performance .................... SKIPPED
[INFO] Apache Sling Testing Resource Resolver Mock ....... SKIPPED
[INFO] Apache Sling Testing OSGi Mock .................... SKIPPED
[INFO] Apache Sling Testing Sling Mock ................... SKIPPED
[INFO] Apache Sling Pax Exam Utilities ................... SKIPPED
[INFO] Apache Sling Sample Server-Side Tests ............. SKIPPED
[INFO] Apache Sling Failing Server-Side Tests ............ SKIPPED
[INFO] Apache Sling Launchpad Base ....................... SKIPPED
[INFO] Apache Sling Launchpad Application Builder ........ SKIPPED
[INFO] Apache Sling Sample Integration Tests ............. SKIPPED
[INFO] Apache Sling Testing Modules Reactor .............. SKIPPED
[INFO] Apache Sling Installer ............................ SKIPPED
[INFO] Apache Sling Installer WebConsole Plugin .......... SKIPPED
[INFO] Apache Sling File Installer ....................... SKIPPED
[INFO] Apache Sling JCR Installer ........................ SKIPPED
[INFO] Apache Sling Installer Configuration Admin Support  SKIPPED
[INFO] Apache Sling Deployment Package Installer ......... SKIPPED
[INFO] Apache Sling Subsystems Installer ................. SKIPPED
[INFO] Apache Sling Installer Integration Tests .......... SKIPPED
[INFO] Apache Sling Launchpad API ........................ SKIPPED
[INFO] Apache Sling Launchpad Installer .................. SKIPPED
[INFO] Apache Sling Launchpad Content .................... SKIPPED
[INFO] Apache Sling Launchpad Testing Services ........... SKIPPED
[INFO] Apache Sling Launchpad Testing Services WAR ....... SKIPPED
[INFO] Apache Sling Launchpad Testing Fragment Bundle .... SKIPPED
[INFO] Apache Sling Launchpad Test Bundles ............... SKIPPED
[INFO] Apache Sling Integration Tests .................... SKIPPED
[INFO] Apache Sling Launchpad Testing .................... SKIPPED
[INFO] Apache Sling (Builder) ............................ SKIPPED
[INFO] ------------------------------------------------------------------------
[INFO] BUILD FAILURE
[INFO] ------------------------------------------------------------------------
[INFO] Total time: 29:43.183s
[INFO] Finished at: Fri Apr 10 15:40:08 UTC 2015
[INFO] Final Memory: 170M/342M
[INFO] ------------------------------------------------------------------------
[JENKINS] Archiving disabled
[JENKINS] Archiving disabled
[JENKINS] Archiving disabled
[JENKINS] Archiving disabled
[JENKINS] Archiving disabled
[JENKINS] Archiving disabled
[JENKINS] Archiving disabled
[JENKINS] Archiving disabled
[JENKINS] Archiving disabled
[JENKINS] Archiving disabled
[JENKINS] Archiving disabled
[JENKINS] Archiving disabled
[JENKINS] Archiving disabled
[JENKINS] Archiving disabled
[JENKINS] Archiving disabled
[JENKINS] Archiving disabled
[JENKINS] Archiving disabled
[JENKINS] Archiving disabled
[JENKINS] Archiving disabled
[JENKINS] Archiving disabled
[JENKINS] Archiving disabled
[JENKINS] Archiving disabled
[JENKINS] Archiving disabled
[JENKINS] Archiving disabled
[JENKINS] Archiving disabled
[JENKINS] Archiving disabled
[JENKINS] Archiving disabled
[JENKINS] Archiving disabled
[JENKINS] Archiving disabled
[JENKINS] Archiving disabled
[JENKINS] Archiving disabled
[JENKINS] Archiving disabled
[JENKINS] Archiving disabled
[JENKINS] Archiving disabled
[JENKINS] Archiving disabled
[JENKINS] Archiving disabled
[JENKINS] Archiving disabled
[JENKINS] Archiving disabled
[JENKINS] Archiving disabled
[JENKINS] Archiving disabled
[JENKINS] Archiving disabled
[JENKINS] Archiving disabled
[JENKINS] Archiving disabled
[JENKINS] Archiving disabled
[JENKINS] Archiving disabled
[JENKINS] Archiving disabled
[JENKINS] Archiving disabled
[JENKINS] Archiving disabled
[JENKINS] Archiving disabled
[JENKINS] Archiving disabled
[JENKINS] Archiving disabled
[JENKINS] Archiving disabled
[JENKINS] Archiving disabled
[JENKINS] Archiving disabled
[JENKINS] Archiving disabled
[JENKINS] Archiving disabled
[JENKINS] Archiving disabled
[JENKINS] Archiving disabled
[JENKINS] Archiving disabled
[JENKINS] Archiving disabled
[JENKINS] Archiving disabled
[JENKINS] Archiving disabled
[JENKINS] Archiving disabled
[JENKINS] Archiving disabled
[JENKINS] Archiving disabled
[JENKINS] Archiving disabled
[JENKINS] Archiving disabled
[JENKINS] Archiving disabled
[JENKINS] Archiving disabled
[JENKINS] Archiving disabled
[JENKINS] Archiving disabled
[JENKINS] Archiving disabled
[JENKINS] Archiving disabled
[JENKINS] Archiving disabled
[JENKINS] Archiving disabled
[JENKINS] Archiving disabled
[JENKINS] Archiving disabled
[JENKINS] Archiving disabled
[JENKINS] Archiving disabled
[JENKINS] Archiving disabled
[JENKINS] Archiving disabled
[JENKINS] Archiving disabled
[JENKINS] Archiving disabled
[JENKINS] Archiving disabled
[JENKINS] Archiving disabled
[JENKINS] Archiving disabled
[JENKINS] Archiving disabled
[JENKINS] Archiving disabled
[JENKINS] Archiving disabled
[JENKINS] Archiving disabled
[JENKINS] Archiving disabled
[JENKINS] Archiving disabled
[JENKINS] Archiving disabled
[JENKINS] Archiving disabled
[JENKINS] Archiving disabled
[JENKINS] Archiving disabled
[JENKINS] Archiving disabled
[JENKINS] Archiving disabled
[JENKINS] Archiving disabled
[JENKINS] Archiving disabled
[JENKINS] Archiving disabled
[JENKINS] Archiving disabled
[JENKINS] Archiving disabled
[JENKINS] Archiving disabled
[JENKINS] Archiving disabled
[JENKINS] Archiving disabled
[JENKINS] Archiving disabled
[JENKINS] Archiving disabled
[JENKINS] Archiving disabled
[JENKINS] Archiving disabled
[JENKINS] Archiving disabled
[JENKINS] Archiving disabled
[JENKINS] Archiving disabled
[JENKINS] Archiving disabled
[JENKINS] Archiving disabled
[JENKINS] Archiving disabled
[JENKINS] Archiving disabled
[JENKINS] Archiving disabled
[JENKINS] Archiving disabled
[JENKINS] Archiving disabled
[JENKINS] Archiving disabled
[JENKINS] Archiving disabled
[JENKINS] Archiving disabled
[JENKINS] Archiving disabled
[JENKINS] Archiving disabled
[JENKINS] Archiving disabled
[JENKINS] Archiving disabled
[JENKINS] Archiving disabled
[JENKINS] Archiving disabled
[JENKINS] Archiving disabled
[JENKINS] Archiving disabled
[JENKINS] Archiving disabled
[JENKINS] Archiving disabled
Waiting for Jenkins to finish collecting data
[ERROR] Failed to execute goal org.apache.maven.plugins:maven-deploy-plugin:2.7:deploy (default-deploy) on project org.apache.sling.validation.reactor: Deployment failed: repository element was not specified in the POM inside distributionManagement element or in -DaltDeploymentRepository=id::layout::url parameter -> [Help 1]
[ERROR] 
[ERROR] To see the full stack trace of the errors, re-run Maven with the -e switch.
[ERROR] Re-run Maven using the -X switch to enable full debug logging.
[ERROR] 
[ERROR] For more information about the errors and possible solutions, please read the following articles:
[ERROR] [Help 1] http://cwiki.apache.org/confluence/display/MAVEN/MojoExecutionException
[ERROR] 
[ERROR] After correcting the problems, you can resume the build with the command
[ERROR]   mvn <goals> -rf :org.apache.sling.validation.reactor
channel stopped

Re: Build failed in Jenkins: sling-trunk-1.6 #3282

Posted by Carsten Ziegeler <cz...@apache.org>.
Am 10.04.15 um 18:03 schrieb Konrad Windszus:
> I find the reactor handy. I use it if I quickly want to check if validation is in a consistent state (i.e. by executing mvn package on the reactor). Is there anything which speaks against keeping the reactor for validation except consistency with other modules?
> Regards,

Actually I was confusing reactor and parent pom :) I guess it's fine to
have a more specific reactor pom, as long as now additional parent pom
is introduced, because that's were the pain starts.

Regards
Carsten
-- 
Carsten Ziegeler
Adobe Research Switzerland
cziegeler@apache.org

Re: Build failed in Jenkins: sling-trunk-1.6 #3282

Posted by Konrad Windszus <ko...@gmx.de>.
I find the reactor handy. I use it if I quickly want to check if validation is in a consistent state (i.e. by executing mvn package on the reactor). Is there anything which speaks against keeping the reactor for validation except consistency with other modules?
Regards,
Konrad
> Am 10.04.2015 um 17:20 schrieb Carsten Ziegeler <cz...@apache.org>:
> 
> Am 10.04.15 um 17:09 schrieb Robert Munteanu:
>> On Fri, Apr 10, 2015 at 6:04 PM, Apache Jenkins Server
>> <je...@builds.apache.org> wrote:
>>> 
>>> [ERROR] Failed to execute goal org.apache.maven.plugins:maven-deploy-plugin:2.7:deploy (default-deploy) on project org.apache.sling.validation.reactor: Deployment failed: repository element was not specified in the POM inside distributionManagement element or in -DaltDeploymentRepository=id::layout::url parameter -> [Help 1]
>> 
>> The validator reactor does not use the sling parent pom. Fixed in
>> https://svn.apache.org/r1672680
>> 
> I think we should remove the reactor pom and simply list the modules in
> the main reactor pom like we do everywhere else
> 
> Regards
> Carsten
> -- 
> Carsten Ziegeler
> Adobe Research Switzerland
> cziegeler@apache.org


Re: Build failed in Jenkins: sling-trunk-1.6 #3282

Posted by Carsten Ziegeler <cz...@apache.org>.
Am 10.04.15 um 17:09 schrieb Robert Munteanu:
> On Fri, Apr 10, 2015 at 6:04 PM, Apache Jenkins Server
> <je...@builds.apache.org> wrote:
>>
>> [ERROR] Failed to execute goal org.apache.maven.plugins:maven-deploy-plugin:2.7:deploy (default-deploy) on project org.apache.sling.validation.reactor: Deployment failed: repository element was not specified in the POM inside distributionManagement element or in -DaltDeploymentRepository=id::layout::url parameter -> [Help 1]
> 
> The validator reactor does not use the sling parent pom. Fixed in
> https://svn.apache.org/r1672680
> 
I think we should remove the reactor pom and simply list the modules in
the main reactor pom like we do everywhere else

Regards
Carsten
-- 
Carsten Ziegeler
Adobe Research Switzerland
cziegeler@apache.org

Re: Build failed in Jenkins: sling-trunk-1.6 #3282

Posted by Robert Munteanu <ro...@apache.org>.
On Apr 10, 2015 6:59 PM, "Konrad Windszus" <ko...@gmx.de> wrote:
>
> Hi Robert,
> thanks for fixing it. I am just wondering, why that didn't break the
contrib Jenkins job? Isn't a deployment also triggered for all SNAPSHOT
builds in contrib?

AFAIR only sling-trunk-1.6 deploys artifacts, as nothing uses snapshots
from contrib.

Robert

> Konrad
> > Am 10.04.2015 um 17:09 schrieb Robert Munteanu <ro...@apache.org>:
> >
> > On Fri, Apr 10, 2015 at 6:04 PM, Apache Jenkins Server
> > <je...@builds.apache.org> wrote:
> >>
> >> [ERROR] Failed to execute goal
org.apache.maven.plugins:maven-deploy-plugin:2.7:deploy (default-deploy) on
project org.apache.sling.validation.reactor: Deployment failed: repository
element was not specified in the POM inside distributionManagement element
or in -DaltDeploymentRepository=id::layout::url parameter -> [Help 1]
> >
> > The validator reactor does not use the sling parent pom. Fixed in
> > https://svn.apache.org/r1672680
> >
> > Robert
>

Re: Build failed in Jenkins: sling-trunk-1.6 #3282

Posted by Konrad Windszus <ko...@gmx.de>.
Hi Robert,
thanks for fixing it. I am just wondering, why that didn't break the contrib Jenkins job? Isn't a deployment also triggered for all SNAPSHOT builds in contrib?
Konrad
> Am 10.04.2015 um 17:09 schrieb Robert Munteanu <ro...@apache.org>:
> 
> On Fri, Apr 10, 2015 at 6:04 PM, Apache Jenkins Server
> <je...@builds.apache.org> wrote:
>> 
>> [ERROR] Failed to execute goal org.apache.maven.plugins:maven-deploy-plugin:2.7:deploy (default-deploy) on project org.apache.sling.validation.reactor: Deployment failed: repository element was not specified in the POM inside distributionManagement element or in -DaltDeploymentRepository=id::layout::url parameter -> [Help 1]
> 
> The validator reactor does not use the sling parent pom. Fixed in
> https://svn.apache.org/r1672680
> 
> Robert


Re: Build failed in Jenkins: sling-trunk-1.6 #3282

Posted by Robert Munteanu <ro...@apache.org>.
On Fri, Apr 10, 2015 at 6:04 PM, Apache Jenkins Server
<je...@builds.apache.org> wrote:
>
> [ERROR] Failed to execute goal org.apache.maven.plugins:maven-deploy-plugin:2.7:deploy (default-deploy) on project org.apache.sling.validation.reactor: Deployment failed: repository element was not specified in the POM inside distributionManagement element or in -DaltDeploymentRepository=id::layout::url parameter -> [Help 1]

The validator reactor does not use the sling parent pom. Fixed in
https://svn.apache.org/r1672680

Robert

Build failed in Jenkins: sling-trunk-1.6 #3282

Posted by Apache Jenkins Server <je...@builds.apache.org>.
See <https://builds.apache.org/job/sling-trunk-1.6/3282/changes>

Changes:

[cziegeler] SLING-4602 : Migrate launchpad/testing-war to provisioning model

[cziegeler] SLING-4602 : Migrate launchpad/testing-war to provisioning model

[cziegeler] Add missing projects

[kwin] SLING-4606 fix SCM infos, reference launchpad in released version 7, build validation with the default reactor

[cziegeler] Check main artifact and attached artifacts for artifacts from the same build

[kwin] SLING 4606 move validation from contrib to /

[kwin] SLING-4606 remove Sling validation as contrib module

------------------------------------------
[...truncated 53925 lines...]
[INFO] Apache Sling Repository API Bundle ................ SUCCESS [2.879s]
[INFO] Apache Sling Testing JCR Mock ..................... SUCCESS [4.415s]
[INFO] Apache Sling JCR Base Bundle ...................... SUCCESS [4.898s]
[INFO] Apache Sling JCR ClassLoader ...................... SUCCESS [3.614s]
[INFO] Apache Sling Initial Content Loader ............... SUCCESS [4.731s]
[INFO] Apache Sling Jackrabbit Embedded Repository ....... SUCCESS [16.205s]
[INFO] Apache Sling Jackrabbit UserManager Support ....... SUCCESS [4.275s]
[INFO] Apache Sling Jackrabbit JSR-283 Access Control Manager Support  SUCCESS [3.608s]
[INFO] Apache Sling Wrapper Bundle for the JCR API ....... SUCCESS [3.014s]
[INFO] Apache Sling JCR Resource Resolver ................ SUCCESS [37.316s]
[INFO] Apache Sling Testing Sling Mock Jackrabbit-based Resource Resolver  SUCCESS [17.342s]
[INFO] Apache Sling Versioning Integration Tests ......... SUCCESS [10.292s]
[INFO] Apache Sling JCR Repository Registration .......... SUCCESS [5.584s]
[INFO] Apache Sling Simple WebDAV Access to repositories . SUCCESS [4.295s]
[INFO] Apache Sling DavEx Access to repositories ......... SUCCESS [15.661s]
[INFO] Apache Sling JCR WebConsole Bundle ................ SUCCESS [3.104s]
[INFO] Apache Sling Oak Repository Server ................ SUCCESS [4.089s]
[INFO] Apache Sling SlingRepository Integration Tests .... SUCCESS [51.100s]
[INFO] Apache Sling Servlet Resolver ..................... SUCCESS [6.432s]
[INFO] Apache Sling Default GET Servlets ................. SUCCESS [4.939s]
[INFO] Apache Sling Default POST Servlets ................ SUCCESS [9.628s]
[INFO] Apache Sling Compat Servlets ...................... SUCCESS [3.481s]
[INFO] Apache Sling Scripting Implementation API ......... SUCCESS [8.772s]
[INFO] Apache Sling Scripting Core implementation ........ SUCCESS [13.606s]
[INFO] Apache Sling Scripting JavaScript Support ......... SUCCESS [11.093s]
[INFO] Apache Sling Scripting JSP Support ................ SUCCESS [9.706s]
[INFO] Apache Sling JSP Tag Library ...................... SUCCESS [6.884s]
[INFO] Apache Sling JSP Standard Tag Library ............. SUCCESS [5.306s]
[INFO] Apache Sling Adapter Manager Implementation ....... SUCCESS [6.067s]
[INFO] Apache Sling Bundle Resource Provider ............. SUCCESS [5.251s]
[INFO] Apache Sling Distributed Event Admin .............. SUCCESS [10.481s]
[INFO] Apache Sling Discovery API ........................ SUCCESS [4.517s]
[INFO] Apache Sling Resource-Based Discovery Service ..... SUCCESS [4:43.109s]
[INFO] Apache Sling Discovery Support Bundle ............. SUCCESS [7.113s]
[INFO] Apache Sling Discovery Standalone Implementation .. SUCCESS [4.213s]
[INFO] Apache Sling Event Support ........................ SUCCESS [11:31.891s]
[INFO] Apache Sling Feature Flags ........................ SUCCESS [5.926s]
[INFO] Apache Sling Filesystem Resource Provider ......... SUCCESS [4.250s]
[INFO] Apache Sling javax.activation bundle .............. SUCCESS [6.874s]
[INFO] Apache Sling Service User Mapper .................. SUCCESS [8.395s]
[INFO] Apache Sling Settings ............................. SUCCESS [5.629s]
[INFO] Apache Sling Web Console Branding ................. SUCCESS [8.035s]
[INFO] Apache Sling Web Console Security Provider ........ SUCCESS [5.578s]
[INFO] Apache Sling Explorer ............................. SUCCESS [6.941s]
[INFO] Apache Sling Health Check Core .................... SUCCESS [9.042s]
[INFO] Apache Sling Health Check Annotations ............. SUCCESS [4.243s]
[INFO] Apache Sling Health Check Samples ................. SUCCESS [7.486s]
[INFO] Apache Sling Health Check Support Components ...... SUCCESS [5.328s]
[INFO] Apache Sling Health Check Webconsole Plugin ....... SUCCESS [5.474s]
[INFO] Apache Sling Health Check JUnit Bridge ............ SUCCESS [10.391s]
[INFO] Apache Sling Health Check Integration Tests ....... SUCCESS [28.326s]
[INFO] Apache Sling Health Check Reactor POM ............. SUCCESS [2.561s]
[INFO] Apache Sling Resource Access Security ............. SUCCESS [5.427s]
[INFO] Apache Sling Resource Access Security Integration Tests  SUCCESS [24.112s]
[INFO] Apache Sling Validation Framework API ............. SUCCESS [7.037s]
[INFO] Apache Sling Validation Framework Core Implementation  SUCCESS [14.876s]
[INFO] Apache Sling Validation Framework Testing Services  SUCCESS [4.715s]
[INFO] Apache Sling Validation Framework Integration Tests  SUCCESS [23.728s]
[INFO] Apache Sling Validation Framework Examples ........ SUCCESS [4.049s]
[INFO] Apache Sling Validation Framework Builder ......... FAILURE [0.153s]
[INFO] Apache Sling Models API ........................... SKIPPED
[INFO] Apache Sling Models Implementation ................ SKIPPED
[INFO] Apache Sling Test Tools ........................... SKIPPED
[INFO] Apache Sling Models Integration Tests ............. SKIPPED
[INFO] Apache Sling JUnit Core ........................... SKIPPED
[INFO] Apache Sling JUnit Scriptable Tests Provider ...... SKIPPED
[INFO] Apache Sling JUnit Health Checks .................. SKIPPED
[INFO] Apache Sling JUnit Remote Tests Runners ........... SKIPPED
[INFO] Apache Sling JUnit Performance .................... SKIPPED
[INFO] Apache Sling Testing Resource Resolver Mock ....... SKIPPED
[INFO] Apache Sling Testing OSGi Mock .................... SKIPPED
[INFO] Apache Sling Testing Sling Mock ................... SKIPPED
[INFO] Apache Sling Pax Exam Utilities ................... SKIPPED
[INFO] Apache Sling Sample Server-Side Tests ............. SKIPPED
[INFO] Apache Sling Failing Server-Side Tests ............ SKIPPED
[INFO] Apache Sling Launchpad Base ....................... SKIPPED
[INFO] Apache Sling Launchpad Application Builder ........ SKIPPED
[INFO] Apache Sling Sample Integration Tests ............. SKIPPED
[INFO] Apache Sling Testing Modules Reactor .............. SKIPPED
[INFO] Apache Sling Installer ............................ SKIPPED
[INFO] Apache Sling Installer WebConsole Plugin .......... SKIPPED
[INFO] Apache Sling File Installer ....................... SKIPPED
[INFO] Apache Sling JCR Installer ........................ SKIPPED
[INFO] Apache Sling Installer Configuration Admin Support  SKIPPED
[INFO] Apache Sling Deployment Package Installer ......... SKIPPED
[INFO] Apache Sling Subsystems Installer ................. SKIPPED
[INFO] Apache Sling Installer Integration Tests .......... SKIPPED
[INFO] Apache Sling Launchpad API ........................ SKIPPED
[INFO] Apache Sling Launchpad Installer .................. SKIPPED
[INFO] Apache Sling Launchpad Content .................... SKIPPED
[INFO] Apache Sling Launchpad Testing Services ........... SKIPPED
[INFO] Apache Sling Launchpad Testing Services WAR ....... SKIPPED
[INFO] Apache Sling Launchpad Testing Fragment Bundle .... SKIPPED
[INFO] Apache Sling Launchpad Test Bundles ............... SKIPPED
[INFO] Apache Sling Integration Tests .................... SKIPPED
[INFO] Apache Sling Launchpad Testing .................... SKIPPED
[INFO] Apache Sling (Builder) ............................ SKIPPED
[INFO] ------------------------------------------------------------------------
[INFO] BUILD FAILURE
[INFO] ------------------------------------------------------------------------
[INFO] Total time: 30:34.953s
[INFO] Finished at: Fri Apr 10 15:03:28 UTC 2015
[INFO] Final Memory: 169M/314M
[INFO] ------------------------------------------------------------------------
[JENKINS] Archiving disabled
[JENKINS] Archiving disabled
[JENKINS] Archiving disabled
[JENKINS] Archiving disabled
[JENKINS] Archiving disabled
[JENKINS] Archiving disabled
[JENKINS] Archiving disabled
[JENKINS] Archiving disabled
[JENKINS] Archiving disabled
[JENKINS] Archiving disabled
[JENKINS] Archiving disabled
[JENKINS] Archiving disabled
[JENKINS] Archiving disabled
[JENKINS] Archiving disabled
[JENKINS] Archiving disabled
[JENKINS] Archiving disabled
[JENKINS] Archiving disabled
[JENKINS] Archiving disabled
[JENKINS] Archiving disabled
[JENKINS] Archiving disabled
[JENKINS] Archiving disabled
[JENKINS] Archiving disabled
[JENKINS] Archiving disabled
[JENKINS] Archiving disabled
[JENKINS] Archiving disabled
[JENKINS] Archiving disabled
[JENKINS] Archiving disabled
[JENKINS] Archiving disabled
[JENKINS] Archiving disabled
[JENKINS] Archiving disabled
[JENKINS] Archiving disabled
[JENKINS] Archiving disabled
[JENKINS] Archiving disabled
[JENKINS] Archiving disabled
[JENKINS] Archiving disabled
[JENKINS] Archiving disabled
[JENKINS] Archiving disabled
[JENKINS] Archiving disabled
[JENKINS] Archiving disabled
[JENKINS] Archiving disabled
[JENKINS] Archiving disabled
[JENKINS] Archiving disabled
[JENKINS] Archiving disabled
[JENKINS] Archiving disabled
[JENKINS] Archiving disabled
[JENKINS] Archiving disabled
[JENKINS] Archiving disabled
[JENKINS] Archiving disabled
[JENKINS] Archiving disabled
[JENKINS] Archiving disabled
[JENKINS] Archiving disabled
[JENKINS] Archiving disabled
[JENKINS] Archiving disabled
[JENKINS] Archiving disabled
[JENKINS] Archiving disabled
[JENKINS] Archiving disabled
[JENKINS] Archiving disabled
[JENKINS] Archiving disabled
[JENKINS] Archiving disabled
[JENKINS] Archiving disabled
[JENKINS] Archiving disabled
[JENKINS] Archiving disabled
[JENKINS] Archiving disabled
[JENKINS] Archiving disabled
[JENKINS] Archiving disabled
[JENKINS] Archiving disabled
[JENKINS] Archiving disabled
[JENKINS] Archiving disabled
[JENKINS] Archiving disabled
[JENKINS] Archiving disabled
[JENKINS] Archiving disabled
[JENKINS] Archiving disabled
[JENKINS] Archiving disabled
[JENKINS] Archiving disabled
[JENKINS] Archiving disabled
[JENKINS] Archiving disabled
[JENKINS] Archiving disabled
[JENKINS] Archiving disabled
[JENKINS] Archiving disabled
[JENKINS] Archiving disabled
[JENKINS] Archiving disabled
[JENKINS] Archiving disabled
[JENKINS] Archiving disabled
[JENKINS] Archiving disabled
[JENKINS] Archiving disabled
[JENKINS] Archiving disabled
[JENKINS] Archiving disabled
[JENKINS] Archiving disabled
[JENKINS] Archiving disabled
[JENKINS] Archiving disabled
[JENKINS] Archiving disabled
[JENKINS] Archiving disabled
[JENKINS] Archiving disabled
[JENKINS] Archiving disabled
[JENKINS] Archiving disabled
[JENKINS] Archiving disabled
[JENKINS] Archiving disabled
[JENKINS] Archiving disabled
[JENKINS] Archiving disabled
[JENKINS] Archiving disabled
[JENKINS] Archiving disabled
[JENKINS] Archiving disabled
[JENKINS] Archiving disabled
[JENKINS] Archiving disabled
[JENKINS] Archiving disabled
[JENKINS] Archiving disabled
[JENKINS] Archiving disabled
[JENKINS] Archiving disabled
[JENKINS] Archiving disabled
[JENKINS] Archiving disabled
[JENKINS] Archiving disabled
[JENKINS] Archiving disabled
[JENKINS] Archiving disabled
[JENKINS] Archiving disabled
[JENKINS] Archiving disabled
[JENKINS] Archiving disabled
[JENKINS] Archiving disabled
[JENKINS] Archiving disabled
[JENKINS] Archiving disabled
[JENKINS] Archiving disabled
[JENKINS] Archiving disabled
[JENKINS] Archiving disabled
[JENKINS] Archiving disabled
[JENKINS] Archiving disabled
[JENKINS] Archiving disabled
[JENKINS] Archiving disabled
[JENKINS] Archiving disabled
[JENKINS] Archiving disabled
[JENKINS] Archiving disabled
[JENKINS] Archiving disabled
[JENKINS] Archiving disabled
[JENKINS] Archiving disabled
[JENKINS] Archiving disabled
Waiting for Jenkins to finish collecting data
[ERROR] Failed to execute goal org.apache.maven.plugins:maven-deploy-plugin:2.7:deploy (default-deploy) on project org.apache.sling.validation.reactor: Deployment failed: repository element was not specified in the POM inside distributionManagement element or in -DaltDeploymentRepository=id::layout::url parameter -> [Help 1]
[ERROR] 
[ERROR] To see the full stack trace of the errors, re-run Maven with the -e switch.
[ERROR] Re-run Maven using the -X switch to enable full debug logging.
[ERROR] 
[ERROR] For more information about the errors and possible solutions, please read the following articles:
[ERROR] [Help 1] http://cwiki.apache.org/confluence/display/MAVEN/MojoExecutionException
[ERROR] 
[ERROR] After correcting the problems, you can resume the build with the command
[ERROR]   mvn <goals> -rf :org.apache.sling.validation.reactor
channel stopped

Build failed in Jenkins: sling-trunk-1.6 #3281

Posted by Apache Jenkins Server <je...@builds.apache.org>.
See <https://builds.apache.org/job/sling-trunk-1.6/3281/changes>

Changes:

[cziegeler] Correct snapshot dependency to resourceresolver

[cziegeler] Get dependent projects from build if build in the same build

[cziegeler] Correct snapshot versions for ras tests

[cziegeler] Correct health check dependencies

[cziegeler] Correct type of model artifact

------------------------------------------
[...truncated 63939 lines...]
[INFO] Apache Sling JSON Library ......................... SUCCESS [5.987s]
[INFO] Apache Sling SLF4J Implementation (Logback) ....... SUCCESS [29.949s]
[INFO] Apache Sling OSGi LogService Implementation ....... SUCCESS [3.605s]
[INFO] Apache Sling MIME type mapping support ............ SUCCESS [6.782s]
[INFO] Apache Sling Commons OSGi support ................. SUCCESS [4.489s]
[INFO] Apache Sling Scheduler Support .................... SUCCESS [3.711s]
[INFO] Apache Sling Testing Utilities .................... SUCCESS [14.262s]
[INFO] Apache Sling Thread Dumper ........................ SUCCESS [3.132s]
[INFO] Apache Sling Thread Support ....................... SUCCESS [4.767s]
[INFO] Apache Sling Authentication Service ............... SUCCESS [4.810s]
[INFO] Apache Sling Form Based Authentication Handler .... SUCCESS [7.757s]
[INFO] Apache Sling Engine Implementation ................ SUCCESS [16.158s]
[INFO] Apache Sling Repository API Bundle ................ SUCCESS [2.704s]
[INFO] Apache Sling Testing JCR Mock ..................... SUCCESS [4.648s]
[INFO] Apache Sling JCR Base Bundle ...................... SUCCESS [4.362s]
[INFO] Apache Sling JCR ClassLoader ...................... SUCCESS [3.920s]
[INFO] Apache Sling Initial Content Loader ............... SUCCESS [6.249s]
[INFO] Apache Sling Jackrabbit Embedded Repository ....... SUCCESS [18.315s]
[INFO] Apache Sling Jackrabbit UserManager Support ....... SUCCESS [3.543s]
[INFO] Apache Sling Jackrabbit JSR-283 Access Control Manager Support  SUCCESS [3.080s]
[INFO] Apache Sling Wrapper Bundle for the JCR API ....... SUCCESS [2.957s]
[INFO] Apache Sling JCR Resource Resolver ................ SUCCESS [46.275s]
[INFO] Apache Sling Testing Sling Mock Jackrabbit-based Resource Resolver  SUCCESS [17.683s]
[INFO] Apache Sling Versioning Integration Tests ......... SUCCESS [17.401s]
[INFO] Apache Sling JCR Repository Registration .......... SUCCESS [5.529s]
[INFO] Apache Sling Simple WebDAV Access to repositories . SUCCESS [4.629s]
[INFO] Apache Sling DavEx Access to repositories ......... SUCCESS [5.488s]
[INFO] Apache Sling JCR WebConsole Bundle ................ SUCCESS [4.597s]
[INFO] Apache Sling Oak Repository Server ................ SUCCESS [7.593s]
[INFO] Apache Sling SlingRepository Integration Tests .... SUCCESS [56.093s]
[INFO] Apache Sling Servlet Resolver ..................... SUCCESS [5.009s]
[INFO] Apache Sling Default GET Servlets ................. SUCCESS [4.929s]
[INFO] Apache Sling Default POST Servlets ................ SUCCESS [5.503s]
[INFO] Apache Sling Compat Servlets ...................... SUCCESS [3.607s]
[INFO] Apache Sling Scripting Implementation API ......... SUCCESS [3.446s]
[INFO] Apache Sling Scripting Core implementation ........ SUCCESS [18.343s]
[INFO] Apache Sling Scripting JavaScript Support ......... SUCCESS [15.700s]
[INFO] Apache Sling Scripting JSP Support ................ SUCCESS [7.974s]
[INFO] Apache Sling JSP Tag Library ...................... SUCCESS [7.547s]
[INFO] Apache Sling JSP Standard Tag Library ............. SUCCESS [3.032s]
[INFO] Apache Sling Adapter Manager Implementation ....... SUCCESS [5.006s]
[INFO] Apache Sling Bundle Resource Provider ............. SUCCESS [3.231s]
[INFO] Apache Sling Distributed Event Admin .............. SUCCESS [6.175s]
[INFO] Apache Sling Discovery API ........................ SUCCESS [2.727s]
[INFO] Apache Sling Resource-Based Discovery Service ..... SUCCESS [5:09.046s]
[INFO] Apache Sling Discovery Support Bundle ............. SUCCESS [2.888s]
[INFO] Apache Sling Discovery Standalone Implementation .. SUCCESS [3.307s]
[INFO] Apache Sling Event Support ........................ SUCCESS [12:29.361s]
[INFO] Apache Sling Feature Flags ........................ SUCCESS [3.239s]
[INFO] Apache Sling Filesystem Resource Provider ......... SUCCESS [3.479s]
[INFO] Apache Sling javax.activation bundle .............. SUCCESS [3.072s]
[INFO] Apache Sling Service User Mapper .................. SUCCESS [3.747s]
[INFO] Apache Sling Settings ............................. SUCCESS [3.908s]
[INFO] Apache Sling Web Console Branding ................. SUCCESS [2.999s]
[INFO] Apache Sling Web Console Security Provider ........ SUCCESS [2.904s]
[INFO] Apache Sling Explorer ............................. SUCCESS [2.906s]
[INFO] Apache Sling Health Check Core .................... SUCCESS [7.565s]
[INFO] Apache Sling Health Check Annotations ............. SUCCESS [2.717s]
[INFO] Apache Sling Health Check Samples ................. SUCCESS [3.936s]
[INFO] Apache Sling Health Check Support Components ...... SUCCESS [3.754s]
[INFO] Apache Sling Health Check Webconsole Plugin ....... SUCCESS [3.587s]
[INFO] Apache Sling Health Check JUnit Bridge ............ SUCCESS [4.423s]
[INFO] Apache Sling Health Check Integration Tests ....... SUCCESS [30.324s]
[INFO] Apache Sling Health Check Reactor POM ............. SUCCESS [3.992s]
[INFO] Apache Sling Resource Access Security ............. SUCCESS [3.548s]
[INFO] Apache Sling Resource Access Security Integration Tests  SUCCESS [29.641s]
[INFO] Apache Sling Models API ........................... SUCCESS [3.600s]
[INFO] Apache Sling Models Implementation ................ SUCCESS [6.933s]
[INFO] Apache Sling Test Tools ........................... SUCCESS [4.580s]
[INFO] Apache Sling Models Integration Tests ............. SUCCESS [33.874s]
[INFO] Apache Sling JUnit Core ........................... SUCCESS [4.153s]
[INFO] Apache Sling JUnit Scriptable Tests Provider ...... SUCCESS [3.539s]
[INFO] Apache Sling JUnit Health Checks .................. SUCCESS [4.306s]
[INFO] Apache Sling JUnit Remote Tests Runners ........... SUCCESS [3.478s]
[INFO] Apache Sling JUnit Performance .................... SUCCESS [3.632s]
[INFO] Apache Sling Testing Resource Resolver Mock ....... SUCCESS [3.230s]
[INFO] Apache Sling Testing OSGi Mock .................... SUCCESS [4.893s]
[INFO] Apache Sling Testing Sling Mock ................... SUCCESS [8.669s]
[INFO] Apache Sling Pax Exam Utilities ................... SUCCESS [29.736s]
[INFO] Apache Sling Sample Server-Side Tests ............. SUCCESS [2.966s]
[INFO] Apache Sling Failing Server-Side Tests ............ SUCCESS [3.173s]
[INFO] Apache Sling Launchpad Base ....................... SUCCESS [16.999s]
[INFO] Apache Sling Launchpad Application Builder ........ SUCCESS [49.385s]
[INFO] Apache Sling Sample Integration Tests ............. SUCCESS [1:05.375s]
[INFO] Apache Sling Testing Modules Reactor .............. SUCCESS [1.823s]
[INFO] Apache Sling Installer ............................ SUCCESS [4.548s]
[INFO] Apache Sling Installer WebConsole Plugin .......... SUCCESS [3.007s]
[INFO] Apache Sling File Installer ....................... SUCCESS [3.328s]
[INFO] Apache Sling JCR Installer ........................ SUCCESS [1:58.888s]
[INFO] Apache Sling Installer Configuration Admin Support  SUCCESS [3.297s]
[INFO] Apache Sling Deployment Package Installer ......... SUCCESS [2.815s]
[INFO] Apache Sling Subsystems Installer ................. SUCCESS [3.088s]
[INFO] Apache Sling Installer Integration Tests .......... SUCCESS [47.687s]
[INFO] Apache Sling Launchpad API ........................ SUCCESS [2.684s]
[INFO] Apache Sling Launchpad Installer .................. SUCCESS [10.676s]
[INFO] Apache Sling Launchpad Content .................... SUCCESS [3.076s]
[INFO] Apache Sling Launchpad Testing Services ........... SUCCESS [6.678s]
[INFO] Apache Sling Launchpad Testing Services WAR ....... SUCCESS [6.104s]
[INFO] Apache Sling Launchpad Testing Fragment Bundle .... SUCCESS [4.746s]
[INFO] Apache Sling Launchpad Test Bundles ............... SUCCESS [4.083s]
[INFO] Apache Sling Integration Tests .................... SUCCESS [7.098s]
[INFO] Apache Sling Launchpad Testing .................... FAILURE [1.005s]
[INFO] Apache Sling (Builder) ............................ SKIPPED
[INFO] ------------------------------------------------------------------------
[INFO] BUILD FAILURE
[INFO] ------------------------------------------------------------------------
[INFO] Total time: 38:18.448s
[INFO] Finished at: Fri Apr 10 12:42:29 UTC 2015
[INFO] Final Memory: 169M/365M
[INFO] ------------------------------------------------------------------------
[JENKINS] Archiving disabled
[JENKINS] Archiving disabled
[JENKINS] Archiving disabled
[JENKINS] Archiving disabled
[JENKINS] Archiving disabled
[JENKINS] Archiving disabled
[JENKINS] Archiving disabled
[JENKINS] Archiving disabled
[JENKINS] Archiving disabled
[JENKINS] Archiving disabled
[JENKINS] Archiving disabled
[JENKINS] Archiving disabled
[JENKINS] Archiving disabled
[JENKINS] Archiving disabled
[JENKINS] Archiving disabled
[JENKINS] Archiving disabled
[JENKINS] Archiving disabled
[JENKINS] Archiving disabled
[JENKINS] Archiving disabled
[JENKINS] Archiving disabled
[JENKINS] Archiving disabled
[JENKINS] Archiving disabled
[JENKINS] Archiving disabled
[JENKINS] Archiving disabled
[JENKINS] Archiving disabled
[JENKINS] Archiving disabled
[JENKINS] Archiving disabled
[JENKINS] Archiving disabled
[JENKINS] Archiving disabled
[JENKINS] Archiving disabled
[JENKINS] Archiving disabled
[JENKINS] Archiving disabled
[JENKINS] Archiving disabled
[JENKINS] Archiving disabled
[JENKINS] Archiving disabled
[JENKINS] Archiving disabled
[JENKINS] Archiving disabled
[JENKINS] Archiving disabled
[JENKINS] Archiving disabled
[JENKINS] Archiving disabled
[JENKINS] Archiving disabled
[JENKINS] Archiving disabled
[JENKINS] Archiving disabled
[JENKINS] Archiving disabled
[JENKINS] Archiving disabled
[JENKINS] Archiving disabled
[JENKINS] Archiving disabled
[JENKINS] Archiving disabled
[JENKINS] Archiving disabled
[JENKINS] Archiving disabled
[JENKINS] Archiving disabled
[JENKINS] Archiving disabled
[JENKINS] Archiving disabled
[JENKINS] Archiving disabled
[JENKINS] Archiving disabled
[JENKINS] Archiving disabled
[JENKINS] Archiving disabled
[JENKINS] Archiving disabled
[JENKINS] Archiving disabled
[JENKINS] Archiving disabled
[JENKINS] Archiving disabled
[JENKINS] Archiving disabled
[JENKINS] Archiving disabled
[JENKINS] Archiving disabled
[JENKINS] Archiving disabled
[JENKINS] Archiving disabled
[JENKINS] Archiving disabled
[JENKINS] Archiving disabled
[JENKINS] Archiving disabled
[JENKINS] Archiving disabled
[JENKINS] Archiving disabled
[JENKINS] Archiving disabled
[JENKINS] Archiving disabled
[JENKINS] Archiving disabled
[JENKINS] Archiving disabled
[JENKINS] Archiving disabled
[JENKINS] Archiving disabled
[JENKINS] Archiving disabled
[JENKINS] Archiving disabled
[JENKINS] Archiving disabled
[JENKINS] Archiving disabled
[JENKINS] Archiving disabled
[JENKINS] Archiving disabled
[JENKINS] Archiving disabled
[JENKINS] Archiving disabled
[JENKINS] Archiving disabled
[JENKINS] Archiving disabled
[JENKINS] Archiving disabled
[JENKINS] Archiving disabled
[JENKINS] Archiving disabled
[JENKINS] Archiving disabled
[JENKINS] Archiving disabled
[JENKINS] Archiving disabled
[JENKINS] Archiving disabled
[JENKINS] Archiving disabled
[JENKINS] Archiving disabled
[JENKINS] Archiving disabled
[JENKINS] Archiving disabled
[JENKINS] Archiving disabled
[JENKINS] Archiving disabled
[JENKINS] Archiving disabled
[JENKINS] Archiving disabled
[JENKINS] Archiving disabled
[JENKINS] Archiving disabled
[JENKINS] Archiving disabled
[JENKINS] Archiving disabled
[JENKINS] Archiving disabled
[JENKINS] Archiving disabled
[JENKINS] Archiving disabled
[JENKINS] Archiving disabled
[JENKINS] Archiving disabled
[JENKINS] Archiving disabled
[JENKINS] Archiving disabled
[JENKINS] Archiving disabled
[JENKINS] Archiving disabled
[JENKINS] Archiving disabled
[JENKINS] Archiving disabled
[JENKINS] Archiving disabled
[JENKINS] Archiving disabled
[JENKINS] Archiving disabled
[JENKINS] Archiving disabled
[JENKINS] Archiving disabled
[JENKINS] Archiving disabled
[JENKINS] Archiving disabled
[JENKINS] Archiving disabled
[JENKINS] Archiving disabled
[JENKINS] Archiving disabled
Waiting for Jenkins to finish collecting data
[ERROR] Failed to execute goal org.apache.sling:slingstart-maven-plugin:1.0.5-SNAPSHOT:prepare (default-prepare) on project org.apache.sling.launchpad.testing: Unable to find dependency build artifact Dependency {groupId=org.apache.sling, artifactId=org.apache.sling.launchpad.test-bundles, version=0.0.1-SNAPSHOT, type=slingfeature} -> [Help 1]
[ERROR] 
[ERROR] To see the full stack trace of the errors, re-run Maven with the -e switch.
[ERROR] Re-run Maven using the -X switch to enable full debug logging.
[ERROR] 
[ERROR] For more information about the errors and possible solutions, please read the following articles:
[ERROR] [Help 1] http://cwiki.apache.org/confluence/display/MAVEN/MojoExecutionException
[ERROR] 
[ERROR] After correcting the problems, you can resume the build with the command
[ERROR]   mvn <goals> -rf :org.apache.sling.launchpad.testing
channel stopped

Build failed in Jenkins: sling-trunk-1.6 #3280

Posted by Apache Jenkins Server <je...@builds.apache.org>.
See <https://builds.apache.org/job/sling-trunk-1.6/3280/changes>

Changes:

[cziegeler] Use released versions

[cziegeler] Correct dependency to launchpad project

[cziegeler] Correct type/language of slingstart packaging

------------------------------------------
[...truncated 60267 lines...]
[INFO] Apache Sling JSON Library ......................... SUCCESS [5.460s]
[INFO] Apache Sling SLF4J Implementation (Logback) ....... SUCCESS [31.117s]
[INFO] Apache Sling OSGi LogService Implementation ....... SUCCESS [4.074s]
[INFO] Apache Sling MIME type mapping support ............ SUCCESS [4.875s]
[INFO] Apache Sling Commons OSGi support ................. SUCCESS [4.512s]
[INFO] Apache Sling Scheduler Support .................... SUCCESS [3.910s]
[INFO] Apache Sling Testing Utilities .................... SUCCESS [13.768s]
[INFO] Apache Sling Thread Dumper ........................ SUCCESS [3.251s]
[INFO] Apache Sling Thread Support ....................... SUCCESS [4.442s]
[INFO] Apache Sling Authentication Service ............... SUCCESS [4.848s]
[INFO] Apache Sling Form Based Authentication Handler .... SUCCESS [8.445s]
[INFO] Apache Sling Engine Implementation ................ SUCCESS [15.506s]
[INFO] Apache Sling Repository API Bundle ................ SUCCESS [4.629s]
[INFO] Apache Sling Testing JCR Mock ..................... SUCCESS [4.596s]
[INFO] Apache Sling JCR Base Bundle ...................... SUCCESS [4.571s]
[INFO] Apache Sling JCR ClassLoader ...................... SUCCESS [3.174s]
[INFO] Apache Sling Initial Content Loader ............... SUCCESS [4.921s]
[INFO] Apache Sling Jackrabbit Embedded Repository ....... SUCCESS [16.480s]
[INFO] Apache Sling Jackrabbit UserManager Support ....... SUCCESS [4.690s]
[INFO] Apache Sling Jackrabbit JSR-283 Access Control Manager Support  SUCCESS [4.091s]
[INFO] Apache Sling Wrapper Bundle for the JCR API ....... SUCCESS [2.724s]
[INFO] Apache Sling JCR Resource Resolver ................ SUCCESS [36.489s]
[INFO] Apache Sling Testing Sling Mock Jackrabbit-based Resource Resolver  SUCCESS [19.453s]
[INFO] Apache Sling Versioning Integration Tests ......... SUCCESS [10.091s]
[INFO] Apache Sling JCR Repository Registration .......... SUCCESS [6.627s]
[INFO] Apache Sling Simple WebDAV Access to repositories . SUCCESS [4.444s]
[INFO] Apache Sling DavEx Access to repositories ......... SUCCESS [11.368s]
[INFO] Apache Sling JCR WebConsole Bundle ................ SUCCESS [4.875s]
[INFO] Apache Sling Oak Repository Server ................ SUCCESS [5.607s]
[INFO] Apache Sling SlingRepository Integration Tests .... SUCCESS [53.839s]
[INFO] Apache Sling Servlet Resolver ..................... SUCCESS [5.011s]
[INFO] Apache Sling Default GET Servlets ................. SUCCESS [4.670s]
[INFO] Apache Sling Default POST Servlets ................ SUCCESS [5.199s]
[INFO] Apache Sling Compat Servlets ...................... SUCCESS [4.032s]
[INFO] Apache Sling Scripting Implementation API ......... SUCCESS [2.990s]
[INFO] Apache Sling Scripting Core implementation ........ SUCCESS [12.565s]
[INFO] Apache Sling Scripting JavaScript Support ......... SUCCESS [11.466s]
[INFO] Apache Sling Scripting JSP Support ................ SUCCESS [7.310s]
[INFO] Apache Sling JSP Tag Library ...................... SUCCESS [6.175s]
[INFO] Apache Sling JSP Standard Tag Library ............. SUCCESS [3.701s]
[INFO] Apache Sling Adapter Manager Implementation ....... SUCCESS [4.100s]
[INFO] Apache Sling Bundle Resource Provider ............. SUCCESS [3.105s]
[INFO] Apache Sling Distributed Event Admin .............. SUCCESS [5.557s]
[INFO] Apache Sling Discovery API ........................ SUCCESS [3.453s]
[INFO] Apache Sling Resource-Based Discovery Service ..... SUCCESS [4:23.092s]
[INFO] Apache Sling Discovery Support Bundle ............. SUCCESS [4.696s]
[INFO] Apache Sling Discovery Standalone Implementation .. SUCCESS [5.782s]
[INFO] Apache Sling Event Support ........................ SUCCESS [11:38.382s]
[INFO] Apache Sling Feature Flags ........................ SUCCESS [5.726s]
[INFO] Apache Sling Filesystem Resource Provider ......... SUCCESS [4.702s]
[INFO] Apache Sling javax.activation bundle .............. SUCCESS [8.941s]
[INFO] Apache Sling Service User Mapper .................. SUCCESS [5.243s]
[INFO] Apache Sling Settings ............................. SUCCESS [7.117s]
[INFO] Apache Sling Web Console Branding ................. SUCCESS [5.709s]
[INFO] Apache Sling Web Console Security Provider ........ SUCCESS [10.863s]
[INFO] Apache Sling Explorer ............................. SUCCESS [6.808s]
[INFO] Apache Sling Health Check Core .................... SUCCESS [8.055s]
[INFO] Apache Sling Health Check Annotations ............. SUCCESS [6.962s]
[INFO] Apache Sling Health Check Samples ................. SUCCESS [4.815s]
[INFO] Apache Sling Health Check Support Components ...... SUCCESS [8.721s]
[INFO] Apache Sling Health Check Webconsole Plugin ....... SUCCESS [4.692s]
[INFO] Apache Sling Health Check JUnit Bridge ............ SUCCESS [7.646s]
[INFO] Apache Sling Health Check Integration Tests ....... SUCCESS [31.696s]
[INFO] Apache Sling Health Check Reactor POM ............. SUCCESS [2.751s]
[INFO] Apache Sling Resource Access Security ............. SUCCESS [4.198s]
[INFO] Apache Sling Resource Access Security Integration Tests  SUCCESS [26.994s]
[INFO] Apache Sling Models API ........................... SUCCESS [5.672s]
[INFO] Apache Sling Models Implementation ................ SUCCESS [8.104s]
[INFO] Apache Sling Test Tools ........................... SUCCESS [4.548s]
[INFO] Apache Sling Models Integration Tests ............. SUCCESS [28.040s]
[INFO] Apache Sling JUnit Core ........................... SUCCESS [4.661s]
[INFO] Apache Sling JUnit Scriptable Tests Provider ...... SUCCESS [3.730s]
[INFO] Apache Sling JUnit Health Checks .................. SUCCESS [5.475s]
[INFO] Apache Sling JUnit Remote Tests Runners ........... SUCCESS [3.415s]
[INFO] Apache Sling JUnit Performance .................... SUCCESS [4.393s]
[INFO] Apache Sling Testing Resource Resolver Mock ....... SUCCESS [3.297s]
[INFO] Apache Sling Testing OSGi Mock .................... SUCCESS [8.582s]
[INFO] Apache Sling Testing Sling Mock ................... SUCCESS [8.013s]
[INFO] Apache Sling Pax Exam Utilities ................... SUCCESS [25.391s]
[INFO] Apache Sling Sample Server-Side Tests ............. SUCCESS [4.752s]
[INFO] Apache Sling Failing Server-Side Tests ............ SUCCESS [3.471s]
[INFO] Apache Sling Launchpad Base ....................... SUCCESS [14.205s]
[INFO] Apache Sling Launchpad Application Builder ........ SUCCESS [49.823s]
[INFO] Apache Sling Sample Integration Tests ............. SUCCESS [1:06.021s]
[INFO] Apache Sling Testing Modules Reactor .............. SUCCESS [1.953s]
[INFO] Apache Sling Installer ............................ SUCCESS [5.203s]
[INFO] Apache Sling Installer WebConsole Plugin .......... SUCCESS [3.656s]
[INFO] Apache Sling File Installer ....................... SUCCESS [3.499s]
[INFO] Apache Sling JCR Installer ........................ SUCCESS [2:05.741s]
[INFO] Apache Sling Installer Configuration Admin Support  SUCCESS [3.877s]
[INFO] Apache Sling Deployment Package Installer ......... SUCCESS [4.013s]
[INFO] Apache Sling Subsystems Installer ................. SUCCESS [4.141s]
[INFO] Apache Sling Installer Integration Tests .......... SUCCESS [53.998s]
[INFO] Apache Sling Launchpad API ........................ SUCCESS [3.701s]
[INFO] Apache Sling Launchpad Installer .................. SUCCESS [7.619s]
[INFO] Apache Sling Launchpad Content .................... SUCCESS [3.856s]
[INFO] Apache Sling Launchpad Testing Services ........... SUCCESS [8.829s]
[INFO] Apache Sling Launchpad Testing Services WAR ....... SUCCESS [11.281s]
[INFO] Apache Sling Launchpad Testing Fragment Bundle .... SUCCESS [6.116s]
[INFO] Apache Sling Launchpad Test Bundles ............... SUCCESS [5.483s]
[INFO] Apache Sling Integration Tests .................... SUCCESS [9.725s]
[INFO] Apache Sling Launchpad Testing .................... FAILURE [0.303s]
[INFO] Apache Sling (Builder) ............................ SKIPPED
[INFO] ------------------------------------------------------------------------
[INFO] BUILD FAILURE
[INFO] ------------------------------------------------------------------------
[INFO] Total time: 37:35.030s
[INFO] Finished at: Fri Apr 10 11:54:36 UTC 2015
[INFO] Final Memory: 170M/412M
[INFO] ------------------------------------------------------------------------
[JENKINS] Archiving disabled
[JENKINS] Archiving disabled
[JENKINS] Archiving disabled
[JENKINS] Archiving disabled
[JENKINS] Archiving disabled
[JENKINS] Archiving disabled
[JENKINS] Archiving disabled
[JENKINS] Archiving disabled
[JENKINS] Archiving disabled
[JENKINS] Archiving disabled
[JENKINS] Archiving disabled
[JENKINS] Archiving disabled
[JENKINS] Archiving disabled
[JENKINS] Archiving disabled
[JENKINS] Archiving disabled
[JENKINS] Archiving disabled
[JENKINS] Archiving disabled
[JENKINS] Archiving disabled
[JENKINS] Archiving disabled
[JENKINS] Archiving disabled
[JENKINS] Archiving disabled
[JENKINS] Archiving disabled
[JENKINS] Archiving disabled
[JENKINS] Archiving disabled
[JENKINS] Archiving disabled
[JENKINS] Archiving disabled
[JENKINS] Archiving disabled
[JENKINS] Archiving disabled
[JENKINS] Archiving disabled
[JENKINS] Archiving disabled
[JENKINS] Archiving disabled
[JENKINS] Archiving disabled
[JENKINS] Archiving disabled
[JENKINS] Archiving disabled
[JENKINS] Archiving disabled
[JENKINS] Archiving disabled
[JENKINS] Archiving disabled
[JENKINS] Archiving disabled
[JENKINS] Archiving disabled
[JENKINS] Archiving disabled
[JENKINS] Archiving disabled
[JENKINS] Archiving disabled
[JENKINS] Archiving disabled
[JENKINS] Archiving disabled
[JENKINS] Archiving disabled
[JENKINS] Archiving disabled
[JENKINS] Archiving disabled
[JENKINS] Archiving disabled
[JENKINS] Archiving disabled
[JENKINS] Archiving disabled
[JENKINS] Archiving disabled
[JENKINS] Archiving disabled
[JENKINS] Archiving disabled
[JENKINS] Archiving disabled
[JENKINS] Archiving disabled
[JENKINS] Archiving disabled
[JENKINS] Archiving disabled
[JENKINS] Archiving disabled
[JENKINS] Archiving disabled
[JENKINS] Archiving disabled
[JENKINS] Archiving disabled
[JENKINS] Archiving disabled
[JENKINS] Archiving disabled
[JENKINS] Archiving disabled
[JENKINS] Archiving disabled
[JENKINS] Archiving disabled
[JENKINS] Archiving disabled
[JENKINS] Archiving disabled
[JENKINS] Archiving disabled
[JENKINS] Archiving disabled
[JENKINS] Archiving disabled
[JENKINS] Archiving disabled
[JENKINS] Archiving disabled
[JENKINS] Archiving disabled
[JENKINS] Archiving disabled
[JENKINS] Archiving disabled
[JENKINS] Archiving disabled
[JENKINS] Archiving disabled
[JENKINS] Archiving disabled
[JENKINS] Archiving disabled
[JENKINS] Archiving disabled
[JENKINS] Archiving disabled
[JENKINS] Archiving disabled
[JENKINS] Archiving disabled
[JENKINS] Archiving disabled
[JENKINS] Archiving disabled
[JENKINS] Archiving disabled
[JENKINS] Archiving disabled
[JENKINS] Archiving disabled
[JENKINS] Archiving disabled
[JENKINS] Archiving disabled
[JENKINS] Archiving disabled
[JENKINS] Archiving disabled
[JENKINS] Archiving disabled
[JENKINS] Archiving disabled
[JENKINS] Archiving disabled
[JENKINS] Archiving disabled
[JENKINS] Archiving disabled
[JENKINS] Archiving disabled
[JENKINS] Archiving disabled
[JENKINS] Archiving disabled
[JENKINS] Archiving disabled
[JENKINS] Archiving disabled
[JENKINS] Archiving disabled
[JENKINS] Archiving disabled
[JENKINS] Archiving disabled
[JENKINS] Archiving disabled
[JENKINS] Archiving disabled
[JENKINS] Archiving disabled
[JENKINS] Archiving disabled
[JENKINS] Archiving disabled
[JENKINS] Archiving disabled
[JENKINS] Archiving disabled
[JENKINS] Archiving disabled
[JENKINS] Archiving disabled
[JENKINS] Archiving disabled
[JENKINS] Archiving disabled
[JENKINS] Archiving disabled
[JENKINS] Archiving disabled
[JENKINS] Archiving disabled
[JENKINS] Archiving disabled
[JENKINS] Archiving disabled
[JENKINS] Archiving disabled
[JENKINS] Archiving disabled
[JENKINS] Archiving disabled
[JENKINS] Archiving disabled
[JENKINS] Archiving disabled
Waiting for Jenkins to finish collecting data
[ERROR] Failed to execute goal on project org.apache.sling.launchpad.testing: Could not resolve dependencies for project org.apache.sling:org.apache.sling.launchpad.testing:slingstart:7-SNAPSHOT: Could not find artifact org.apache.sling:org.apache.sling.launchpad:jar:slingfeature:8-SNAPSHOT in Nexus (http://repository.apache.org/snapshots) -> [Help 1]
[ERROR] 
[ERROR] To see the full stack trace of the errors, re-run Maven with the -e switch.
[ERROR] Re-run Maven using the -X switch to enable full debug logging.
[ERROR] 
[ERROR] For more information about the errors and possible solutions, please read the following articles:
[ERROR] [Help 1] http://cwiki.apache.org/confluence/display/MAVEN/DependencyResolutionException
[ERROR] 
[ERROR] After correcting the problems, you can resume the build with the command
[ERROR]   mvn <goals> -rf :org.apache.sling.launchpad.testing
channel stopped

Build failed in Jenkins: sling-trunk-1.6 #3279

Posted by Apache Jenkins Server <je...@builds.apache.org>.
See <https://builds.apache.org/job/sling-trunk-1.6/3279/changes>

Changes:

[cziegeler] Use latest snapshot of commons testing during release vote

[cziegeler] [maven-release-plugin] prepare for next development iteration

[cziegeler] [maven-release-plugin] prepare release org.apache.sling.commons.testing-2.0.18

[cziegeler] Delay resolving of reactor projects until project is built

------------------------------------------
[...truncated 66086 lines...]
[INFO] Apache Sling Initial Content Loader ............... SUCCESS [5.378s]
[INFO] Apache Sling Jackrabbit Embedded Repository ....... SUCCESS [17.608s]
[INFO] Apache Sling Jackrabbit UserManager Support ....... SUCCESS [6.232s]
[INFO] Apache Sling Jackrabbit JSR-283 Access Control Manager Support  SUCCESS [3.896s]
[INFO] Apache Sling Wrapper Bundle for the JCR API ....... SUCCESS [6.663s]
[INFO] Apache Sling JCR Resource Resolver ................ SUCCESS [1:45.063s]
[INFO] Apache Sling Testing Sling Mock Jackrabbit-based Resource Resolver  SUCCESS [36.149s]
[INFO] Apache Sling Versioning Integration Tests ......... SUCCESS [34.928s]
[INFO] Apache Sling JCR Repository Registration .......... SUCCESS [6.498s]
[INFO] Apache Sling Simple WebDAV Access to repositories . SUCCESS [5.041s]
[INFO] Apache Sling DavEx Access to repositories ......... SUCCESS [14.370s]
[INFO] Apache Sling JCR WebConsole Bundle ................ SUCCESS [4.137s]
[INFO] Apache Sling Oak Repository Server ................ SUCCESS [5.117s]
[INFO] Apache Sling SlingRepository Integration Tests .... SUCCESS [1:14.464s]
[INFO] Apache Sling Servlet Resolver ..................... SUCCESS [6.501s]
[INFO] Apache Sling Default GET Servlets ................. SUCCESS [4.908s]
[INFO] Apache Sling Default POST Servlets ................ SUCCESS [6.673s]
[INFO] Apache Sling Compat Servlets ...................... SUCCESS [3.594s]
[INFO] Apache Sling Scripting Implementation API ......... SUCCESS [5.072s]
[INFO] Apache Sling Scripting Core implementation ........ SUCCESS [15.846s]
[INFO] Apache Sling Scripting JavaScript Support ......... SUCCESS [26.749s]
[INFO] Apache Sling Scripting JSP Support ................ SUCCESS [9.240s]
[INFO] Apache Sling JSP Tag Library ...................... SUCCESS [6.082s]
[INFO] Apache Sling JSP Standard Tag Library ............. SUCCESS [4.209s]
[INFO] Apache Sling Adapter Manager Implementation ....... SUCCESS [4.730s]
[INFO] Apache Sling Bundle Resource Provider ............. SUCCESS [3.263s]
[INFO] Apache Sling Distributed Event Admin .............. SUCCESS [7.089s]
[INFO] Apache Sling Discovery API ........................ SUCCESS [5.145s]
[INFO] Apache Sling Resource-Based Discovery Service ..... SUCCESS [18:27.136s]
[INFO] Apache Sling Discovery Support Bundle ............. SUCCESS [7.165s]
[INFO] Apache Sling Discovery Standalone Implementation .. SUCCESS [4.254s]
[INFO] Apache Sling Event Support ........................ SUCCESS [20:37.161s]
[INFO] Apache Sling Feature Flags ........................ SUCCESS [4.196s]
[INFO] Apache Sling Filesystem Resource Provider ......... SUCCESS [3.619s]
[INFO] Apache Sling javax.activation bundle .............. SUCCESS [3.928s]
[INFO] Apache Sling Service User Mapper .................. SUCCESS [8.678s]
[INFO] Apache Sling Settings ............................. SUCCESS [5.097s]
[INFO] Apache Sling Web Console Branding ................. SUCCESS [3.120s]
[INFO] Apache Sling Web Console Security Provider ........ SUCCESS [3.874s]
[INFO] Apache Sling Explorer ............................. SUCCESS [7.373s]
[INFO] Apache Sling Health Check Core .................... SUCCESS [15.041s]
[INFO] Apache Sling Health Check Annotations ............. SUCCESS [6.049s]
[INFO] Apache Sling Health Check Samples ................. SUCCESS [6.920s]
[INFO] Apache Sling Health Check Support Components ...... SUCCESS [29.569s]
[INFO] Apache Sling Health Check Webconsole Plugin ....... SUCCESS [5.738s]
[INFO] Apache Sling Health Check JUnit Bridge ............ SUCCESS [7.317s]
[INFO] Apache Sling Health Check Integration Tests ....... SUCCESS [33.749s]
[INFO] Apache Sling Health Check Reactor POM ............. SUCCESS [4.456s]
[INFO] Apache Sling Resource Access Security ............. SUCCESS [4.434s]
[INFO] Apache Sling Resource Access Security Integration Tests  SUCCESS [45.073s]
[INFO] Apache Sling Models API ........................... SUCCESS [4.396s]
[INFO] Apache Sling Models Implementation ................ SUCCESS [11.881s]
[INFO] Apache Sling Test Tools ........................... SUCCESS [5.063s]
[INFO] Apache Sling Models Integration Tests ............. SUCCESS [49.151s]
[INFO] Apache Sling JUnit Core ........................... SUCCESS [7.371s]
[INFO] Apache Sling JUnit Scriptable Tests Provider ...... SUCCESS [5.218s]
[INFO] Apache Sling JUnit Health Checks .................. SUCCESS [8.049s]
[INFO] Apache Sling JUnit Remote Tests Runners ........... SUCCESS [5.257s]
[INFO] Apache Sling JUnit Performance .................... SUCCESS [5.573s]
[INFO] Apache Sling Testing Resource Resolver Mock ....... SUCCESS [6.674s]
[INFO] Apache Sling Testing OSGi Mock .................... SUCCESS [5.468s]
[INFO] Apache Sling Testing Sling Mock ................... SUCCESS [8.841s]
[INFO] Apache Sling Pax Exam Utilities ................... SUCCESS [46.759s]
[INFO] Apache Sling Sample Server-Side Tests ............. SUCCESS [4.582s]
[INFO] Apache Sling Failing Server-Side Tests ............ SUCCESS [4.237s]
[INFO] Apache Sling Launchpad Base ....................... SUCCESS [15.409s]
[INFO] Apache Sling Launchpad Application Builder ........ SUCCESS [56.035s]
[INFO] Apache Sling Sample Integration Tests ............. SUCCESS [1:33.006s]
[INFO] Apache Sling Testing Modules Reactor .............. SUCCESS [1.723s]
[INFO] Apache Sling Installer ............................ SUCCESS [5.890s]
[INFO] Apache Sling Installer WebConsole Plugin .......... SUCCESS [4.563s]
[INFO] Apache Sling File Installer ....................... SUCCESS [3.676s]
[INFO] Apache Sling JCR Installer ........................ SUCCESS [2:24.180s]
[INFO] Apache Sling Installer Configuration Admin Support  SUCCESS [12.946s]
[INFO] Apache Sling Deployment Package Installer ......... SUCCESS [4.198s]
[INFO] Apache Sling Subsystems Installer ................. SUCCESS [3.978s]
[INFO] Apache Sling Installer Integration Tests .......... SUCCESS [55.883s]
[INFO] Apache Sling Launchpad API ........................ SUCCESS [5.326s]
[INFO] Apache Sling Launchpad Installer .................. SUCCESS [9.122s]
[INFO] Apache Sling Launchpad Content .................... SUCCESS [5.400s]
[INFO] Apache Sling Launchpad Testing Services ........... SUCCESS [9.224s]
[INFO] Apache Sling Launchpad Testing Services WAR ....... SUCCESS [5.347s]
[INFO] Apache Sling Launchpad Testing Fragment Bundle .... SUCCESS [3.573s]
[INFO] Apache Sling Launchpad Test Bundles ............... SUCCESS [4.911s]
[INFO] Apache Sling Integration Tests .................... SUCCESS [10.200s]
[INFO] Apache Sling Launchpad Testing .................... FAILURE [1.099s]
[INFO] Apache Sling (Builder) ............................ SKIPPED
[INFO] ------------------------------------------------------------------------
[INFO] BUILD FAILURE
[INFO] ------------------------------------------------------------------------
[INFO] Total time: 1:08:34.973s
[INFO] Finished at: Fri Apr 10 11:12:59 UTC 2015
[INFO] Final Memory: 169M/343M
[INFO] ------------------------------------------------------------------------
[JENKINS] Archiving disabled
[JENKINS] Archiving disabled
[JENKINS] Archiving disabled
[JENKINS] Archiving disabled
[JENKINS] Archiving disabled
[JENKINS] Archiving disabled
[JENKINS] Archiving disabled
[JENKINS] Archiving disabled
[JENKINS] Archiving disabled
[JENKINS] Archiving disabled
[JENKINS] Archiving disabled
[JENKINS] Archiving disabled
[JENKINS] Archiving disabled
[JENKINS] Archiving disabled
[JENKINS] Archiving disabled
[JENKINS] Archiving disabled
[JENKINS] Archiving disabled
[JENKINS] Archiving disabled
[JENKINS] Archiving disabled
[JENKINS] Archiving disabled
[JENKINS] Archiving disabled
[JENKINS] Archiving disabled
[JENKINS] Archiving disabled
[JENKINS] Archiving disabled
[JENKINS] Archiving disabled
[JENKINS] Archiving disabled
[JENKINS] Archiving disabled
[JENKINS] Archiving disabled
[JENKINS] Archiving disabled
[JENKINS] Archiving disabled
[JENKINS] Archiving disabled
[JENKINS] Archiving disabled
[JENKINS] Archiving disabled
[JENKINS] Archiving disabled
[JENKINS] Archiving disabled
[JENKINS] Archiving disabled
[JENKINS] Archiving disabled
[JENKINS] Archiving disabled
[JENKINS] Archiving disabled
[JENKINS] Archiving disabled
[JENKINS] Archiving disabled
[JENKINS] Archiving disabled
[JENKINS] Archiving disabled
[JENKINS] Archiving disabled
[JENKINS] Archiving disabled
[JENKINS] Archiving disabled
[JENKINS] Archiving disabled
[JENKINS] Archiving disabled
[JENKINS] Archiving disabled
[JENKINS] Archiving disabled
[JENKINS] Archiving disabled
[JENKINS] Archiving disabled
[JENKINS] Archiving disabled
[JENKINS] Archiving disabled
[JENKINS] Archiving disabled
[JENKINS] Archiving disabled
[JENKINS] Archiving disabled
[JENKINS] Archiving disabled
[JENKINS] Archiving disabled
[JENKINS] Archiving disabled
[JENKINS] Archiving disabled
[JENKINS] Archiving disabled
[JENKINS] Archiving disabled
[JENKINS] Archiving disabled
[JENKINS] Archiving disabled
[JENKINS] Archiving disabled
[JENKINS] Archiving disabled
[JENKINS] Archiving disabled
[JENKINS] Archiving disabled
[JENKINS] Archiving disabled
[JENKINS] Archiving disabled
[JENKINS] Archiving disabled
[JENKINS] Archiving disabled
[JENKINS] Archiving disabled
[JENKINS] Archiving disabled
[JENKINS] Archiving disabled
[JENKINS] Archiving disabled
[JENKINS] Archiving disabled
[JENKINS] Archiving disabled
[JENKINS] Archiving disabled
[JENKINS] Archiving disabled
[JENKINS] Archiving disabled
[JENKINS] Archiving disabled
[JENKINS] Archiving disabled
[JENKINS] Archiving disabled
[JENKINS] Archiving disabled
[JENKINS] Archiving disabled
[JENKINS] Archiving disabled
[JENKINS] Archiving disabled
[JENKINS] Archiving disabled
[JENKINS] Archiving disabled
[JENKINS] Archiving disabled
[JENKINS] Archiving disabled
[JENKINS] Archiving disabled
[JENKINS] Archiving disabled
[JENKINS] Archiving disabled
[JENKINS] Archiving disabled
[JENKINS] Archiving disabled
[JENKINS] Archiving disabled
[JENKINS] Archiving disabled
[JENKINS] Archiving disabled
[JENKINS] Archiving disabled
[JENKINS] Archiving disabled
[JENKINS] Archiving disabled
[JENKINS] Archiving disabled
[JENKINS] Archiving disabled
[JENKINS] Archiving disabled
[JENKINS] Archiving disabled
[JENKINS] Archiving disabled
[JENKINS] Archiving disabled
[JENKINS] Archiving disabled
[JENKINS] Archiving disabled
[JENKINS] Archiving disabled
[JENKINS] Archiving disabled
[JENKINS] Archiving disabled
[JENKINS] Archiving disabled
[JENKINS] Archiving disabled
[JENKINS] Archiving disabled
[JENKINS] Archiving disabled
[JENKINS] Archiving disabled
[JENKINS] Archiving disabled
[JENKINS] Archiving disabled
[JENKINS] Archiving disabled
[JENKINS] Archiving disabled
[JENKINS] Archiving disabled
[JENKINS] Archiving disabled
[JENKINS] Archiving disabled
Waiting for Jenkins to finish collecting data
[ERROR] Failed to execute goal org.apache.sling:slingstart-maven-plugin:1.0.5-SNAPSHOT:prepare (default-prepare) on project org.apache.sling.launchpad.testing: Unable to get artifact for Dependency {groupId=org.apache.sling, artifactId=org.apache.sling.launchpad.test-bundles, version=0.0.1-SNAPSHOT, type=slingfeature}: Could not find artifact org.apache.sling:org.apache.sling.launchpad.test-bundles:txt:null:0.0.1-SNAPSHOT in Nexus (http://repository.apache.org/snapshots)
[ERROR] 
[ERROR] Try downloading the file manually from the project website.
[ERROR] 
[ERROR] Then, install it using the command:
[ERROR] mvn install:install-file -DgroupId=org.apache.sling -DartifactId=org.apache.sling.launchpad.test-bundles -Dversion=0.0.1-SNAPSHOT -Dclassifier=null -Dpackaging=slingfeature -Dfile=/path/to/file
[ERROR] 
[ERROR] Alternatively, if you host your own repository you can deploy the file there:
[ERROR] mvn deploy:deploy-file -DgroupId=org.apache.sling -DartifactId=org.apache.sling.launchpad.test-bundles -Dversion=0.0.1-SNAPSHOT -Dclassifier=null -Dpackaging=slingfeature -Dfile=/path/to/file -Durl=[url] -DrepositoryId=[id]
[ERROR] 
[ERROR] 
[ERROR] org.apache.sling:org.apache.sling.launchpad.test-bundles:slingfeature:0.0.1-SNAPSHOT
[ERROR] 
[ERROR] from the specified remote repositories:
[ERROR] Nexus (http://repository.apache.org/snapshots, releases=false, snapshots=true),
[ERROR] central (http://repo.maven.apache.org/maven2, releases=true, snapshots=false)
[ERROR] -> [Help 1]
[ERROR] 
[ERROR] To see the full stack trace of the errors, re-run Maven with the -e switch.
[ERROR] Re-run Maven using the -X switch to enable full debug logging.
[ERROR] 
[ERROR] For more information about the errors and possible solutions, please read the following articles:
[ERROR] [Help 1] http://cwiki.apache.org/confluence/display/MAVEN/MojoExecutionException
[ERROR] 
[ERROR] After correcting the problems, you can resume the build with the command
[ERROR]   mvn <goals> -rf :org.apache.sling.launchpad.testing
channel stopped

Build failed in Jenkins: sling-trunk-1.6 #3278

Posted by Apache Jenkins Server <je...@builds.apache.org>.
See <https://builds.apache.org/job/sling-trunk-1.6/3278/changes>

Changes:

[radu] releng: updated dependencies after release staging

------------------------------------------
[...truncated 52176 lines...]
[INFO] Apache Sling System Bundle Extension: WS APIs ..... SUCCESS [3.927s]
[INFO] Apache Sling Dynamic Class Loader Support ......... SUCCESS [5.716s]
[INFO] Apache Sling Commons Java Compiler ................ SUCCESS [6.070s]
[INFO] Apache Sling JSON Library ......................... SUCCESS [5.938s]
[INFO] Apache Sling SLF4J Implementation (Logback) ....... SUCCESS [30.407s]
[INFO] Apache Sling OSGi LogService Implementation ....... SUCCESS [3.870s]
[INFO] Apache Sling MIME type mapping support ............ SUCCESS [9.838s]
[INFO] Apache Sling Commons OSGi support ................. SUCCESS [5.453s]
[INFO] Apache Sling Scheduler Support .................... SUCCESS [5.349s]
[INFO] Apache Sling Testing Utilities .................... SUCCESS [13.511s]
[INFO] Apache Sling Thread Dumper ........................ SUCCESS [8.365s]
[INFO] Apache Sling Thread Support ....................... SUCCESS [5.689s]
[INFO] Apache Sling Authentication Service ............... SUCCESS [6.097s]
[INFO] Apache Sling Form Based Authentication Handler .... SUCCESS [8.330s]
[INFO] Apache Sling Engine Implementation ................ SUCCESS [16.797s]
[INFO] Apache Sling Repository API Bundle ................ SUCCESS [9.305s]
[INFO] Apache Sling Testing JCR Mock ..................... SUCCESS [5.044s]
[INFO] Apache Sling JCR Base Bundle ...................... SUCCESS [6.230s]
[INFO] Apache Sling JCR ClassLoader ...................... SUCCESS [3.523s]
[INFO] Apache Sling Initial Content Loader ............... SUCCESS [4.969s]
[INFO] Apache Sling Jackrabbit Embedded Repository ....... SUCCESS [15.829s]
[INFO] Apache Sling Jackrabbit UserManager Support ....... SUCCESS [10.973s]
[INFO] Apache Sling Jackrabbit JSR-283 Access Control Manager Support  SUCCESS [12.004s]
[INFO] Apache Sling Wrapper Bundle for the JCR API ....... SUCCESS [7.016s]
[INFO] Apache Sling JCR Resource Resolver ................ SUCCESS [47.756s]
[INFO] Apache Sling Testing Sling Mock Jackrabbit-based Resource Resolver  SUCCESS [15.602s]
[INFO] Apache Sling Versioning Integration Tests ......... SUCCESS [13.571s]
[INFO] Apache Sling JCR Repository Registration .......... SUCCESS [9.099s]
[INFO] Apache Sling Simple WebDAV Access to repositories . SUCCESS [5.157s]
[INFO] Apache Sling DavEx Access to repositories ......... SUCCESS [7.047s]
[INFO] Apache Sling JCR WebConsole Bundle ................ SUCCESS [4.467s]
[INFO] Apache Sling Oak Repository Server ................ SUCCESS [5.002s]
[INFO] Apache Sling SlingRepository Integration Tests .... SUCCESS [52.042s]
[INFO] Apache Sling Servlet Resolver ..................... SUCCESS [9.892s]
[INFO] Apache Sling Default GET Servlets ................. SUCCESS [6.026s]
[INFO] Apache Sling Default POST Servlets ................ SUCCESS [6.520s]
[INFO] Apache Sling Compat Servlets ...................... SUCCESS [3.501s]
[INFO] Apache Sling Scripting Implementation API ......... SUCCESS [6.533s]
[INFO] Apache Sling Scripting Core implementation ........ SUCCESS [14.560s]
[INFO] Apache Sling Scripting JavaScript Support ......... SUCCESS [16.672s]
[INFO] Apache Sling Scripting JSP Support ................ SUCCESS [14.184s]
[INFO] Apache Sling JSP Tag Library ...................... SUCCESS [8.066s]
[INFO] Apache Sling JSP Standard Tag Library ............. SUCCESS [4.363s]
[INFO] Apache Sling Adapter Manager Implementation ....... SUCCESS [4.612s]
[INFO] Apache Sling Bundle Resource Provider ............. SUCCESS [5.232s]
[INFO] Apache Sling Distributed Event Admin .............. SUCCESS [10.682s]
[INFO] Apache Sling Discovery API ........................ SUCCESS [5.362s]
[INFO] Apache Sling Resource-Based Discovery Service ..... SUCCESS [4:33.408s]
[INFO] Apache Sling Discovery Support Bundle ............. SUCCESS [5.206s]
[INFO] Apache Sling Discovery Standalone Implementation .. SUCCESS [5.387s]
[INFO] Apache Sling Event Support ........................ SUCCESS [11:25.956s]
[INFO] Apache Sling Feature Flags ........................ SUCCESS [4.959s]
[INFO] Apache Sling Filesystem Resource Provider ......... SUCCESS [8.528s]
[INFO] Apache Sling javax.activation bundle .............. SUCCESS [4.922s]
[INFO] Apache Sling Service User Mapper .................. SUCCESS [15.444s]
[INFO] Apache Sling Settings ............................. SUCCESS [7.253s]
[INFO] Apache Sling Web Console Branding ................. SUCCESS [4.988s]
[INFO] Apache Sling Web Console Security Provider ........ SUCCESS [7.698s]
[INFO] Apache Sling Explorer ............................. SUCCESS [6.101s]
[INFO] Apache Sling Health Check Core .................... SUCCESS [12.189s]
[INFO] Apache Sling Health Check Annotations ............. SUCCESS [6.614s]
[INFO] Apache Sling Health Check Samples ................. SUCCESS [6.569s]
[INFO] Apache Sling Health Check Support Components ...... SUCCESS [6.140s]
[INFO] Apache Sling Health Check Webconsole Plugin ....... SUCCESS [5.163s]
[INFO] Apache Sling Health Check JUnit Bridge ............ SUCCESS [10.146s]
[INFO] Apache Sling Health Check Integration Tests ....... SUCCESS [27.897s]
[INFO] Apache Sling Health Check Reactor POM ............. SUCCESS [6.240s]
[INFO] Apache Sling Resource Access Security ............. SUCCESS [5.126s]
[INFO] Apache Sling Resource Access Security Integration Tests  SUCCESS [36.131s]
[INFO] Apache Sling Models API ........................... SUCCESS [5.425s]
[INFO] Apache Sling Models Implementation ................ SUCCESS [7.268s]
[INFO] Apache Sling Test Tools ........................... SUCCESS [4.431s]
[INFO] Apache Sling Models Integration Tests ............. SUCCESS [28.934s]
[INFO] Apache Sling JUnit Core ........................... SUCCESS [7.878s]
[INFO] Apache Sling JUnit Scriptable Tests Provider ...... SUCCESS [5.749s]
[INFO] Apache Sling JUnit Health Checks .................. SUCCESS [8.380s]
[INFO] Apache Sling JUnit Remote Tests Runners ........... SUCCESS [7.840s]
[INFO] Apache Sling JUnit Performance .................... SUCCESS [5.323s]
[INFO] Apache Sling Testing Resource Resolver Mock ....... SUCCESS [4.385s]
[INFO] Apache Sling Testing OSGi Mock .................... SUCCESS [12.505s]
[INFO] Apache Sling Testing Sling Mock ................... SUCCESS [9.294s]
[INFO] Apache Sling Pax Exam Utilities ................... SUCCESS [25.909s]
[INFO] Apache Sling Sample Server-Side Tests ............. SUCCESS [5.252s]
[INFO] Apache Sling Failing Server-Side Tests ............ SUCCESS [5.070s]
[INFO] Apache Sling Launchpad Base ....................... SUCCESS [16.756s]
[INFO] Apache Sling Launchpad Application Builder ........ FAILURE [0.058s]
[INFO] Apache Sling Sample Integration Tests ............. SKIPPED
[INFO] Apache Sling Testing Modules Reactor .............. SKIPPED
[INFO] Apache Sling Installer ............................ SKIPPED
[INFO] Apache Sling Installer WebConsole Plugin .......... SKIPPED
[INFO] Apache Sling File Installer ....................... SKIPPED
[INFO] Apache Sling JCR Installer ........................ SKIPPED
[INFO] Apache Sling Installer Configuration Admin Support  SKIPPED
[INFO] Apache Sling Deployment Package Installer ......... SKIPPED
[INFO] Apache Sling Subsystems Installer ................. SKIPPED
[INFO] Apache Sling Installer Integration Tests .......... SKIPPED
[INFO] Apache Sling Launchpad API ........................ SKIPPED
[INFO] Apache Sling Launchpad Installer .................. SKIPPED
[INFO] Apache Sling Launchpad Content .................... SKIPPED
[INFO] Apache Sling Launchpad Testing Services ........... SKIPPED
[INFO] Apache Sling Launchpad Testing Services WAR ....... SKIPPED
[INFO] Apache Sling Launchpad Testing Fragment Bundle .... SKIPPED
[INFO] Apache Sling Launchpad Test Bundles ............... SKIPPED
[INFO] Apache Sling Integration Tests .................... SKIPPED
[INFO] Apache Sling Launchpad Testing .................... SKIPPED
[INFO] Apache Sling (Builder) ............................ SKIPPED
[INFO] ------------------------------------------------------------------------
[INFO] BUILD FAILURE
[INFO] ------------------------------------------------------------------------
[INFO] Total time: 33:57.070s
[INFO] Finished at: Fri Apr 10 09:53:15 UTC 2015
[INFO] Final Memory: 154M/370M
[INFO] ------------------------------------------------------------------------
[JENKINS] Archiving disabled
[JENKINS] Archiving disabled
[JENKINS] Archiving disabled
[JENKINS] Archiving disabled
[JENKINS] Archiving disabled
[JENKINS] Archiving disabled
[JENKINS] Archiving disabled
[JENKINS] Archiving disabled
[JENKINS] Archiving disabled
[JENKINS] Archiving disabled
[JENKINS] Archiving disabled
[JENKINS] Archiving disabled
[JENKINS] Archiving disabled
[JENKINS] Archiving disabled
[JENKINS] Archiving disabled
[JENKINS] Archiving disabled
[JENKINS] Archiving disabled
[JENKINS] Archiving disabled
[JENKINS] Archiving disabled
[JENKINS] Archiving disabled
[JENKINS] Archiving disabled
[JENKINS] Archiving disabled
[JENKINS] Archiving disabled
[JENKINS] Archiving disabled
[JENKINS] Archiving disabled
[JENKINS] Archiving disabled
[JENKINS] Archiving disabled
[JENKINS] Archiving disabled
[JENKINS] Archiving disabled
[JENKINS] Archiving disabled
[JENKINS] Archiving disabled
[JENKINS] Archiving disabled
[JENKINS] Archiving disabled
[JENKINS] Archiving disabled
[JENKINS] Archiving disabled
[JENKINS] Archiving disabled
[JENKINS] Archiving disabled
[JENKINS] Archiving disabled
[JENKINS] Archiving disabled
[JENKINS] Archiving disabled
[JENKINS] Archiving disabled
[JENKINS] Archiving disabled
[JENKINS] Archiving disabled
[JENKINS] Archiving disabled
[JENKINS] Archiving disabled
[JENKINS] Archiving disabled
[JENKINS] Archiving disabled
[JENKINS] Archiving disabled
[JENKINS] Archiving disabled
[JENKINS] Archiving disabled
[JENKINS] Archiving disabled
[JENKINS] Archiving disabled
[JENKINS] Archiving disabled
[JENKINS] Archiving disabled
[JENKINS] Archiving disabled
[JENKINS] Archiving disabled
[JENKINS] Archiving disabled
[JENKINS] Archiving disabled
[JENKINS] Archiving disabled
[JENKINS] Archiving disabled
[JENKINS] Archiving disabled
[JENKINS] Archiving disabled
[JENKINS] Archiving disabled
[JENKINS] Archiving disabled
[JENKINS] Archiving disabled
[JENKINS] Archiving disabled
[JENKINS] Archiving disabled
[JENKINS] Archiving disabled
[JENKINS] Archiving disabled
[JENKINS] Archiving disabled
[JENKINS] Archiving disabled
[JENKINS] Archiving disabled
[JENKINS] Archiving disabled
[JENKINS] Archiving disabled
[JENKINS] Archiving disabled
[JENKINS] Archiving disabled
[JENKINS] Archiving disabled
[JENKINS] Archiving disabled
[JENKINS] Archiving disabled
[JENKINS] Archiving disabled
[JENKINS] Archiving disabled
[JENKINS] Archiving disabled
[JENKINS] Archiving disabled
[JENKINS] Archiving disabled
[JENKINS] Archiving disabled
[JENKINS] Archiving disabled
[JENKINS] Archiving disabled
[JENKINS] Archiving disabled
[JENKINS] Archiving disabled
[JENKINS] Archiving disabled
[JENKINS] Archiving disabled
[JENKINS] Archiving disabled
[JENKINS] Archiving disabled
[JENKINS] Archiving disabled
[JENKINS] Archiving disabled
[JENKINS] Archiving disabled
[JENKINS] Archiving disabled
[JENKINS] Archiving disabled
[JENKINS] Archiving disabled
[JENKINS] Archiving disabled
[JENKINS] Archiving disabled
[JENKINS] Archiving disabled
[JENKINS] Archiving disabled
[JENKINS] Archiving disabled
[JENKINS] Archiving disabled
[JENKINS] Archiving disabled
[JENKINS] Archiving disabled
[JENKINS] Archiving disabled
[JENKINS] Archiving disabled
[JENKINS] Archiving disabled
[JENKINS] Archiving disabled
[JENKINS] Archiving disabled
[JENKINS] Archiving disabled
[JENKINS] Archiving disabled
[JENKINS] Archiving disabled
[JENKINS] Archiving disabled
[JENKINS] Archiving disabled
[JENKINS] Archiving disabled
[JENKINS] Archiving disabled
[JENKINS] Archiving disabled
[JENKINS] Archiving disabled
[JENKINS] Archiving disabled
[JENKINS] Archiving disabled
[JENKINS] Archiving disabled
[JENKINS] Archiving disabled
[JENKINS] Archiving disabled
[JENKINS] Archiving disabled
Waiting for Jenkins to finish collecting data
[ERROR] Could not find goal 'prepare' in plugin org.apache.sling:slingstart-maven-plugin:1.0.5-SNAPSHOT among available goals attach-slingfeature, help, package, prepare-package, start, stop -> [Help 1]
[ERROR] 
[ERROR] To see the full stack trace of the errors, re-run Maven with the -e switch.
[ERROR] Re-run Maven using the -X switch to enable full debug logging.
[ERROR] 
[ERROR] For more information about the errors and possible solutions, please read the following articles:
[ERROR] [Help 1] http://cwiki.apache.org/confluence/display/MAVEN/MojoNotFoundException
channel stopped