You are viewing a plain text version of this content. The canonical link for it is here.
Posted to builds@beam.apache.org by Apache Jenkins Server <je...@builds.apache.org> on 2021/02/08 23:12:09 UTC
Build failed in Jenkins: beam_PostCommit_Java_VR_Dataflow_V2 #469
See <https://ci-beam.apache.org/job/beam_PostCommit_Java_VR_Dataflow_V2/469/display/redirect?page=changes>
Changes:
[samuelw] [BEAM-11729] Remove calls to Class.getSimpleName() for WindowTracing
[randomstep] [BEAM-11595] bump jackson to 2.12.1
------------------------------------------
[...truncated 45.60 KB...]
Resolving github.com/nightlyone/lockfile: commit='0ad87eef1443f64d3d8c50da647e2b1552851124', urls=[https://github.com/nightlyone/lockfile, git@github.com:nightlyone/lockfile.git]
Resolving cached github.com/etcd-io/etcd: commit='11214aa33bf5a47d3d9d8dafe0f6b97237dfe921', urls=[https://github.com/etcd-io/etcd.git, git@github.com:etcd-io/etcd.git]
Resolving github.com/openzipkin/zipkin-go: commit='3741243b287094fda649c7f0fa74bd51f37dc122', urls=[https://github.com/openzipkin/zipkin-go.git, git@github.com:openzipkin/zipkin-go.git]
Resolving github.com/pelletier/go-toml: commit='acdc4509485b587f5e675510c4f2c63e90ff68a8', urls=[https://github.com/pelletier/go-toml.git, git@github.com:pelletier/go-toml.git]
Resolving cached github.com/etcd-io/etcd: commit='11214aa33bf5a47d3d9d8dafe0f6b97237dfe921', urls=[https://github.com/etcd-io/etcd.git, git@github.com:etcd-io/etcd.git]
Resolving github.com/pierrec/lz4: commit='ed8d4cc3b461464e69798080a0092bd028910298', urls=[https://github.com/pierrec/lz4.git, git@github.com:pierrec/lz4.git]
Resolving github.com/pierrec/xxHash: commit='a0006b13c722f7f12368c00a3d3c2ae8a999a0c6', urls=[https://github.com/pierrec/xxHash.git, git@github.com:pierrec/xxHash.git]
Resolving github.com/pkg/errors: commit='30136e27e2ac8d167177e8a583aa4c3fea5be833', urls=[https://github.com/pkg/errors.git, git@github.com:pkg/errors.git]
Resolving github.com/pkg/sftp: commit='22e9c1ccc02fc1b9fa3264572e49109b68a86947', urls=[https://github.com/pkg/sftp.git, git@github.com:pkg/sftp.git]
Resolving github.com/prometheus/client_golang: commit='9bb6ab929dcbe1c8393cd9ef70387cb69811bd1c', urls=[https://github.com/prometheus/client_golang.git, git@github.com:prometheus/client_golang.git]
Resolving cached github.com/etcd-io/etcd: commit='11214aa33bf5a47d3d9d8dafe0f6b97237dfe921', urls=[https://github.com/etcd-io/etcd.git, git@github.com:etcd-io/etcd.git]
Resolving cached github.com/etcd-io/etcd: commit='11214aa33bf5a47d3d9d8dafe0f6b97237dfe921', urls=[https://github.com/etcd-io/etcd.git, git@github.com:etcd-io/etcd.git]
Resolving github.com/prometheus/procfs: commit='cb4147076ac75738c9a7d279075a253c0cc5acbd', urls=[https://github.com/prometheus/procfs.git, git@github.com:prometheus/procfs.git]
Resolving github.com/rcrowley/go-metrics: commit='8732c616f52954686704c8645fe1a9d59e9df7c1', urls=[https://github.com/rcrowley/go-metrics.git, git@github.com:rcrowley/go-metrics.git]
Resolving github.com/cpuguy83/go-md2man: commit='dc9f53734905c233adfc09fd4f063dce63ce3daf', urls=[https://github.com/cpuguy83/go-md2man.git, git@github.com:cpuguy83/go-md2man.git]
Resolving cached github.com/cpuguy83/go-md2man: commit='dc9f53734905c233adfc09fd4f063dce63ce3daf', urls=[https://github.com/cpuguy83/go-md2man.git, git@github.com:cpuguy83/go-md2man.git]
Resolving cached github.com/etcd-io/etcd: commit='11214aa33bf5a47d3d9d8dafe0f6b97237dfe921', urls=[https://github.com/etcd-io/etcd.git, git@github.com:etcd-io/etcd.git]
Resolving cached github.com/etcd-io/etcd: commit='11214aa33bf5a47d3d9d8dafe0f6b97237dfe921', urls=[https://github.com/etcd-io/etcd.git, git@github.com:etcd-io/etcd.git]
Resolving github.com/spf13/afero: commit='bb8f1927f2a9d3ab41c9340aa034f6b803f4359c', urls=[https://github.com/spf13/afero.git, git@github.com:spf13/afero.git]
Resolving github.com/spf13/cast: commit='acbeb36b902d72a7a4c18e8f3241075e7ab763e4', urls=[https://github.com/spf13/cast.git, git@github.com:spf13/cast.git]
Resolving github.com/spf13/cobra: commit='93959269ad99e80983c9ba742a7e01203a4c0e4f', urls=[https://github.com/spf13/cobra.git, git@github.com:spf13/cobra.git]
Resolving github.com/spf13/jwalterweatherman: commit='7c0cea34c8ece3fbeb2b27ab9b59511d360fb394', urls=[https://github.com/spf13/jwalterweatherman.git, git@github.com:spf13/jwalterweatherman.git]
Resolving cached github.com/etcd-io/etcd: commit='11214aa33bf5a47d3d9d8dafe0f6b97237dfe921', urls=[https://github.com/etcd-io/etcd.git, git@github.com:etcd-io/etcd.git]
Resolving github.com/spf13/viper: commit='aafc9e6bc7b7bb53ddaa75a5ef49a17d6e654be5', urls=[https://github.com/spf13/viper.git, git@github.com:spf13/viper.git]
Resolving github.com/stathat/go: commit='74669b9f388d9d788c97399a0824adbfee78400e', urls=[https://github.com/stathat/go.git, git@github.com:stathat/go.git]
Resolving cached github.com/etcd-io/etcd: commit='11214aa33bf5a47d3d9d8dafe0f6b97237dfe921', urls=[https://github.com/etcd-io/etcd.git, git@github.com:etcd-io/etcd.git]
Resolving cached github.com/etcd-io/etcd: commit='11214aa33bf5a47d3d9d8dafe0f6b97237dfe921', urls=[https://github.com/etcd-io/etcd.git, git@github.com:etcd-io/etcd.git]
Resolving cached github.com/etcd-io/etcd: commit='11214aa33bf5a47d3d9d8dafe0f6b97237dfe921', urls=[https://github.com/etcd-io/etcd.git, git@github.com:etcd-io/etcd.git]
Resolving cached github.com/etcd-io/etcd: commit='11214aa33bf5a47d3d9d8dafe0f6b97237dfe921', urls=[https://github.com/etcd-io/etcd.git, git@github.com:etcd-io/etcd.git]
Resolving github.com/xordataexchange/crypt: commit='b2862e3d0a775f18c7cfe02273500ae307b61218', urls=[https://github.com/xordataexchange/crypt.git, git@github.com:xordataexchange/crypt.git]
Resolving go.opencensus.io: commit='3fb168f674736c026e623310bfccb0691e6dec8a', urls=[https://github.com/census-instrumentation/opencensus-go]
Resolving golang.org/x/crypto: commit='d9133f5469342136e669e85192a26056b587f503', urls=[https://go.googlesource.com/crypto]
Resolving golang.org/x/debug: commit='95515998a8a4bd7448134b2cb5971dbeb12e0b77', urls=[https://go.googlesource.com/debug]
Resolving golang.org/x/net: commit='2fb46b16b8dda405028c50f7c7f0f9dd1fa6bfb1', urls=[https://go.googlesource.com/net]
Resolving golang.org/x/oauth2: commit='5d25da1a8d43b66f2898c444f899c7bcfd6a407e', urls=[https://go.googlesource.com/oauth2]
Resolving golang.org/x/sync: commit='fd80eb99c8f653c847d294a001bdf2a3a6f768f5', urls=[https://go.googlesource.com/sync]
> Task :sdks:java:container:pullLicenses
DEPRECATION: Python 3.5 reached the end of its life on September 13th, 2020. Please upgrade your Python as Python 3.5 is no longer maintained. pip 21.0 will drop support for Python 3.5 in January 2021. pip 21.0 will remove support for this functionality.
INFO:root:Pulling license for 200 dependencies using 16 threads.
INFO:root:pull_licenses_java.py succeed. It took 3.144007 seconds with 16 threads.
> Task :sdks:java:container:java8:copyJavaThirdPartyLicenses NO-SOURCE
> Task :sdks:go:resolveBuildDependencies
Resolving golang.org/x/sys: commit='fde4db37ae7ad8191b03d30d27f258b5291ae4e3', urls=[https://go.googlesource.com/sys]
> Task :runners:core-java:compileJava
Note: Some input files use or override a deprecated API.
Note: Recompile with -Xlint:deprecation for details.
Note: Some input files use unchecked or unsafe operations.
Note: Recompile with -Xlint:unchecked for details.
> Task :sdks:go:resolveBuildDependencies
Resolving golang.org/x/text: commit='23ae387dee1f90d29a23c0e87ee0b46038fbed0e', urls=[https://go.googlesource.com/text]
Resolving cached github.com/etcd-io/etcd: commit='11214aa33bf5a47d3d9d8dafe0f6b97237dfe921', urls=[https://github.com/etcd-io/etcd.git, git@github.com:etcd-io/etcd.git]
> Task :runners:core-java:classes
> Task :runners:core-java:jar
> Task :sdks:java:extensions:google-cloud-platform-core:compileJava FROM-CACHE
> Task :sdks:java:extensions:google-cloud-platform-core:classes UP-TO-DATE
> Task :sdks:java:extensions:google-cloud-platform-core:jar
> Task :sdks:java:harness:compileJava FROM-CACHE
> Task :sdks:java:harness:classes UP-TO-DATE
> Task :sdks:java:extensions:google-cloud-platform-core:compileTestJava FROM-CACHE
> Task :sdks:java:extensions:google-cloud-platform-core:testClasses UP-TO-DATE
> Task :sdks:java:extensions:google-cloud-platform-core:testJar
> Task :sdks:java:harness:jar
> Task :release:go-licenses:java:dockerRun
+ go-licenses save github.com/apache/beam/sdks/java/container --save_path=/output/licenses
+ go-licenses csv github.com/apache/beam/sdks/java/container
+ tee /output/licenses/list.csv
+ chmod -R a+w /output/licenses
> Task :sdks:java:harness:shadowJar
> Task :release:go-licenses:java:createLicenses
> Task :sdks:java:container:java8:copyGolangLicenses
> Task :runners:java-fn-execution:compileJava FROM-CACHE
> Task :runners:java-fn-execution:classes UP-TO-DATE
> Task :runners:java-fn-execution:jar
> Task :sdks:java:expansion-service:compileJava FROM-CACHE
> Task :sdks:java:expansion-service:classes UP-TO-DATE
> Task :sdks:java:expansion-service:jar
> Task :runners:direct-java:compileJava FROM-CACHE
> Task :runners:direct-java:classes UP-TO-DATE
> Task :sdks:java:io:kafka:compileJava FROM-CACHE
> Task :sdks:java:io:kafka:classes UP-TO-DATE
> Task :sdks:java:io:kafka:jar
> Task :sdks:java:io:google-cloud-platform:compileJava FROM-CACHE
> Task :sdks:java:io:google-cloud-platform:classes UP-TO-DATE
> Task :sdks:java:io:google-cloud-platform:jar
> Task :sdks:java:container:java8:copyDockerfileDependencies
> Task :runners:google-cloud-dataflow-java:compileJava FROM-CACHE
> Task :runners:google-cloud-dataflow-java:classes
> Task :runners:google-cloud-dataflow-java:jar
> Task :runners:direct-java:shadowJar
> Task :sdks:java:io:google-cloud-platform:compileTestJava FROM-CACHE
> Task :sdks:java:io:google-cloud-platform:testClasses
> Task :sdks:java:io:google-cloud-platform:testJar
> Task :runners:google-cloud-dataflow-java:compileTestJava FROM-CACHE
> Task :runners:google-cloud-dataflow-java:testClasses UP-TO-DATE
> Task :runners:google-cloud-dataflow-java:testJar
> Task :sdks:go:resolveBuildDependencies
Resolving google.golang.org/api: commit='0324d5e90dc7753607860272666845fad9ceb97e', urls=[https://code.googlesource.com/google-api-go-client]
Resolving google.golang.org/genproto: commit='4d944d34d83c502a5f761500a14d8842648415c3', urls=[https://github.com/google/go-genproto]
Resolving google.golang.org/grpc: commit='5e8f83304c0563d1ba74db05fee83d9c18ab9a58', urls=[https://github.com/grpc/grpc-go]
Resolving google.golang.org/protobuf: commit='d165be301fb1e13390ad453281ded24385fd8ebc', urls=[https://go.googlesource.com/protobuf]
Resolving cached github.com/etcd-io/etcd: commit='11214aa33bf5a47d3d9d8dafe0f6b97237dfe921', urls=[https://github.com/etcd-io/etcd.git, git@github.com:etcd-io/etcd.git]
Resolving cached github.com/etcd-io/etcd: commit='11214aa33bf5a47d3d9d8dafe0f6b97237dfe921', urls=[https://github.com/etcd-io/etcd.git, git@github.com:etcd-io/etcd.git]
> Task :sdks:go:installDependencies
> Task :sdks:go:buildLinuxAmd64
> Task :sdks:go:goBuild
> Task :sdks:java:container:resolveBuildDependencies
Resolving ./github.com/apache/beam/sdks/go@<https://ci-beam.apache.org/job/beam_PostCommit_Java_VR_Dataflow_V2/ws/src/sdks/go>
> Task :sdks:java:container:installDependencies
> Task :sdks:java:container:buildLinuxAmd64
> Task :sdks:java:container:goBuild
> Task :sdks:java:container:java8:copySdkHarnessLauncher
> Task :sdks:java:container:java8:dockerPrepare
> Task :sdks:java:container:java8:docker
> Task :runners:google-cloud-dataflow-java:buildAndPushDockerContainer
WARNING: `gcloud docker` will not be supported for Docker client versions above 18.03.
As an alternative, use `gcloud auth configure-docker` to configure `docker` to
use `gcloud` as a credential helper, then use `docker` as you would for non-GCR
registries, e.g. `docker pull gcr.io/project-id/my-image`. Add
`--verbosity=error` to silence this warning: `gcloud docker
--verbosity=error -- pull gcr.io/project-id/my-image`.
See: https://cloud.google.com/container-registry/docs/support/deprecation-notices#gcloud-docker
> Task :runners:google-cloud-dataflow-java:validatesRunnerV2Test
org.apache.beam.sdk.transforms.ViewTest > testMapAsEntrySetSideInput FAILED
java.lang.RuntimeException at ViewTest.java:1023
org.apache.beam.sdk.transforms.ViewTest > testMultimapSideInput FAILED
java.lang.RuntimeException at ViewTest.java:589
org.apache.beam.sdk.transforms.ViewTest > testListSideInput FAILED
java.lang.RuntimeException at ViewTest.java:287
org.apache.beam.sdk.transforms.ViewTest > testMapSideInput FAILED
java.lang.RuntimeException at ViewTest.java:991
org.apache.beam.sdk.transforms.join.CoGroupByKeyTest > testCoGroupByKey FAILED
java.lang.RuntimeException at CoGroupByKeyTest.java:299
org.apache.beam.sdk.transforms.join.CoGroupByKeyTest > testCoGroupByKeyGetOnly FAILED
java.lang.RuntimeException at CoGroupByKeyTest.java:142
org.apache.beam.sdk.transforms.ViewTest > testWindowedMapSideInputWithNonDeterministicKeyCoder FAILED
java.lang.RuntimeException at ViewTest.java:1190
org.apache.beam.sdk.transforms.ViewTest > testMultimapSideInputWithNonDeterministicKeyCoder FAILED
java.lang.RuntimeException at ViewTest.java:696
org.apache.beam.sdk.transforms.ViewTest > testCombinedMapSideInput FAILED
java.lang.RuntimeException at ViewTest.java:1381
org.apache.beam.sdk.transforms.ViewTest > testMultimapSideInputIsImmutable FAILED
java.lang.RuntimeException at ViewTest.java:959
org.apache.beam.sdk.transforms.ViewTest > testWindowedMultimapAsEntrySetSideInput FAILED
java.lang.RuntimeException at ViewTest.java:793
org.apache.beam.sdk.transforms.ParDoTest$StateTests > testBagStateSideInput FAILED
java.lang.RuntimeException at ParDoTest.java:2697
org.apache.beam.sdk.transforms.ViewTest > testWindowedMultimapSideInputWithNonDeterministicKeyCoder FAILED
java.lang.RuntimeException at ViewTest.java:843
org.apache.beam.sdk.transforms.ViewTest > testMapSideInputWithNonDeterministicKeyCoder FAILED
java.lang.RuntimeException at ViewTest.java:1058
org.apache.beam.sdk.transforms.ViewTest > testWindowedMultimapSideInput FAILED
java.lang.RuntimeException at ViewTest.java:745
org.apache.beam.sdk.transforms.ViewTest > testWindowedListSideInput FAILED
java.lang.RuntimeException at ViewTest.java:336
org.apache.beam.runners.dataflow.DataflowRunnerTest > testBatchGroupIntoBatchesOverride FAILED
java.lang.RuntimeException at DataflowRunnerTest.java:1717
org.apache.beam.sdk.transforms.ViewTest > testWindowedMapSideInput FAILED
java.lang.RuntimeException at ViewTest.java:1102
org.apache.beam.sdk.transforms.ViewTest > testListSideInputIsImmutable FAILED
java.lang.RuntimeException at ViewTest.java:414
org.apache.beam.sdk.transforms.ViewTest > testMapSideInputIsImmutable FAILED
java.lang.RuntimeException at ViewTest.java:1348
org.apache.beam.sdk.transforms.ViewTest > testWindowedMapAsEntrySetSideInput FAILED
java.lang.RuntimeException at ViewTest.java:1145
org.apache.beam.sdk.transforms.ViewTest > testMultimapAsEntrySetSideInput FAILED
java.lang.RuntimeException at ViewTest.java:627
org.apache.beam.sdk.transforms.ParDoTest$MultipleInputsAndOutputTests > testSideInputAnnotationWithMultipleSideInputs FAILED
java.lang.RuntimeException at ParDoTest.java:1102
org.apache.beam.sdk.transforms.ParDoTest$MultipleInputsAndOutputTests > testSideInputAnnotation FAILED
java.lang.RuntimeException at ParDoTest.java:999
234 tests completed, 24 failed, 2 skipped
> Task :runners:google-cloud-dataflow-java:validatesRunnerV2Test FAILED
> Task :runners:google-cloud-dataflow-java:cleanUpDockerImages
Digests:
- us.gcr.io/apache-beam-testing/java-postcommit-it/java@sha256:f92b1caf23a0f0e2837fb6af101f200d54d038930306be0f61f20f0189e140f8
Associated tags:
- 20210208180032
Tags:
- us.gcr.io/apache-beam-testing/java-postcommit-it/java:20210208180032
Deleted [us.gcr.io/apache-beam-testing/java-postcommit-it/java:20210208180032].
Deleted [us.gcr.io/apache-beam-testing/java-postcommit-it/java@sha256:f92b1caf23a0f0e2837fb6af101f200d54d038930306be0f61f20f0189e140f8].
FAILURE: Build failed with an exception.
* What went wrong:
Execution failed for task ':runners:google-cloud-dataflow-java:validatesRunnerV2Test'.
> There were failing tests. See the report at: file://<https://ci-beam.apache.org/job/beam_PostCommit_Java_VR_Dataflow_V2/ws/src/runners/google-cloud-dataflow-java/build/reports/tests/validatesRunnerV2Test/index.html>
* Try:
Run with --stacktrace option to get the stack trace. Run with --info or --debug option to get more log output. Run with --scan to get full insights.
* Get more help at https://help.gradle.org
Deprecated Gradle features were used in this build, making it incompatible with Gradle 7.0.
Use '--warning-mode all' to show the individual deprecation warnings.
See https://docs.gradle.org/6.8/userguide/command_line_interface.html#sec:command_line_warnings
BUILD FAILED in 5h 11m 49s
123 actionable tasks: 86 executed, 35 from cache, 2 up-to-date
Publishing build scan...
https://gradle.com/s/j2hqrv7nge6e6
Build step 'Invoke Gradle script' changed build result to FAILURE
Build step 'Invoke Gradle script' marked build as failure
---------------------------------------------------------------------
To unsubscribe, e-mail: builds-unsubscribe@beam.apache.org
For additional commands, e-mail: builds-help@beam.apache.org
Jenkins build is back to normal :
beam_PostCommit_Java_VR_Dataflow_V2 #471
Posted by Apache Jenkins Server <je...@builds.apache.org>.
See <https://ci-beam.apache.org/job/beam_PostCommit_Java_VR_Dataflow_V2/471/display/redirect?page=changes>
---------------------------------------------------------------------
To unsubscribe, e-mail: builds-unsubscribe@beam.apache.org
For additional commands, e-mail: builds-help@beam.apache.org
Build failed in Jenkins: beam_PostCommit_Java_VR_Dataflow_V2 #470
Posted by Apache Jenkins Server <je...@builds.apache.org>.
See <https://ci-beam.apache.org/job/beam_PostCommit_Java_VR_Dataflow_V2/470/display/redirect?page=changes>
Changes:
[Robert Bradshaw] [BEAM-11723] Use packed name for PairWithVoid consolidation.
[Robert Bradshaw] Only do pair-with-none packing when combiner packing is desired.
[Robert Bradshaw] Make eliminate_common_key_with_none private.
[randomstep] [BEAM-11503] bump rockdbjni to 6.15.2
[noreply] [BEAM-11773] Add bhulette as an owner for pandas, pyarrow, numpy
[Boyuan Zhang] Using LoadingCache instead of Map to cache BundleProcessor
[noreply] [BEAM-9547] Produce better errors for some groupby() and set_index()
[yifanmai] Remove translations.eliminate_common_key_with_none from DataflowRunner
[noreply] [BEAM-11762] Upgrades Tensorflow, numpy, and grpcio dependencies
[noreply] [BEAM-9918] Support Tagged external PTransforms (#13872)
[noreply] [BEAM-11265] make sure sample text file gets copied into archetype
------------------------------------------
[...truncated 60.83 KB...]
Resolving github.com/spf13/jwalterweatherman: commit='7c0cea34c8ece3fbeb2b27ab9b59511d360fb394', urls=[https://github.com/spf13/jwalterweatherman.git, git@github.com:spf13/jwalterweatherman.git]
Resolving cached github.com/etcd-io/etcd: commit='11214aa33bf5a47d3d9d8dafe0f6b97237dfe921', urls=[https://github.com/etcd-io/etcd.git, git@github.com:etcd-io/etcd.git]
Resolving github.com/spf13/viper: commit='aafc9e6bc7b7bb53ddaa75a5ef49a17d6e654be5', urls=[https://github.com/spf13/viper.git, git@github.com:spf13/viper.git]
Resolving github.com/stathat/go: commit='74669b9f388d9d788c97399a0824adbfee78400e', urls=[https://github.com/stathat/go.git, git@github.com:stathat/go.git]
Resolving cached github.com/etcd-io/etcd: commit='11214aa33bf5a47d3d9d8dafe0f6b97237dfe921', urls=[https://github.com/etcd-io/etcd.git, git@github.com:etcd-io/etcd.git]
Resolving cached github.com/etcd-io/etcd: commit='11214aa33bf5a47d3d9d8dafe0f6b97237dfe921', urls=[https://github.com/etcd-io/etcd.git, git@github.com:etcd-io/etcd.git]
Resolving cached github.com/etcd-io/etcd: commit='11214aa33bf5a47d3d9d8dafe0f6b97237dfe921', urls=[https://github.com/etcd-io/etcd.git, git@github.com:etcd-io/etcd.git]
Resolving cached github.com/etcd-io/etcd: commit='11214aa33bf5a47d3d9d8dafe0f6b97237dfe921', urls=[https://github.com/etcd-io/etcd.git, git@github.com:etcd-io/etcd.git]
Resolving github.com/xordataexchange/crypt: commit='b2862e3d0a775f18c7cfe02273500ae307b61218', urls=[https://github.com/xordataexchange/crypt.git, git@github.com:xordataexchange/crypt.git]
> Task :sdks:java:io:google-cloud-platform:testJar
> Task :sdks:java:container:pullLicenses
INFO:root:pull_licenses_java.py succeed. It took 3.239571 seconds with 16 threads.
Copying licenses from <https://ci-beam.apache.org/job/beam_PostCommit_Java_VR_Dataflow_V2/ws/src/sdks/java/container/build/target/java_third_party_licenses> to <https://ci-beam.apache.org/job/beam_PostCommit_Java_VR_Dataflow_V2/ws/src/sdks/java/container/build/target/third_party_licenses.>
Finished license_scripts.sh
> Task :sdks:java:container:java8:copyJavaThirdPartyLicenses NO-SOURCE
> Task :runners:google-cloud-dataflow-java:compileTestJava FROM-CACHE
> Task :runners:google-cloud-dataflow-java:testClasses UP-TO-DATE
> Task :runners:google-cloud-dataflow-java:testJar
> Task :sdks:go:resolveBuildDependencies
Resolving go.opencensus.io: commit='3fb168f674736c026e623310bfccb0691e6dec8a', urls=[https://github.com/census-instrumentation/opencensus-go]
Resolving golang.org/x/crypto: commit='d9133f5469342136e669e85192a26056b587f503', urls=[https://go.googlesource.com/crypto]
Resolving golang.org/x/debug: commit='95515998a8a4bd7448134b2cb5971dbeb12e0b77', urls=[https://go.googlesource.com/debug]
Resolving golang.org/x/net: commit='2fb46b16b8dda405028c50f7c7f0f9dd1fa6bfb1', urls=[https://go.googlesource.com/net]
Resolving golang.org/x/oauth2: commit='5d25da1a8d43b66f2898c444f899c7bcfd6a407e', urls=[https://go.googlesource.com/oauth2]
Resolving golang.org/x/sync: commit='fd80eb99c8f653c847d294a001bdf2a3a6f768f5', urls=[https://go.googlesource.com/sync]
Resolving golang.org/x/sys: commit='fde4db37ae7ad8191b03d30d27f258b5291ae4e3', urls=[https://go.googlesource.com/sys]
> Task :release:go-licenses:java:dockerRun
+ go-licenses save github.com/apache/beam/sdks/java/container --save_path=/output/licenses
+ go-licenses csv github.com/apache/beam/sdks/java/container
+ tee /output/licenses/list.csv
github.com/golang/protobuf,https://github.com/golang/protobuf/blob/master/LICENSE,BSD-3-Clause
google.golang.org/protobuf,https://go.googlesource.com/protobuf/+/refs/heads/master/LICENSE,BSD-3-Clause
google.golang.org/grpc,https://github.com/grpc/grpc-go/blob/master/LICENSE,Apache-2.0
github.com/apache/beam/sdks/java/container,https://github.com/apache/beam/blob/master/LICENSE,Apache-2.0
github.com/apache/beam/sdks/go/pkg/beam,https://github.com/apache/beam/blob/master/sdks/go/README.md,Apache-2.0
golang.org/x/net,https://go.googlesource.com/net/+/refs/heads/master/LICENSE,BSD-3-Clause
google.golang.org/genproto/googleapis/rpc/status,https://github.com/googleapis/go-genproto/blob/master/LICENSE,Apache-2.0
golang.org/x/sys,https://go.googlesource.com/sys/+/refs/heads/master/LICENSE,BSD-3-Clause
golang.org/x/text,https://go.googlesource.com/text/+/refs/heads/master/LICENSE,BSD-3-Clause
+ chmod -R a+w /output/licenses
> Task :release:go-licenses:java:createLicenses
> Task :sdks:java:container:java8:copyGolangLicenses
> Task :sdks:go:resolveBuildDependencies
Resolving golang.org/x/text: commit='23ae387dee1f90d29a23c0e87ee0b46038fbed0e', urls=[https://go.googlesource.com/text]
Resolving cached github.com/etcd-io/etcd: commit='11214aa33bf5a47d3d9d8dafe0f6b97237dfe921', urls=[https://github.com/etcd-io/etcd.git, git@github.com:etcd-io/etcd.git]
Resolving google.golang.org/api: commit='0324d5e90dc7753607860272666845fad9ceb97e', urls=[https://code.googlesource.com/google-api-go-client]
Resolving google.golang.org/genproto: commit='4d944d34d83c502a5f761500a14d8842648415c3', urls=[https://github.com/google/go-genproto]
Resolving google.golang.org/grpc: commit='5e8f83304c0563d1ba74db05fee83d9c18ab9a58', urls=[https://github.com/grpc/grpc-go]
Resolving google.golang.org/protobuf: commit='d165be301fb1e13390ad453281ded24385fd8ebc', urls=[https://go.googlesource.com/protobuf]
Resolving cached github.com/etcd-io/etcd: commit='11214aa33bf5a47d3d9d8dafe0f6b97237dfe921', urls=[https://github.com/etcd-io/etcd.git, git@github.com:etcd-io/etcd.git]
Resolving cached github.com/etcd-io/etcd: commit='11214aa33bf5a47d3d9d8dafe0f6b97237dfe921', urls=[https://github.com/etcd-io/etcd.git, git@github.com:etcd-io/etcd.git]
> Task :sdks:go:installDependencies
> Task :sdks:go:buildLinuxAmd64
> Task :sdks:go:goBuild
> Task :sdks:java:container:resolveBuildDependencies
Unable to watch the file system for changes. The inotify watches limit is too low.
Resolving ./github.com/apache/beam/sdks/go@<https://ci-beam.apache.org/job/beam_PostCommit_Java_VR_Dataflow_V2/ws/src/sdks/go>
> Task :sdks:java:container:installDependencies
> Task :sdks:java:container:buildLinuxAmd64
> Task :sdks:java:container:goBuild
> Task :sdks:java:container:java8:copySdkHarnessLauncher
> Task :sdks:java:container:java8:dockerPrepare
> Task :sdks:java:container:java8:docker
> Task :runners:google-cloud-dataflow-java:buildAndPushDockerContainer
WARNING: `gcloud docker` will not be supported for Docker client versions above 18.03.
As an alternative, use `gcloud auth configure-docker` to configure `docker` to
use `gcloud` as a credential helper, then use `docker` as you would for non-GCR
registries, e.g. `docker pull gcr.io/project-id/my-image`. Add
`--verbosity=error` to silence this warning: `gcloud docker
--verbosity=error -- pull gcr.io/project-id/my-image`.
See: https://cloud.google.com/container-registry/docs/support/deprecation-notices#gcloud-docker
The push refers to repository [us.gcr.io/apache-beam-testing/java-postcommit-it/java]
d9557cdf6fc9: Preparing
88938c5eec1f: Preparing
fb6dc03f110c: Preparing
006a8de5b923: Preparing
619ddc951b8b: Preparing
6796d12a4752: Preparing
2f32ec47432c: Preparing
13447a855244: Preparing
ab84d789cdda: Preparing
c6c90f79b4a5: Preparing
00631cc20794: Preparing
3699edc1df37: Preparing
13447a855244: Waiting
ab84d789cdda: Waiting
3e5f50227def: Preparing
c6c90f79b4a5: Waiting
4ce2c85da406: Preparing
aa7af8a465c6: Preparing
ef9a7b8862f4: Preparing
3699edc1df37: Waiting
00631cc20794: Waiting
3e5f50227def: Waiting
a1f2f42922b1: Preparing
6796d12a4752: Waiting
4762552ad7d8: Preparing
ef9a7b8862f4: Waiting
a1f2f42922b1: Waiting
4762552ad7d8: Waiting
2f32ec47432c: Waiting
006a8de5b923: Pushed
d9557cdf6fc9: Pushed
88938c5eec1f: Pushed
619ddc951b8b: Pushed
2f32ec47432c: Pushed
fb6dc03f110c: Pushed
13447a855244: Pushed
3699edc1df37: Layer already exists
3e5f50227def: Layer already exists
4ce2c85da406: Layer already exists
aa7af8a465c6: Layer already exists
ef9a7b8862f4: Layer already exists
a1f2f42922b1: Layer already exists
4762552ad7d8: Layer already exists
c6c90f79b4a5: Pushed
6796d12a4752: Pushed
00631cc20794: Pushed
ab84d789cdda: Pushed
20210209000115: digest: sha256:35d5ebed4e73be9e0c68f8ff3adb25558da7a3f3daa4d88e03d05e5e123c0e67 size: 4098
> Task :runners:google-cloud-dataflow-java:validatesRunnerV2Test
org.apache.beam.sdk.transforms.ViewTest > testMapAsEntrySetSideInput FAILED
java.lang.RuntimeException at ViewTest.java:1023
org.apache.beam.sdk.transforms.ViewTest > testMultimapSideInput FAILED
java.lang.RuntimeException at ViewTest.java:589
org.apache.beam.sdk.transforms.ViewTest > testListSideInput FAILED
java.lang.RuntimeException at ViewTest.java:287
org.apache.beam.sdk.transforms.ViewTest > testMapSideInput FAILED
java.lang.RuntimeException at ViewTest.java:991
org.apache.beam.sdk.transforms.join.CoGroupByKeyTest > testCoGroupByKey FAILED
java.lang.RuntimeException at CoGroupByKeyTest.java:299
org.apache.beam.sdk.transforms.join.CoGroupByKeyTest > testCoGroupByKeyGetOnly FAILED
java.lang.RuntimeException at CoGroupByKeyTest.java:142
org.apache.beam.sdk.transforms.ViewTest > testWindowedMapSideInputWithNonDeterministicKeyCoder FAILED
java.lang.RuntimeException at ViewTest.java:1190
org.apache.beam.sdk.transforms.ViewTest > testMultimapSideInputWithNonDeterministicKeyCoder FAILED
java.lang.RuntimeException at ViewTest.java:696
org.apache.beam.sdk.transforms.ViewTest > testCombinedMapSideInput FAILED
java.lang.RuntimeException at ViewTest.java:1381
org.apache.beam.sdk.transforms.ViewTest > testMultimapSideInputIsImmutable FAILED
java.lang.RuntimeException at ViewTest.java:959
org.apache.beam.sdk.transforms.ParDoTest$StateTests > testBagStateSideInput FAILED
java.lang.RuntimeException at ParDoTest.java:2697
org.apache.beam.sdk.transforms.ViewTest > testWindowedMultimapAsEntrySetSideInput FAILED
java.lang.RuntimeException at ViewTest.java:793
org.apache.beam.sdk.transforms.ViewTest > testWindowedMultimapSideInputWithNonDeterministicKeyCoder FAILED
java.lang.RuntimeException at ViewTest.java:843
org.apache.beam.sdk.transforms.ViewTest > testMapSideInputWithNonDeterministicKeyCoder FAILED
java.lang.RuntimeException at ViewTest.java:1058
org.apache.beam.sdk.transforms.ViewTest > testWindowedMultimapSideInput FAILED
java.lang.RuntimeException at ViewTest.java:745
org.apache.beam.sdk.transforms.ViewTest > testWindowedListSideInput FAILED
java.lang.RuntimeException at ViewTest.java:336
org.apache.beam.runners.dataflow.DataflowRunnerTest > testBatchGroupIntoBatchesOverride FAILED
java.lang.RuntimeException at DataflowRunnerTest.java:1717
org.apache.beam.sdk.transforms.ViewTest > testWindowedMapSideInput FAILED
java.lang.RuntimeException at ViewTest.java:1102
org.apache.beam.sdk.transforms.ViewTest > testListSideInputIsImmutable FAILED
java.lang.RuntimeException at ViewTest.java:414
org.apache.beam.sdk.transforms.ViewTest > testMapSideInputIsImmutable FAILED
java.lang.RuntimeException at ViewTest.java:1348
org.apache.beam.sdk.transforms.ViewTest > testWindowedMapAsEntrySetSideInput FAILED
java.lang.RuntimeException at ViewTest.java:1145
org.apache.beam.sdk.transforms.ViewTest > testMultimapAsEntrySetSideInput FAILED
java.lang.RuntimeException at ViewTest.java:627
org.apache.beam.sdk.transforms.ParDoTest$MultipleInputsAndOutputTests > testSideInputAnnotationWithMultipleSideInputs FAILED
java.lang.RuntimeException at ParDoTest.java:1102
org.apache.beam.sdk.transforms.ParDoTest$MultipleInputsAndOutputTests > testSideInputAnnotation FAILED
java.lang.RuntimeException at ParDoTest.java:999
234 tests completed, 24 failed, 2 skipped
> Task :runners:google-cloud-dataflow-java:validatesRunnerV2Test FAILED
> Task :runners:google-cloud-dataflow-java:cleanUpDockerImages
Untagged: us.gcr.io/apache-beam-testing/java-postcommit-it/java:20210209000115
Untagged: us.gcr.io/apache-beam-testing/java-postcommit-it/java@sha256:35d5ebed4e73be9e0c68f8ff3adb25558da7a3f3daa4d88e03d05e5e123c0e67
Digests:
- us.gcr.io/apache-beam-testing/java-postcommit-it/java@sha256:35d5ebed4e73be9e0c68f8ff3adb25558da7a3f3daa4d88e03d05e5e123c0e67
Associated tags:
- 20210209000115
Tags:
- us.gcr.io/apache-beam-testing/java-postcommit-it/java:20210209000115
Deleted [us.gcr.io/apache-beam-testing/java-postcommit-it/java:20210209000115].
Deleted [us.gcr.io/apache-beam-testing/java-postcommit-it/java@sha256:35d5ebed4e73be9e0c68f8ff3adb25558da7a3f3daa4d88e03d05e5e123c0e67].
FAILURE: Build failed with an exception.
* What went wrong:
Execution failed for task ':runners:google-cloud-dataflow-java:validatesRunnerV2Test'.
> There were failing tests. See the report at: file://<https://ci-beam.apache.org/job/beam_PostCommit_Java_VR_Dataflow_V2/ws/src/runners/google-cloud-dataflow-java/build/reports/tests/validatesRunnerV2Test/index.html>
* Try:
Run with --stacktrace option to get the stack trace. Run with --info or --debug option to get more log output. Run with --scan to get full insights.
* Get more help at https://help.gradle.org
Deprecated Gradle features were used in this build, making it incompatible with Gradle 7.0.
Use '--warning-mode all' to show the individual deprecation warnings.
See https://docs.gradle.org/6.8/userguide/command_line_interface.html#sec:command_line_warnings
BUILD FAILED in 5h 6m 48s
123 actionable tasks: 83 executed, 38 from cache, 2 up-to-date
Gradle was unable to watch the file system for changes. The inotify watches limit is too low.
Publishing build scan...
https://gradle.com/s/26jzqngntllfa
Build step 'Invoke Gradle script' changed build result to FAILURE
Build step 'Invoke Gradle script' marked build as failure
---------------------------------------------------------------------
To unsubscribe, e-mail: builds-unsubscribe@beam.apache.org
For additional commands, e-mail: builds-help@beam.apache.org