You are viewing a plain text version of this content. The canonical link for it is here.
Posted to dev@kafka.apache.org by Apache Jenkins Server <je...@builds.apache.org> on 2019/12/16 21:24:05 UTC
Build failed in Jenkins: kafka-1.0-jdk8 #288
See <https://builds.apache.org/job/kafka-1.0-jdk8/288/display/redirect?page=changes>
Changes:
[bill] port paragrpah from CP docs (#7808)
------------------------------------------
[...truncated 144.89 KB...]
kafka.api.AdminClientIntegrationTest > testDescribeReplicaLogDirs STARTED
kafka.api.AdminClientIntegrationTest > testDescribeReplicaLogDirs PASSED
kafka.api.AdminClientIntegrationTest > testInvalidAlterConfigs STARTED
kafka.api.AdminClientIntegrationTest > testInvalidAlterConfigs PASSED
kafka.api.AdminClientIntegrationTest > testClose STARTED
kafka.api.AdminClientIntegrationTest > testClose PASSED
kafka.api.AdminClientIntegrationTest > testMinimumRequestTimeouts STARTED
kafka.api.AdminClientIntegrationTest > testMinimumRequestTimeouts PASSED
kafka.api.AdminClientIntegrationTest > testForceClose STARTED
kafka.api.AdminClientIntegrationTest > testForceClose PASSED
kafka.api.AdminClientIntegrationTest > testListNodes STARTED
kafka.api.AdminClientIntegrationTest > testListNodes PASSED
kafka.api.AdminClientIntegrationTest > testDelayedClose STARTED
kafka.api.AdminClientIntegrationTest > testDelayedClose PASSED
kafka.api.AdminClientIntegrationTest > testCreateDeleteTopics STARTED
kafka.api.AdminClientIntegrationTest > testCreateDeleteTopics PASSED
kafka.api.AdminClientIntegrationTest > testAlterReplicaLogDirsBeforeTopicCreation STARTED
kafka.api.AdminClientIntegrationTest > testAlterReplicaLogDirsBeforeTopicCreation PASSED
kafka.api.AdminClientIntegrationTest > testDescribeLogDirs STARTED
kafka.api.AdminClientIntegrationTest > testDescribeLogDirs PASSED
kafka.api.AdminClientIntegrationTest > testAclOperations STARTED
kafka.api.AdminClientIntegrationTest > testAclOperations PASSED
kafka.api.AdminClientIntegrationTest > testDescribeCluster STARTED
kafka.api.AdminClientIntegrationTest > testDescribeCluster PASSED
kafka.api.AdminClientIntegrationTest > testCreatePartitions STARTED
kafka.api.AdminClientIntegrationTest > testCreatePartitions PASSED
kafka.api.AdminClientIntegrationTest > testDescribeNonExistingTopic STARTED
kafka.api.AdminClientIntegrationTest > testDescribeNonExistingTopic PASSED
kafka.api.AdminClientIntegrationTest > testDescribeAndAlterConfigs STARTED
kafka.api.AdminClientIntegrationTest > testDescribeAndAlterConfigs PASSED
kafka.api.AdminClientIntegrationTest > testCallInFlightTimeouts STARTED
kafka.api.AdminClientIntegrationTest > testCallInFlightTimeouts PASSED
kafka.api.UserClientIdQuotaTest > testProducerConsumerOverrideUnthrottled STARTED
kafka.api.UserClientIdQuotaTest > testProducerConsumerOverrideUnthrottled PASSED
kafka.api.UserClientIdQuotaTest > testThrottledProducerConsumer STARTED
kafka.api.UserClientIdQuotaTest > testThrottledProducerConsumer PASSED
kafka.api.UserClientIdQuotaTest > testQuotaOverrideDelete STARTED
kafka.api.UserClientIdQuotaTest > testQuotaOverrideDelete PASSED
kafka.api.UserClientIdQuotaTest > testThrottledRequest STARTED
kafka.api.UserClientIdQuotaTest > testThrottledRequest PASSED
kafka.api.SaslGssapiSslEndToEndAuthorizationTest > testTwoConsumersWithDifferentSaslCredentials STARTED
kafka.api.SaslGssapiSslEndToEndAuthorizationTest > testTwoConsumersWithDifferentSaslCredentials PASSED
kafka.api.SaslGssapiSslEndToEndAuthorizationTest > testNoConsumeWithoutDescribeAclViaSubscribe STARTED
kafka.api.SaslGssapiSslEndToEndAuthorizationTest > testNoConsumeWithoutDescribeAclViaSubscribe PASSED
kafka.api.SaslGssapiSslEndToEndAuthorizationTest > testProduceConsumeViaAssign STARTED
kafka.api.SaslGssapiSslEndToEndAuthorizationTest > testProduceConsumeViaAssign PASSED
kafka.api.SaslGssapiSslEndToEndAuthorizationTest > testNoConsumeWithDescribeAclViaAssign STARTED
kafka.api.SaslGssapiSslEndToEndAuthorizationTest > testNoConsumeWithDescribeAclViaAssign PASSED
kafka.api.SaslGssapiSslEndToEndAuthorizationTest > testNoConsumeWithDescribeAclViaSubscribe STARTED
kafka.api.SaslGssapiSslEndToEndAuthorizationTest > testNoConsumeWithDescribeAclViaSubscribe PASSED
kafka.api.SaslGssapiSslEndToEndAuthorizationTest > testNoConsumeWithoutDescribeAclViaAssign STARTED
kafka.api.SaslGssapiSslEndToEndAuthorizationTest > testNoConsumeWithoutDescribeAclViaAssign PASSED
kafka.api.SaslGssapiSslEndToEndAuthorizationTest > testNoGroupAcl STARTED
kafka.api.SaslGssapiSslEndToEndAuthorizationTest > testNoGroupAcl PASSED
kafka.api.SaslGssapiSslEndToEndAuthorizationTest > testNoProduceWithDescribeAcl STARTED
kafka.api.SaslGssapiSslEndToEndAuthorizationTest > testNoProduceWithDescribeAcl PASSED
kafka.api.SaslGssapiSslEndToEndAuthorizationTest > testProduceConsumeViaSubscribe STARTED
kafka.api.SaslGssapiSslEndToEndAuthorizationTest > testProduceConsumeViaSubscribe PASSED
kafka.api.SaslGssapiSslEndToEndAuthorizationTest > testNoProduceWithoutDescribeAcl STARTED
kafka.api.SaslGssapiSslEndToEndAuthorizationTest > testNoProduceWithoutDescribeAcl PASSED
kafka.api.GroupCoordinatorIntegrationTest > testGroupCoordinatorPropagatesOfffsetsTopicCompressionCodec STARTED
kafka.api.GroupCoordinatorIntegrationTest > testGroupCoordinatorPropagatesOfffsetsTopicCompressionCodec PASSED
kafka.api.SslConsumerTest > testCoordinatorFailover STARTED
kafka.api.SslConsumerTest > testCoordinatorFailover PASSED
kafka.api.SslConsumerTest > testSimpleConsumption STARTED
kafka.api.SslConsumerTest > testSimpleConsumption PASSED
kafka.api.SaslClientsWithInvalidCredentialsTest > testTransactionalProducerWithAuthenticationFailure STARTED
kafka.api.SaslClientsWithInvalidCredentialsTest > testTransactionalProducerWithAuthenticationFailure PASSED
kafka.api.SaslClientsWithInvalidCredentialsTest > testManualAssignmentConsumerWithAuthenticationFailure STARTED
kafka.api.SaslClientsWithInvalidCredentialsTest > testManualAssignmentConsumerWithAuthenticationFailure PASSED
kafka.api.SaslClientsWithInvalidCredentialsTest > testProducerWithAuthenticationFailure STARTED
kafka.api.SaslClientsWithInvalidCredentialsTest > testProducerWithAuthenticationFailure PASSED
kafka.api.SaslClientsWithInvalidCredentialsTest > testConsumerGroupServiceWithAuthenticationFailure STARTED
kafka.api.SaslClientsWithInvalidCredentialsTest > testConsumerGroupServiceWithAuthenticationFailure PASSED
kafka.api.SaslClientsWithInvalidCredentialsTest > testManualAssignmentConsumerWithAutoCommitDisabledWithAuthenticationFailure STARTED
kafka.api.SaslClientsWithInvalidCredentialsTest > testManualAssignmentConsumerWithAutoCommitDisabledWithAuthenticationFailure PASSED
kafka.api.SaslClientsWithInvalidCredentialsTest > testKafkaAdminClientWithAuthenticationFailure STARTED
kafka.api.SaslClientsWithInvalidCredentialsTest > testKafkaAdminClientWithAuthenticationFailure PASSED
kafka.api.SaslClientsWithInvalidCredentialsTest > testConsumerWithAuthenticationFailure STARTED
kafka.api.SaslClientsWithInvalidCredentialsTest > testConsumerWithAuthenticationFailure PASSED
kafka.api.PlaintextConsumerTest > testEarliestOrLatestOffsets STARTED
kafka.api.PlaintextConsumerTest > testEarliestOrLatestOffsets PASSED
kafka.api.PlaintextConsumerTest > testPartitionsForAutoCreate STARTED
kafka.api.PlaintextConsumerTest > testPartitionsForAutoCreate PASSED
kafka.api.PlaintextConsumerTest > testShrinkingTopicSubscriptions STARTED
kafka.api.PlaintextConsumerTest > testShrinkingTopicSubscriptions PASSED
kafka.api.PlaintextConsumerTest > testMaxPollIntervalMs STARTED
kafka.api.PlaintextConsumerTest > testMaxPollIntervalMs PASSED
kafka.api.PlaintextConsumerTest > testOffsetsForTimes STARTED
kafka.api.PlaintextConsumerTest > testOffsetsForTimes PASSED
kafka.api.PlaintextConsumerTest > testSubsequentPatternSubscription STARTED
kafka.api.PlaintextConsumerTest > testSubsequentPatternSubscription PASSED
kafka.api.PlaintextConsumerTest > testConsumeMessagesWithCreateTime STARTED
kafka.api.PlaintextConsumerTest > testConsumeMessagesWithCreateTime PASSED
kafka.api.PlaintextConsumerTest > testAsyncCommit STARTED
kafka.api.PlaintextConsumerTest > testAsyncCommit PASSED
kafka.api.PlaintextConsumerTest > testLowMaxFetchSizeForRequestAndPartition STARTED
ERROR: No tool found matching GRADLE_4_8_1_HOME
ERROR: No tool found matching GRADLE_4_8_1_HOME
ERROR: No tool found matching GRADLE_4_8_1_HOME
ERROR: No tool found matching GRADLE_4_8_1_HOME
Build timed out (after 240 minutes). Marking the build as failed.
Build was aborted
[FINDBUGS] Collecting findbugs analysis files...
ERROR: No tool found matching GRADLE_4_8_1_HOME
[FINDBUGS] Searching for all files in <https://builds.apache.org/job/kafka-1.0-jdk8/ws/> that match the pattern **/build/reports/findbugs/*.xml
[FINDBUGS] Parsing 1 file in <https://builds.apache.org/job/kafka-1.0-jdk8/ws/>
[FINDBUGS] Successfully parsed file <https://builds.apache.org/job/kafka-1.0-jdk8/ws/core/build/reports/findbugs/main.xml> with 0 unique warnings and 0 duplicates.
ERROR: No tool found matching GRADLE_4_8_1_HOME
No credentials specified
ERROR: No tool found matching GRADLE_4_8_1_HOME
<Git Blamer> Using GitBlamer to create author and commit information for all warnings.
kafka.api.PlaintextConsumerTest > testLowMaxFetchSizeForRequestAndPartition SKIPPED
> Task :kafka-1.0-jdk8:core:test FAILED
<Git Blamer> GIT_COMMIT=cc126ceb1567fbc61a3076248d3d94289d685ac4, workspace=<https://builds.apache.org/job/kafka-1.0-jdk8/ws/>
[FINDBUGS] Computing warning deltas based on reference build #287
Recording test results
ERROR: No tool found matching GRADLE_4_8_1_HOME
> Task :test_core_2_11 FAILED
FAILURE: Build failed with an exception.
* What went wrong:
Execution failed for task ':kafka-1.0-jdk8:core:test'.
> Process 'Gradle Test Executor 3' finished with non-zero exit value 143
This problem might be caused by incorrect test process configuration.
Please refer to the test execution section in the user guide at https://docs.gradle.org/4.10.3/userguide/java_plugin.html#sec:test_execution
* Try:
Run with --stacktrace option to get the stack trace. Run with --info or --debug option to get more log output. Run with --scan to get full insights.
* Get more help at https://help.gradle.org
BUILD FAILED in 3h 59m 59s
20 actionable tasks: 2 executed, 18 up-to-date
FAILURE: Build failed with an exception.
* What went wrong:
Process 'Gradle Worker Daemon 1' finished with non-zero exit value 143
* Try:
Run with --stacktrace option to get the stack trace. Run with --info or --debug option to get more log output. Run with --scan to get full insights.
* Get more help at https://help.gradle.org
BUILD FAILED in 3h 59m 59s
ERROR: Step ?Publish JUnit test result report? failed: No test report files were found. Configuration error?
ERROR: No tool found matching GRADLE_4_8_1_HOME
Not sending mail to unregistered user bill@confluent.io
Jenkins build is back to normal : kafka-1.0-jdk8 #290
Posted by Apache Jenkins Server <je...@builds.apache.org>.
See <https://builds.apache.org/job/kafka-1.0-jdk8/290/display/redirect?page=changes>
Build failed in Jenkins: kafka-1.0-jdk8 #289
Posted by Apache Jenkins Server <je...@builds.apache.org>.
See <https://builds.apache.org/job/kafka-1.0-jdk8/289/display/redirect?page=changes>
Changes:
[rhauch] KAFKA-9601: Stop logging raw connector config values (#8165)
------------------------------------------
[...truncated 376.13 KB...]
kafka.coordinator.transaction.TransactionMarkerRequestCompletionHandlerTest > shouldThrowIllegalStateExceptionIfErrorCodeNotAvailableForPid PASSED
kafka.coordinator.transaction.TransactionLogTest > shouldReadWriteMessages STARTED
kafka.coordinator.transaction.TransactionLogTest > shouldReadWriteMessages PASSED
kafka.coordinator.transaction.TransactionLogTest > shouldThrowExceptionWriteInvalidTxn STARTED
kafka.coordinator.transaction.TransactionLogTest > shouldThrowExceptionWriteInvalidTxn PASSED
kafka.network.SocketServerTest > testGracefulClose STARTED
kafka.network.SocketServerTest > testGracefulClose PASSED
kafka.network.SocketServerTest > controlThrowable STARTED
kafka.network.SocketServerTest > controlThrowable PASSED
kafka.network.SocketServerTest > testRequestMetricsAfterStop STARTED
kafka.network.SocketServerTest > testRequestMetricsAfterStop PASSED
kafka.network.SocketServerTest > testConnectionIdReuse STARTED
kafka.network.SocketServerTest > testConnectionIdReuse PASSED
kafka.network.SocketServerTest > testClientDisconnectionUpdatesRequestMetrics STARTED
kafka.network.SocketServerTest > testClientDisconnectionUpdatesRequestMetrics PASSED
kafka.network.SocketServerTest > testProcessorMetricsTags STARTED
kafka.network.SocketServerTest > testProcessorMetricsTags PASSED
kafka.network.SocketServerTest > testMaxConnectionsPerIp STARTED
kafka.network.SocketServerTest > testMaxConnectionsPerIp PASSED
kafka.network.SocketServerTest > testConnectionId STARTED
kafka.network.SocketServerTest > testConnectionId PASSED
kafka.network.SocketServerTest > testBrokerSendAfterChannelClosedUpdatesRequestMetrics STARTED
kafka.network.SocketServerTest > testBrokerSendAfterChannelClosedUpdatesRequestMetrics PASSED
kafka.network.SocketServerTest > testNoOpAction STARTED
kafka.network.SocketServerTest > testNoOpAction PASSED
kafka.network.SocketServerTest > simpleRequest STARTED
kafka.network.SocketServerTest > simpleRequest PASSED
kafka.network.SocketServerTest > closingChannelException STARTED
kafka.network.SocketServerTest > closingChannelException PASSED
kafka.network.SocketServerTest > testIdleConnection STARTED
kafka.network.SocketServerTest > testIdleConnection PASSED
kafka.network.SocketServerTest > testClientDisconnectionWithStagedReceivesFullyProcessed STARTED
kafka.network.SocketServerTest > testClientDisconnectionWithStagedReceivesFullyProcessed PASSED
kafka.network.SocketServerTest > testMetricCollectionAfterShutdown STARTED
kafka.network.SocketServerTest > testMetricCollectionAfterShutdown PASSED
kafka.network.SocketServerTest > testSessionPrincipal STARTED
kafka.network.SocketServerTest > testSessionPrincipal PASSED
kafka.network.SocketServerTest > configureNewConnectionException STARTED
kafka.network.SocketServerTest > configureNewConnectionException PASSED
kafka.network.SocketServerTest > testMaxConnectionsPerIpOverrides STARTED
kafka.network.SocketServerTest > testMaxConnectionsPerIpOverrides PASSED
kafka.network.SocketServerTest > processNewResponseException STARTED
kafka.network.SocketServerTest > processNewResponseException PASSED
kafka.network.SocketServerTest > processCompletedSendException STARTED
kafka.network.SocketServerTest > processCompletedSendException PASSED
kafka.network.SocketServerTest > processDisconnectedException STARTED
kafka.network.SocketServerTest > processDisconnectedException PASSED
kafka.network.SocketServerTest > sendCancelledKeyException STARTED
kafka.network.SocketServerTest > sendCancelledKeyException PASSED
kafka.network.SocketServerTest > processCompletedReceiveException STARTED
kafka.network.SocketServerTest > processCompletedReceiveException PASSED
kafka.network.SocketServerTest > testSocketsCloseOnShutdown STARTED
kafka.network.SocketServerTest > testSocketsCloseOnShutdown PASSED
kafka.network.SocketServerTest > pollException STARTED
kafka.network.SocketServerTest > pollException PASSED
kafka.network.SocketServerTest > testSslSocketServer STARTED
kafka.network.SocketServerTest > testSslSocketServer PASSED
kafka.network.SocketServerTest > tooBigRequestIsRejected STARTED
kafka.network.SocketServerTest > tooBigRequestIsRejected PASSED
kafka.metrics.KafkaTimerTest > testKafkaTimer STARTED
kafka.metrics.KafkaTimerTest > testKafkaTimer PASSED
kafka.metrics.MetricsTest > testMetricsReporterAfterDeletingTopic STARTED
kafka.metrics.MetricsTest > testMetricsReporterAfterDeletingTopic PASSED
kafka.metrics.MetricsTest > testBrokerTopicMetricsUnregisteredAfterDeletingTopic STARTED
kafka.metrics.MetricsTest > testBrokerTopicMetricsUnregisteredAfterDeletingTopic PASSED
kafka.metrics.MetricsTest > testClusterIdMetric STARTED
kafka.metrics.MetricsTest > testClusterIdMetric PASSED
kafka.metrics.MetricsTest > testControllerMetrics STARTED
kafka.metrics.MetricsTest > testControllerMetrics PASSED
kafka.metrics.MetricsTest > testWindowsStyleTagNames STARTED
kafka.metrics.MetricsTest > testWindowsStyleTagNames PASSED
kafka.metrics.MetricsTest > testMetricsLeak STARTED
kafka.metrics.MetricsTest > testMetricsLeak PASSED
kafka.metrics.MetricsTest > testBrokerTopicMetricsBytesInOut STARTED
kafka.metrics.MetricsTest > testBrokerTopicMetricsBytesInOut PASSED
unit.kafka.server.KafkaApisTest > shouldRespondWithUnsupportedForMessageFormatOnHandleWriteTxnMarkersWhenMagicLowerThanRequired STARTED
unit.kafka.server.KafkaApisTest > shouldRespondWithUnsupportedForMessageFormatOnHandleWriteTxnMarkersWhenMagicLowerThanRequired PASSED
unit.kafka.server.KafkaApisTest > shouldThrowUnsupportedVersionExceptionOnHandleTxnOffsetCommitRequestWhenInterBrokerProtocolNotSupported STARTED
unit.kafka.server.KafkaApisTest > shouldThrowUnsupportedVersionExceptionOnHandleTxnOffsetCommitRequestWhenInterBrokerProtocolNotSupported PASSED
unit.kafka.server.KafkaApisTest > shouldThrowUnsupportedVersionExceptionOnHandleAddPartitionsToTxnRequestWhenInterBrokerProtocolNotSupported STARTED
unit.kafka.server.KafkaApisTest > shouldThrowUnsupportedVersionExceptionOnHandleAddPartitionsToTxnRequestWhenInterBrokerProtocolNotSupported PASSED
unit.kafka.server.KafkaApisTest > testReadUncommittedConsumerListOffsetLatest STARTED
unit.kafka.server.KafkaApisTest > testReadUncommittedConsumerListOffsetLatest PASSED
unit.kafka.server.KafkaApisTest > shouldAppendToLogOnWriteTxnMarkersWhenCorrectMagicVersion STARTED
unit.kafka.server.KafkaApisTest > shouldAppendToLogOnWriteTxnMarkersWhenCorrectMagicVersion PASSED
unit.kafka.server.KafkaApisTest > shouldThrowUnsupportedVersionExceptionOnHandleWriteTxnMarkersRequestWhenInterBrokerProtocolNotSupported STARTED
unit.kafka.server.KafkaApisTest > shouldThrowUnsupportedVersionExceptionOnHandleWriteTxnMarkersRequestWhenInterBrokerProtocolNotSupported PASSED
unit.kafka.server.KafkaApisTest > shouldRespondWithUnknownTopicWhenPartitionIsNotHosted STARTED
unit.kafka.server.KafkaApisTest > shouldRespondWithUnknownTopicWhenPartitionIsNotHosted PASSED
unit.kafka.server.KafkaApisTest > testReadCommittedConsumerListOffsetEarliestOffsetEqualsLastStableOffset STARTED
unit.kafka.server.KafkaApisTest > testReadCommittedConsumerListOffsetEarliestOffsetEqualsLastStableOffset PASSED
unit.kafka.server.KafkaApisTest > testReadCommittedConsumerListOffsetLatest STARTED
unit.kafka.server.KafkaApisTest > testReadCommittedConsumerListOffsetLatest PASSED
unit.kafka.server.KafkaApisTest > testReadCommittedConsumerListOffsetLimitedAtLastStableOffset STARTED
unit.kafka.server.KafkaApisTest > testReadCommittedConsumerListOffsetLimitedAtLastStableOffset PASSED
unit.kafka.server.KafkaApisTest > testReadUncommittedConsumerListOffsetEarliestOffsetEqualsHighWatermark STARTED
unit.kafka.server.KafkaApisTest > testReadUncommittedConsumerListOffsetEarliestOffsetEqualsHighWatermark PASSED
unit.kafka.server.KafkaApisTest > testReadUncommittedConsumerListOffsetLimitedAtHighWatermark STARTED
unit.kafka.server.KafkaApisTest > testReadUncommittedConsumerListOffsetLimitedAtHighWatermark PASSED
unit.kafka.server.KafkaApisTest > shouldThrowUnsupportedVersionExceptionOnHandleAddOffsetToTxnRequestWhenInterBrokerProtocolNotSupported STARTED
unit.kafka.server.KafkaApisTest > shouldThrowUnsupportedVersionExceptionOnHandleAddOffsetToTxnRequestWhenInterBrokerProtocolNotSupported PASSED
unit.kafka.server.KafkaApisTest > shouldRespondWithUnsupportedMessageFormatForBadPartitionAndNoErrorsForGoodPartition STARTED
unit.kafka.server.KafkaApisTest > shouldRespondWithUnsupportedMessageFormatForBadPartitionAndNoErrorsForGoodPartition PASSED
unit.kafka.server.KafkaApisTest > shouldThrowUnsupportedVersionExceptionOnHandleEndTxnRequestWhenInterBrokerProtocolNotSupported STARTED
unit.kafka.server.KafkaApisTest > shouldThrowUnsupportedVersionExceptionOnHandleEndTxnRequestWhenInterBrokerProtocolNotSupported PASSED
unit.kafka.server.KafkaApisTest > shouldRespondWithUnknownTopicOrPartitionForBadPartitionAndNoErrorsForGoodPartition STARTED
unit.kafka.server.KafkaApisTest > shouldRespondWithUnknownTopicOrPartitionForBadPartitionAndNoErrorsForGoodPartition PASSED
1654 tests completed, 1 failed, 4 skipped
> Task :kafka-1.0-jdk8:core:test FAILED
> Task :test_core_2_11 FAILED
FAILURE: Build failed with an exception.
* What went wrong:
Execution failed for task ':kafka-1.0-jdk8:core:test'.
> There were failing tests. See the report at: file://<https://builds.apache.org/job/kafka-1.0-jdk8/ws/core/build/reports/tests/test/index.html>
* Try:
Run with --stacktrace option to get the stack trace. Run with --info or --debug option to get more log output. Run with --scan to get full insights.
* Get more help at https://help.gradle.org
BUILD FAILED in 1h 31m 28s
20 actionable tasks: 2 executed, 18 up-to-date
Build step 'Execute shell' marked build as failure
[FINDBUGS] Collecting findbugs analysis files...
ERROR: No tool found matching GRADLE_4_8_1_HOME
[FINDBUGS] Searching for all files in <https://builds.apache.org/job/kafka-1.0-jdk8/ws/> that match the pattern **/build/reports/findbugs/*.xml
[FINDBUGS] Parsing 1 file in <https://builds.apache.org/job/kafka-1.0-jdk8/ws/>
[FINDBUGS] Successfully parsed file <https://builds.apache.org/job/kafka-1.0-jdk8/ws/core/build/reports/findbugs/main.xml> with 0 unique warnings and 0 duplicates.
ERROR: No tool found matching GRADLE_4_8_1_HOME
No credentials specified
ERROR: No tool found matching GRADLE_4_8_1_HOME
<Git Blamer> Using GitBlamer to create author and commit information for all warnings.
<Git Blamer> GIT_COMMIT=614cc989f0eb722b2b93ef59c713113c2236d7ec, workspace=<https://builds.apache.org/job/kafka-1.0-jdk8/ws/>
[FINDBUGS] Computing warning deltas based on reference build #287
Recording test results
ERROR: No tool found matching GRADLE_4_8_1_HOME
ERROR: No tool found matching GRADLE_4_8_1_HOME
Not sending mail to unregistered user bill@confluent.io