See <https://builds.apache.org/job/Geode-nightly-flaky/153/display/redirect?page=changes>
Changes:
[upthewaterspout] GEODE-3568: User can set a LuceneSerializer through the Java API
[upthewaterspout] GEODE-3240: Refactor LuceneSerializer to have only a toDocuments method
[upthewaterspout] GEODE-3240: Moving LuceneSerializer to the public package
[upthewaterspout] GEODE-3240: Start of public API for setLuceneSerializer
[gzhou] GEODE-3240: add implementation for java api of set serializer
[gzhou] GEODE-3569: save the serializer class name into
[lhughesgodfrey] GEODE-3241: User can set a LuceneSerializer through XML
[gzhou] GEODE-3606: add index as parameter for toDocuments()
[gzhou] GEODE-3273: catch serializer's exception for current event,
[gzhou] GEODE-3273: If serializer returns empty, should update index.
[gzhou] GEODE-3275: test LuceneSerializer should not cause PDX values to be
[dsmith] GEODE-3242, GEODE-3243: Add gfsh support for LuceneSerializer
[dsmith] GEODE-3242: Adding lucene serializer to describe command
[gzhou] GEODE-3244: provide a build in LuceneSerializer that flattens objects
[jstewart] GEODE-3827: SecurityManager does not leak between separate
[bschuchardt] GEODE-3846 create a 1.3.0 test set in geode-old-versions
[kohlmu-pivotal] GEODE-3774: moved service loader initialization around to avoid
[kohlmu-pivotal] GEODE-3774: Amended TCPServer code to store the loader and not the
[kohlmu-pivotal] GEODE-3774: Amended ProtobufProtocolService.java to create statistics
[kohlmu-pivotal] GEODE-2542: Push DH keys when locator becomes coordinator
[github] GEODE-3798: Refactor backup script code (#932)
[dsmith] GEODE-3784: Removing old function timeout test and adding a better one
[gzhou] GEODE-3727: FlatFormatSerializer should support collection
[github] GEODE-2563: fix flaky test (#942)
[github] GEODE-3819: correctly set the result status code when building the re…
[khowe] GEODE-3299: refactor functions to get Cache from FunctionContext
[khowe] GEODE-3299: Remove unneeded constructor
[dbarnes] GEODE-2405 Update docs with changes to export cluster-configuration
[bschuchardt] GEODE-3841 CI Failure :
[dsmith] Parameterizing LuceneSerializer with a type
[gosullivan] GEODE-3614 remove JUnit3CacheTestCase, cleanup JUnit4CacheTestCase
[nabarunnag] GEODE-3708: Added a separate iterator for MemoryIndexStore which doesn't
[github] GEODE-3857: Pulse login fails after second login (#939)
[github] GEODE-3538 Update doc section Running Geode Server Processes (#945)
[github] GEODE-3701 Emphasize performance penalty of hash indexes in docs (#949)
[github] GEODE-3026: Removed the AsyncEventQueue for the Lucene index if the
------------------------------------------
[...truncated 110.40 KB...]
Download https://repo1.maven.org/maven2/org/springframework/hateoas/spring-hateoas/0.23.0.RELEASE/spring-hateoas-0.23.0.RELEASE.jar
Download https://repo1.maven.org/maven2/com/fasterxml/jackson/module/jackson-module-paranamer/2.8.6/jackson-module-paranamer-2.8.6.jar
Download https://repo1.maven.org/maven2/io/swagger/swagger-annotations/1.5.10/swagger-annotations-1.5.10.jar
Download https://repo1.maven.org/maven2/io/swagger/swagger-models/1.5.10/swagger-models-1.5.10.jar
Download https://repo1.maven.org/maven2/io/springfox/springfox-spi/2.6.1/springfox-spi-2.6.1.jar
Download https://repo1.maven.org/maven2/io/springfox/springfox-schema/2.6.1/springfox-schema-2.6.1.jar
Download https://repo1.maven.org/maven2/io/springfox/springfox-swagger-common/2.6.1/springfox-swagger-common-2.6.1.jar
Download https://repo1.maven.org/maven2/io/springfox/springfox-spring-web/2.6.1/springfox-spring-web-2.6.1.jar
Download https://repo1.maven.org/maven2/org/springframework/plugin/spring-plugin-core/1.2.0.RELEASE/spring-plugin-core-1.2.0.RELEASE.jar
Download https://repo1.maven.org/maven2/org/springframework/plugin/spring-plugin-metadata/1.2.0.RELEASE/spring-plugin-metadata-1.2.0.RELEASE.jar
Download https://repo1.maven.org/maven2/org/mapstruct/mapstruct/1.0.0.Final/mapstruct-1.0.0.Final.jar
Download https://repo1.maven.org/maven2/com/thoughtworks/paranamer/paranamer/2.8/paranamer-2.8.jar
Download https://repo1.maven.org/maven2/io/springfox/springfox-core/2.6.1/springfox-core-2.6.1.jar
Note: Some input files use unchecked or unsafe operations.
Note: Recompile with -Xlint:unchecked for details.
:geode-web-api:processResources
:geode-web-api:classes
:geode-assembly:docs<https://builds.apache.org/job/Geode-nightly-flaky/ws/geode-lucene/src/main/java/org/apache/geode/cache/lucene/LuceneSerializer.java>:44: warning - Tag @link: reference not found: Field.Store#NO
<https://builds.apache.org/job/Geode-nightly-flaky/ws/geode-lucene/src/main/java/org/apache/geode/cache/lucene/LuceneSerializer.java>:44: warning - Tag @link: reference not found: Field.Store#NO
<https://builds.apache.org/job/Geode-nightly-flaky/ws/geode-lucene/src/main/java/org/apache/geode/cache/lucene/LuceneSerializer.java>:44: warning - Tag @link: reference not found: Field.Store#NO
3 warnings
:geode-assembly:gfshDepsJar
:geode-common:javadocJar
:geode-common:sourcesJar
:geode-common:signArchives SKIPPED
:geode-core:javadocJar
:geode-core:raJar
:geode-core:jcaJar
:geode-core:sourcesJar
:geode-core:signArchives SKIPPED
:geode-core:webJar
:geode-cq:jar
:geode-cq:javadoc
:geode-cq:javadocJar
:geode-cq:sourcesJar
:geode-cq:signArchives SKIPPED
:geode-json:javadocJar
:geode-json:sourcesJar
:geode-json:signArchives SKIPPED
:geode-lucene:jar
:geode-lucene:javadoc<https://builds.apache.org/job/Geode-nightly-flaky/ws/geode-lucene/src/main/java/org/apache/geode/cache/lucene/LuceneSerializer.java>:44: warning - Tag @link: reference not found: Field.Store#NO
<https://builds.apache.org/job/Geode-nightly-flaky/ws/geode-lucene/src/main/java/org/apache/geode/cache/lucene/LuceneSerializer.java>:44: warning - Tag @link: reference not found: Field.Store#NO
<https://builds.apache.org/job/Geode-nightly-flaky/ws/geode-lucene/src/main/java/org/apache/geode/cache/lucene/LuceneSerializer.java>:44: warning - Tag @link: reference not found: Field.Store#NO
<https://builds.apache.org/job/Geode-nightly-flaky/ws/geode-lucene/src/main/java/org/apache/geode/cache/lucene/LuceneSerializer.java>:44: warning - Tag @link: reference not found: Field.Store#NO
<https://builds.apache.org/job/Geode-nightly-flaky/ws/geode-lucene/src/main/java/org/apache/geode/cache/lucene/LuceneSerializer.java>:44: warning - Tag @link: reference not found: Field.Store#NO
<https://builds.apache.org/job/Geode-nightly-flaky/ws/geode-lucene/src/main/java/org/apache/geode/cache/lucene/LuceneSerializer.java>:44: warning - Tag @link: reference not found: Field.Store#NO
<https://builds.apache.org/job/Geode-nightly-flaky/ws/geode-lucene/src/main/java/org/apache/geode/cache/lucene/LuceneSerializer.java>:44: warning - Tag @link: reference not found: Field.Store#NO
7 warnings
:geode-lucene:javadocJar
:geode-lucene:sourcesJar
:geode-lucene:signArchives SKIPPED
:geode-old-client-support:jar
:geode-old-client-support:javadoc
:geode-old-client-support:javadocJar
:geode-old-client-support:sourcesJar
:geode-old-client-support:signArchives SKIPPED
:geode-protobuf:jar
:geode-protobuf:javadoc
:geode-protobuf:javadocJar
:geode-protobuf:sourcesJar
:geode-protobuf:signArchives SKIPPED
:geode-pulse:javadoc
:geode-pulse:javadocJar
:geode-pulse:sourcesJar
:geode-pulse:war
:geode-pulse:signArchives SKIPPED
:geode-rebalancer:jar
:geode-rebalancer:javadoc
:geode-rebalancer:javadocJar
:geode-rebalancer:sourcesJar
:geode-rebalancer:signArchives SKIPPED
:geode-wan:jar
:geode-wan:javadoc
:geode-wan:javadocJar
:geode-wan:sourcesJar
:geode-wan:signArchives SKIPPED
:geode-web:javadoc NO-SOURCE
:geode-web:javadocJar
:geode-web:sourcesJar
:geode-web:war
:geode-web:signArchives SKIPPED
:geode-web-api:javadoc
:geode-web-api:javadocJar
:geode-web-api:sourcesJar
:geode-web-api:war
:geode-web-api:signArchives SKIPPED
:geode-assembly:installDist
:geode-pulse:jar
:geode-assembly:compileTestJava
Download https://repo1.maven.org/maven2/org/codehaus/cargo/cargo-core-uberjar/1.6.3/cargo-core-uberjar-1.6.3.pom
Download https://repo1.maven.org/maven2/org/codehaus/cargo/cargo-core/1.6.3/cargo-core-1.6.3.pom
Download https://repo1.maven.org/maven2/org/codehaus/cargo/codehaus-cargo/1.6.3/codehaus-cargo-1.6.3.pom
Download https://repo1.maven.org/maven2/org/codehaus/cargo/cargo-core-uberjar/1.6.3/cargo-core-uberjar-1.6.3.jar
Note: Some input files use or override a deprecated API.
Note: Recompile with -Xlint:deprecation for details.
Note: Some input files use unchecked or unsafe operations.
Note: Recompile with -Xlint:unchecked for details.
:geode-assembly:processTestResources
:geode-assembly:testClasses
:geode-assembly:flakyTest
:geode-benchmarks:compileTestJava NO-SOURCE
:geode-benchmarks:processTestResources NO-SOURCE
:geode-benchmarks:testClasses UP-TO-DATE
:geode-benchmarks:flakyTest NO-SOURCE
:geode-common:compileTestJava
:geode-common:processTestResources NO-SOURCE
:geode-common:testClasses
:geode-common:flakyTest
:geode-concurrency-test:generateJpfProperties
:geode-concurrency-test:compileTestJava NO-SOURCE
:geode-concurrency-test:processTestResources NO-SOURCE
:geode-concurrency-test:testClasses UP-TO-DATE
:geode-concurrency-test:flakyTest NO-SOURCE
:geode-core:flakyTest
org.apache.geode.management.RegionManagementDUnitTest > testNavigationAPIS FAILED
org.apache.geode.test.dunit.RMIException: While invoking org.apache.geode.test.dunit.NamedRunnable.run in VM 0 running on Host asf914.gq1.ygridcore.net with 4 VMs
at org.apache.geode.test.dunit.VM.invoke(VM.java:393)
at org.apache.geode.test.dunit.VM.invoke(VM.java:363)
at org.apache.geode.test.dunit.VM.invoke(VM.java:296)
at org.apache.geode.management.RegionManagementDUnitTest.verifyNavigationApis(RegionManagementDUnitTest.java:406)
at org.apache.geode.management.RegionManagementDUnitTest.testNavigationAPIS(RegionManagementDUnitTest.java:267)
Caused by:
org.awaitility.core.ConditionTimeoutException: Condition defined as a lambda expression in org.apache.geode.management.RegionManagementDUnitTest that uses org.apache.geode.management.DistributedSystemMXBean, org.apache.geode.management.DistributedSystemMXBeanint expected:<[4]> but was:<[5]> within 2 minutes.
at org.awaitility.core.ConditionAwaiter.await(ConditionAwaiter.java:104)
at org.awaitility.core.AssertionCondition.await(AssertionCondition.java:117)
at org.awaitility.core.AssertionCondition.await(AssertionCondition.java:32)
at org.awaitility.core.ConditionFactory.until(ConditionFactory.java:809)
at org.awaitility.core.ConditionFactory.until(ConditionFactory.java:648)
at org.apache.geode.management.RegionManagementDUnitTest.awaitMemberCount(RegionManagementDUnitTest.java:1049)
at org.apache.geode.management.RegionManagementDUnitTest.lambda$verifyNavigationApis$8ec4a763$1(RegionManagementDUnitTest.java:410)
277 tests completed, 1 failed, 8 skipped
:geode-core:flakyTest FAILED
:geode-cq:compileTestJavaNote: Some input files use or override a deprecated API.
Note: Recompile with -Xlint:deprecation for details.
Note: Some input files use unchecked or unsafe operations.
Note: Recompile with -Xlint:unchecked for details.
:geode-cq:processTestResources
:geode-cq:testClasses
:geode-cq:flakyTest
:geode-json:compileTestJava NO-SOURCE
:geode-json:processTestResources
:geode-json:testClasses
:geode-json:flakyTest NO-SOURCE
:geode-junit:compileTestJavaNote: <https://builds.apache.org/job/Geode-nightly-flaky/ws/geode-junit/src/test/java/org/apache/geode/test/compiler/JarBuilderTest.java> uses or overrides a deprecated API.
Note: Recompile with -Xlint:deprecation for details.
Note: <https://builds.apache.org/job/Geode-nightly-flaky/ws/geode-junit/src/test/java/org/apache/geode/test/compiler/ClassNameExtractorTest.java> uses unchecked or unsafe operations.
Note: Recompile with -Xlint:unchecked for details.
:geode-junit:processTestResources
:geode-junit:testClasses
:geode-junit:flakyTest
:geode-lucene:compileTestJava
Download https://repo1.maven.org/maven2/org/apache/lucene/lucene-test-framework/6.4.1/lucene-test-framework-6.4.1.pom
Download https://repo1.maven.org/maven2/org/apache/lucene/lucene-codecs/6.4.1/lucene-codecs-6.4.1.pom
Download https://repo1.maven.org/maven2/com/carrotsearch/randomizedtesting/randomizedtesting-runner/2.4.0/randomizedtesting-runner-2.4.0.pom
Download https://repo1.maven.org/maven2/com/carrotsearch/randomizedtesting/randomizedtesting-parent/2.4.0/randomizedtesting-parent-2.4.0.pom
Download https://repo1.maven.org/maven2/org/apache/lucene/lucene-test-framework/6.4.1/lucene-test-framework-6.4.1.jar
Download https://repo1.maven.org/maven2/org/apache/lucene/lucene-codecs/6.4.1/lucene-codecs-6.4.1.jar
Download https://repo1.maven.org/maven2/com/carrotsearch/randomizedtesting/randomizedtesting-runner/2.4.0/randomizedtesting-runner-2.4.0.jar
Note: Some input files use or override a deprecated API.
Note: Recompile with -Xlint:deprecation for details.
Note: Some input files use unchecked or unsafe operations.
Note: Recompile with -Xlint:unchecked for details.
:geode-lucene:processTestResources
:geode-lucene:testClasses
:geode-lucene:flakyTest
:geode-old-client-support:compileTestJavaNote: <https://builds.apache.org/job/Geode-nightly-flaky/ws/geode-old-client-support/src/test/java/com/gemstone/gemfire/cache/execute/FunctionExceptionTest.java> uses or overrides a deprecated API.
Note: Recompile with -Xlint:deprecation for details.
:geode-old-client-support:processTestResources NO-SOURCE
:geode-old-client-support:testClasses
:geode-old-client-support:flakyTest
:geode-old-versions:compileTestJava NO-SOURCE
:geode-old-versions:processTestResources NO-SOURCE
:geode-old-versions:testClasses UP-TO-DATE
:geode-old-versions:flakyTest NO-SOURCE
:geode-protobuf:extractIncludeTestProto
Download https://repo1.maven.org/maven2/org/powermock/powermock-api-mockito/1.7.1/powermock-api-mockito-1.7.1.pom
Download https://repo1.maven.org/maven2/org/powermock/powermock-api-mockito/1.7.1/powermock-api-mockito-1.7.1.jar
:geode-protobuf:extractTestProto
:geode-protobuf:generateTestProto NO-SOURCE
:geode-protobuf:compileTestJavaNote: Some input files use or override a deprecated API.
Note: Recompile with -Xlint:deprecation for details.
Note: Some input files use unchecked or unsafe operations.
Note: Recompile with -Xlint:unchecked for details.
:geode-protobuf:processTestResources
:geode-protobuf:testClasses
:geode-protobuf:flakyTest
:geode-pulse:compileTestJava
Download https://repo1.maven.org/maven2/com/codeborne/phantomjsdriver/1.3.0/phantomjsdriver-1.3.0.pom
Download https://repo1.maven.org/maven2/com/codeborne/phantomjsdriver/1.3.0/phantomjsdriver-1.3.0.jar
Download https://repo1.maven.org/maven2/org/seleniumhq/selenium/selenium-api/3.0.1/selenium-api-3.0.1.jar
Download https://repo1.maven.org/maven2/org/seleniumhq/selenium/selenium-remote-driver/3.0.1/selenium-remote-driver-3.0.1.jar
Download https://repo1.maven.org/maven2/org/seleniumhq/selenium/selenium-support/3.0.1/selenium-support-3.0.1.jar
Note: Some input files use or override a deprecated API.
Note: Recompile with -Xlint:deprecation for details.
Note: <https://builds.apache.org/job/Geode-nightly-flaky/ws/geode-pulse/src/test/java/org/apache/geode/tools/pulse/controllers/PulseControllerJUnitTest.java> uses unchecked or unsafe operations.
Note: Recompile with -Xlint:unchecked for details.
:geode-pulse:processTestResources
:geode-pulse:testClasses
:geode-pulse:flakyTest
:geode-rebalancer:compileTestJava
:geode-rebalancer:processTestResources NO-SOURCE
:geode-rebalancer:testClasses
:geode-rebalancer:flakyTest
:geode-wan:compileTestJavaNote: Some input files use or override a deprecated API.
Note: Recompile with -Xlint:deprecation for details.
Note: Some input files use unchecked or unsafe operations.
Note: Recompile with -Xlint:unchecked for details.
:geode-wan:processTestResources
:geode-wan:testClasses
:geode-wan:flakyTest
:geode-web:compileTestJavaNote: Some input files use or override a deprecated API.
Note: Recompile with -Xlint:deprecation for details.
:geode-web:processTestResources NO-SOURCE
:geode-web:testClasses
:geode-web:flakyTest
:geode-web-api:compileTestJava
:geode-web-api:processTestResources NO-SOURCE
:geode-web-api:testClasses
:geode-web-api:flakyTest
:combineReports
All test reports at <https://builds.apache.org/job/Geode-nightly-flaky/ws/build/reports/combined>
FAILURE: Build failed with an exception.
* What went wrong:
Execution failed for task ':geode-core:flakyTest'.
> There were failing tests. See the report at: file://<https://builds.apache.org/job/Geode-nightly-flaky/ws/geode-core/build/reports/flakyTest/index.html>
* Try:
Run with --stacktrace option to get the stack trace. Run with --info or --debug option to get more log output.
BUILD FAILED
Total time: 2 hrs 9 mins 29.26 secs
Build step 'Invoke Gradle script' changed build result to FAILURE
Build step 'Invoke Gradle script' marked build as failure
Archiving artifacts
Recording test results
See <https://builds.apache.org/job/Geode-nightly-flaky/156/display/redirect?page=changes>
See <https://builds.apache.org/job/Geode-nightly-flaky/155/display/redirect?page=changes>
Changes:
[github] GEODE-3521: Allow region set operations to bootstrap a transaction.
[kohlmu-pivotal] GEODE-3739: Refactor protobuf authentication (#922)
[kohlmu-pivotal] GEODE-3864: Added protobuf message file archiving
[kohlmu-pivotal] GEODE-3864: Added protobuf message file archiving
[kirk.lund] GEODE-3068: fix alphabetical ordering
[kirk.lund] GEODE-3866: add integration tests for deprecated launchers
[kirk.lund] Change DeprecatedAgentLauncherIntegrationTest to use TemporaryFolder
[kirk.lund] Isolate new methods accepting workingDirectory to only require
[kirk.lund] Fix format with spotless
[kirk.lund] GEODE-3847: upgrade to AssertJ 3.8.0
[bschuchardt] Squashed commit of the following:
[github] GEODE-3719: Improve invocations of disk store backups (#853)
[jstewart] GEODE-3859: Simplify API for reading output from a GfshScript
[jstewart] GEODE-3830: Add more logging for GfshRule
[lhughesgodfrey] GEODE-3345: Refactor ClusterConfigurationDUnitTest to use test rules
[github] GEODE-3810: Incremented test timestamp by 1 in case it is the same as
[eshu] GEODE-3521: Correct a javadoc issue.
[nabarunnag] GEODE-1772: Removal of flaky tag.
[klund] GEODE-3870: regenerate Region Entry classes from Linux
[bschuchardt] GEODE-3871 allow exclusion of serializable classes in
[lhughesgodfrey] GEODE-3882: ClusterConfiguration to support GatewayReceiver
------------------------------------------
[...truncated 110.50 KB...]
Download https://repo1.maven.org/maven2/com/fasterxml/jackson/module/jackson-module-paranamer/2.8.6/jackson-module-paranamer-2.8.6.jar
Download https://repo1.maven.org/maven2/io/swagger/swagger-annotations/1.5.10/swagger-annotations-1.5.10.jar
Download https://repo1.maven.org/maven2/io/swagger/swagger-models/1.5.10/swagger-models-1.5.10.jar
Download https://repo1.maven.org/maven2/io/springfox/springfox-spi/2.6.1/springfox-spi-2.6.1.jar
Download https://repo1.maven.org/maven2/io/springfox/springfox-schema/2.6.1/springfox-schema-2.6.1.jar
Download https://repo1.maven.org/maven2/io/springfox/springfox-swagger-common/2.6.1/springfox-swagger-common-2.6.1.jar
Download https://repo1.maven.org/maven2/io/springfox/springfox-spring-web/2.6.1/springfox-spring-web-2.6.1.jar
Download https://repo1.maven.org/maven2/org/springframework/plugin/spring-plugin-core/1.2.0.RELEASE/spring-plugin-core-1.2.0.RELEASE.jar
Download https://repo1.maven.org/maven2/org/springframework/plugin/spring-plugin-metadata/1.2.0.RELEASE/spring-plugin-metadata-1.2.0.RELEASE.jar
Download https://repo1.maven.org/maven2/org/mapstruct/mapstruct/1.0.0.Final/mapstruct-1.0.0.Final.jar
Download https://repo1.maven.org/maven2/com/thoughtworks/paranamer/paranamer/2.8/paranamer-2.8.jar
Download https://repo1.maven.org/maven2/io/springfox/springfox-core/2.6.1/springfox-core-2.6.1.jar
Note: Some input files use unchecked or unsafe operations.
Note: Recompile with -Xlint:unchecked for details.
:geode-web-api:processResources
:geode-web-api:classes
:geode-assembly:docs<https://builds.apache.org/job/Geode-nightly-flaky/ws/geode-lucene/src/main/java/org/apache/geode/cache/lucene/LuceneSerializer.java>:44: warning - Tag @link: reference not found: Field.Store#NO
<https://builds.apache.org/job/Geode-nightly-flaky/ws/geode-lucene/src/main/java/org/apache/geode/cache/lucene/LuceneSerializer.java>:44: warning - Tag @link: reference not found: Field.Store#NO
<https://builds.apache.org/job/Geode-nightly-flaky/ws/geode-lucene/src/main/java/org/apache/geode/cache/lucene/LuceneSerializer.java>:44: warning - Tag @link: reference not found: Field.Store#NO
3 warnings
:geode-assembly:gfshDepsJar
:geode-common:javadocJar
:geode-common:sourcesJar
:geode-common:signArchives SKIPPED
:geode-core:javadocJar
:geode-core:raJar
:geode-core:jcaJar
:geode-core:sourcesJar
:geode-core:signArchives SKIPPED
:geode-core:webJar
:geode-cq:jar
:geode-cq:javadoc
:geode-cq:javadocJar
:geode-cq:sourcesJar
:geode-cq:signArchives SKIPPED
:geode-json:javadocJar
:geode-json:sourcesJar
:geode-json:signArchives SKIPPED
:geode-lucene:jar
:geode-lucene:javadoc<https://builds.apache.org/job/Geode-nightly-flaky/ws/geode-lucene/src/main/java/org/apache/geode/cache/lucene/LuceneSerializer.java>:44: warning - Tag @link: reference not found: Field.Store#NO
<https://builds.apache.org/job/Geode-nightly-flaky/ws/geode-lucene/src/main/java/org/apache/geode/cache/lucene/LuceneSerializer.java>:44: warning - Tag @link: reference not found: Field.Store#NO
<https://builds.apache.org/job/Geode-nightly-flaky/ws/geode-lucene/src/main/java/org/apache/geode/cache/lucene/LuceneSerializer.java>:44: warning - Tag @link: reference not found: Field.Store#NO
<https://builds.apache.org/job/Geode-nightly-flaky/ws/geode-lucene/src/main/java/org/apache/geode/cache/lucene/LuceneSerializer.java>:44: warning - Tag @link: reference not found: Field.Store#NO
<https://builds.apache.org/job/Geode-nightly-flaky/ws/geode-lucene/src/main/java/org/apache/geode/cache/lucene/LuceneSerializer.java>:44: warning - Tag @link: reference not found: Field.Store#NO
<https://builds.apache.org/job/Geode-nightly-flaky/ws/geode-lucene/src/main/java/org/apache/geode/cache/lucene/LuceneSerializer.java>:44: warning - Tag @link: reference not found: Field.Store#NO
<https://builds.apache.org/job/Geode-nightly-flaky/ws/geode-lucene/src/main/java/org/apache/geode/cache/lucene/LuceneSerializer.java>:44: warning - Tag @link: reference not found: Field.Store#NO
7 warnings
:geode-lucene:javadocJar
:geode-lucene:sourcesJar
:geode-lucene:signArchives SKIPPED
:geode-old-client-support:jar
:geode-old-client-support:javadoc
:geode-old-client-support:javadocJar
:geode-old-client-support:sourcesJar
:geode-old-client-support:signArchives SKIPPED
:geode-protobuf:jar
:geode-protobuf:javadoc
:geode-protobuf:javadocJar
:geode-protobuf:sourcesJar
:geode-protobuf:signArchives SKIPPED
:geode-protobuf:zip
:geode-pulse:javadoc
:geode-pulse:javadocJar
:geode-pulse:sourcesJar
:geode-pulse:war
:geode-pulse:signArchives SKIPPED
:geode-rebalancer:jar
:geode-rebalancer:javadoc
:geode-rebalancer:javadocJar
:geode-rebalancer:sourcesJar
:geode-rebalancer:signArchives SKIPPED
:geode-wan:jar
:geode-wan:javadoc
:geode-wan:javadocJar
:geode-wan:sourcesJar
:geode-wan:signArchives SKIPPED
:geode-web:javadoc NO-SOURCE
:geode-web:javadocJar
:geode-web:sourcesJar
:geode-web:war
:geode-web:signArchives SKIPPED
:geode-web-api:javadoc
:geode-web-api:javadocJar
:geode-web-api:sourcesJar
:geode-web-api:war
:geode-web-api:signArchives SKIPPED
:geode-assembly:installDist
:geode-pulse:jar
:geode-assembly:compileTestJava
Download https://repo1.maven.org/maven2/org/codehaus/cargo/cargo-core-uberjar/1.6.3/cargo-core-uberjar-1.6.3.pom
Download https://repo1.maven.org/maven2/org/codehaus/cargo/cargo-core/1.6.3/cargo-core-1.6.3.pom
Download https://repo1.maven.org/maven2/org/codehaus/cargo/codehaus-cargo/1.6.3/codehaus-cargo-1.6.3.pom
Download https://repo1.maven.org/maven2/org/codehaus/cargo/cargo-core-uberjar/1.6.3/cargo-core-uberjar-1.6.3.jar
Note: Some input files use or override a deprecated API.
Note: Recompile with -Xlint:deprecation for details.
Note: Some input files use unchecked or unsafe operations.
Note: Recompile with -Xlint:unchecked for details.
:geode-assembly:processTestResources
:geode-assembly:testClasses
:geode-assembly:flakyTest
:geode-benchmarks:compileTestJava NO-SOURCE
:geode-benchmarks:processTestResources NO-SOURCE
:geode-benchmarks:testClasses UP-TO-DATE
:geode-benchmarks:flakyTest NO-SOURCE
:geode-common:compileTestJava
:geode-common:processTestResources NO-SOURCE
:geode-common:testClasses
:geode-common:flakyTest
:geode-concurrency-test:generateJpfProperties
:geode-concurrency-test:compileTestJava NO-SOURCE
:geode-concurrency-test:processTestResources NO-SOURCE
:geode-concurrency-test:testClasses UP-TO-DATE
:geode-concurrency-test:flakyTest NO-SOURCE
:geode-core:flakyTest
org.apache.geode.management.RegionManagementDUnitTest > testNavigationAPIS FAILED
org.apache.geode.test.dunit.RMIException: While invoking org.apache.geode.test.dunit.NamedRunnable.run in VM 0 running on Host asf914.gq1.ygridcore.net with 4 VMs
at org.apache.geode.test.dunit.VM.invoke(VM.java:393)
at org.apache.geode.test.dunit.VM.invoke(VM.java:363)
at org.apache.geode.test.dunit.VM.invoke(VM.java:296)
at org.apache.geode.management.RegionManagementDUnitTest.verifyNavigationApis(RegionManagementDUnitTest.java:406)
at org.apache.geode.management.RegionManagementDUnitTest.testNavigationAPIS(RegionManagementDUnitTest.java:267)
Caused by:
org.awaitility.core.ConditionTimeoutException: Condition defined as a lambda expression in org.apache.geode.management.RegionManagementDUnitTest that uses org.apache.geode.management.DistributedSystemMXBean, org.apache.geode.management.DistributedSystemMXBeanint expected:<[4]> but was:<[5]> within 2 minutes.
at org.awaitility.core.ConditionAwaiter.await(ConditionAwaiter.java:104)
at org.awaitility.core.AssertionCondition.await(AssertionCondition.java:117)
at org.awaitility.core.AssertionCondition.await(AssertionCondition.java:32)
at org.awaitility.core.ConditionFactory.until(ConditionFactory.java:809)
at org.awaitility.core.ConditionFactory.until(ConditionFactory.java:648)
at org.apache.geode.management.RegionManagementDUnitTest.awaitMemberCount(RegionManagementDUnitTest.java:1049)
at org.apache.geode.management.RegionManagementDUnitTest.lambda$verifyNavigationApis$8ec4a763$1(RegionManagementDUnitTest.java:410)
277 tests completed, 1 failed, 8 skipped
:geode-core:flakyTest FAILED
:geode-cq:compileTestJavaNote: Some input files use or override a deprecated API.
Note: Recompile with -Xlint:deprecation for details.
Note: Some input files use unchecked or unsafe operations.
Note: Recompile with -Xlint:unchecked for details.
:geode-cq:processTestResources
:geode-cq:testClasses
:geode-cq:flakyTest
:geode-json:compileTestJava NO-SOURCE
:geode-json:processTestResources
:geode-json:testClasses
:geode-json:flakyTest NO-SOURCE
:geode-junit:compileTestJavaNote: <https://builds.apache.org/job/Geode-nightly-flaky/ws/geode-junit/src/test/java/org/apache/geode/test/compiler/JarBuilderTest.java> uses or overrides a deprecated API.
Note: Recompile with -Xlint:deprecation for details.
Note: <https://builds.apache.org/job/Geode-nightly-flaky/ws/geode-junit/src/test/java/org/apache/geode/test/compiler/ClassNameExtractorTest.java> uses unchecked or unsafe operations.
Note: Recompile with -Xlint:unchecked for details.
:geode-junit:processTestResources
:geode-junit:testClasses
:geode-junit:flakyTest
:geode-lucene:compileTestJava
Download https://repo1.maven.org/maven2/org/apache/lucene/lucene-test-framework/6.4.1/lucene-test-framework-6.4.1.pom
Download https://repo1.maven.org/maven2/org/apache/lucene/lucene-codecs/6.4.1/lucene-codecs-6.4.1.pom
Download https://repo1.maven.org/maven2/com/carrotsearch/randomizedtesting/randomizedtesting-runner/2.4.0/randomizedtesting-runner-2.4.0.pom
Download https://repo1.maven.org/maven2/com/carrotsearch/randomizedtesting/randomizedtesting-parent/2.4.0/randomizedtesting-parent-2.4.0.pom
Download https://repo1.maven.org/maven2/org/apache/lucene/lucene-test-framework/6.4.1/lucene-test-framework-6.4.1.jar
Download https://repo1.maven.org/maven2/org/apache/lucene/lucene-codecs/6.4.1/lucene-codecs-6.4.1.jar
Download https://repo1.maven.org/maven2/com/carrotsearch/randomizedtesting/randomizedtesting-runner/2.4.0/randomizedtesting-runner-2.4.0.jar
Note: Some input files use or override a deprecated API.
Note: Recompile with -Xlint:deprecation for details.
Note: Some input files use unchecked or unsafe operations.
Note: Recompile with -Xlint:unchecked for details.
:geode-lucene:processTestResources
:geode-lucene:testClasses
:geode-lucene:flakyTest
:geode-old-client-support:compileTestJavaNote: <https://builds.apache.org/job/Geode-nightly-flaky/ws/geode-old-client-support/src/test/java/com/gemstone/gemfire/cache/execute/FunctionExceptionTest.java> uses or overrides a deprecated API.
Note: Recompile with -Xlint:deprecation for details.
:geode-old-client-support:processTestResources NO-SOURCE
:geode-old-client-support:testClasses
:geode-old-client-support:flakyTest
:geode-old-versions:compileTestJava NO-SOURCE
:geode-old-versions:processTestResources NO-SOURCE
:geode-old-versions:testClasses UP-TO-DATE
:geode-old-versions:flakyTest NO-SOURCE
:geode-protobuf:extractIncludeTestProto
Download https://repo1.maven.org/maven2/org/powermock/powermock-api-mockito/1.7.1/powermock-api-mockito-1.7.1.pom
Download https://repo1.maven.org/maven2/org/powermock/powermock-api-mockito/1.7.1/powermock-api-mockito-1.7.1.jar
:geode-protobuf:extractTestProto
:geode-protobuf:generateTestProto NO-SOURCE
:geode-protobuf:compileTestJavaNote: Some input files use or override a deprecated API.
Note: Recompile with -Xlint:deprecation for details.
Note: Some input files use unchecked or unsafe operations.
Note: Recompile with -Xlint:unchecked for details.
:geode-protobuf:processTestResources
:geode-protobuf:testClasses
:geode-protobuf:flakyTest
:geode-pulse:compileTestJava
Download https://repo1.maven.org/maven2/com/codeborne/phantomjsdriver/1.3.0/phantomjsdriver-1.3.0.pom
Download https://repo1.maven.org/maven2/com/codeborne/phantomjsdriver/1.3.0/phantomjsdriver-1.3.0.jar
Download https://repo1.maven.org/maven2/org/seleniumhq/selenium/selenium-api/3.0.1/selenium-api-3.0.1.jar
Download https://repo1.maven.org/maven2/org/seleniumhq/selenium/selenium-remote-driver/3.0.1/selenium-remote-driver-3.0.1.jar
Download https://repo1.maven.org/maven2/org/seleniumhq/selenium/selenium-support/3.0.1/selenium-support-3.0.1.jar
Note: Some input files use or override a deprecated API.
Note: Recompile with -Xlint:deprecation for details.
Note: <https://builds.apache.org/job/Geode-nightly-flaky/ws/geode-pulse/src/test/java/org/apache/geode/tools/pulse/controllers/PulseControllerJUnitTest.java> uses unchecked or unsafe operations.
Note: Recompile with -Xlint:unchecked for details.
:geode-pulse:processTestResources
:geode-pulse:testClasses
:geode-pulse:flakyTest
:geode-rebalancer:compileTestJava
:geode-rebalancer:processTestResources NO-SOURCE
:geode-rebalancer:testClasses
:geode-rebalancer:flakyTest
:geode-wan:compileTestJavaNote: Some input files use or override a deprecated API.
Note: Recompile with -Xlint:deprecation for details.
Note: Some input files use unchecked or unsafe operations.
Note: Recompile with -Xlint:unchecked for details.
:geode-wan:processTestResources
:geode-wan:testClasses
:geode-wan:flakyTest
:geode-web:compileTestJavaNote: Some input files use or override a deprecated API.
Note: Recompile with -Xlint:deprecation for details.
:geode-web:processTestResources NO-SOURCE
:geode-web:testClasses
:geode-web:flakyTest
:geode-web-api:compileTestJava
:geode-web-api:processTestResources NO-SOURCE
:geode-web-api:testClasses
:geode-web-api:flakyTest
:combineReports
All test reports at <https://builds.apache.org/job/Geode-nightly-flaky/ws/build/reports/combined>
FAILURE: Build failed with an exception.
* What went wrong:
Execution failed for task ':geode-core:flakyTest'.
> There were failing tests. See the report at: file://<https://builds.apache.org/job/Geode-nightly-flaky/ws/geode-core/build/reports/flakyTest/index.html>
* Try:
Run with --stacktrace option to get the stack trace. Run with --info or --debug option to get more log output.
BUILD FAILED
Total time: 1 hrs 59 mins 24.111 secs
Build step 'Invoke Gradle script' changed build result to FAILURE
Build step 'Invoke Gradle script' marked build as failure
Archiving artifacts
Recording test results
See <https://builds.apache.org/job/Geode-nightly-flaky/154/display/redirect>
------------------------------------------
[...truncated 110.60 KB...]
Download https://repo1.maven.org/maven2/io/swagger/swagger-annotations/1.5.10/swagger-annotations-1.5.10.jar
Download https://repo1.maven.org/maven2/io/swagger/swagger-models/1.5.10/swagger-models-1.5.10.jar
Download https://repo1.maven.org/maven2/io/springfox/springfox-spi/2.6.1/springfox-spi-2.6.1.jar
Download https://repo1.maven.org/maven2/io/springfox/springfox-schema/2.6.1/springfox-schema-2.6.1.jar
Download https://repo1.maven.org/maven2/io/springfox/springfox-swagger-common/2.6.1/springfox-swagger-common-2.6.1.jar
Download https://repo1.maven.org/maven2/io/springfox/springfox-spring-web/2.6.1/springfox-spring-web-2.6.1.jar
Download https://repo1.maven.org/maven2/org/springframework/plugin/spring-plugin-core/1.2.0.RELEASE/spring-plugin-core-1.2.0.RELEASE.jar
Download https://repo1.maven.org/maven2/org/springframework/plugin/spring-plugin-metadata/1.2.0.RELEASE/spring-plugin-metadata-1.2.0.RELEASE.jar
Download https://repo1.maven.org/maven2/org/mapstruct/mapstruct/1.0.0.Final/mapstruct-1.0.0.Final.jar
Download https://repo1.maven.org/maven2/io/springfox/springfox-core/2.6.1/springfox-core-2.6.1.jar
Note: Some input files use unchecked or unsafe operations.
Note: Recompile with -Xlint:unchecked for details.
:geode-web-api:processResources
:geode-web-api:classes
:geode-assembly:docs<https://builds.apache.org/job/Geode-nightly-flaky/ws/geode-lucene/src/main/java/org/apache/geode/cache/lucene/LuceneSerializer.java>:44: warning - Tag @link: reference not found: Field.Store#NO
<https://builds.apache.org/job/Geode-nightly-flaky/ws/geode-lucene/src/main/java/org/apache/geode/cache/lucene/LuceneSerializer.java>:44: warning - Tag @link: reference not found: Field.Store#NO
<https://builds.apache.org/job/Geode-nightly-flaky/ws/geode-lucene/src/main/java/org/apache/geode/cache/lucene/LuceneSerializer.java>:44: warning - Tag @link: reference not found: Field.Store#NO
3 warnings
:geode-assembly:gfshDepsJar
:geode-common:javadocJar
:geode-common:sourcesJar
:geode-common:signArchives SKIPPED
:geode-core:javadocJar
:geode-core:raJar
:geode-core:jcaJar
:geode-core:sourcesJar
:geode-core:signArchives SKIPPED
:geode-core:webJar
:geode-cq:jar
:geode-cq:javadoc
:geode-cq:javadocJar
:geode-cq:sourcesJar
:geode-cq:signArchives SKIPPED
:geode-json:javadocJar
:geode-json:sourcesJar
:geode-json:signArchives SKIPPED
:geode-lucene:jar
:geode-lucene:javadoc<https://builds.apache.org/job/Geode-nightly-flaky/ws/geode-lucene/src/main/java/org/apache/geode/cache/lucene/LuceneSerializer.java>:44: warning - Tag @link: reference not found: Field.Store#NO
<https://builds.apache.org/job/Geode-nightly-flaky/ws/geode-lucene/src/main/java/org/apache/geode/cache/lucene/LuceneSerializer.java>:44: warning - Tag @link: reference not found: Field.Store#NO
<https://builds.apache.org/job/Geode-nightly-flaky/ws/geode-lucene/src/main/java/org/apache/geode/cache/lucene/LuceneSerializer.java>:44: warning - Tag @link: reference not found: Field.Store#NO
<https://builds.apache.org/job/Geode-nightly-flaky/ws/geode-lucene/src/main/java/org/apache/geode/cache/lucene/LuceneSerializer.java>:44: warning - Tag @link: reference not found: Field.Store#NO
<https://builds.apache.org/job/Geode-nightly-flaky/ws/geode-lucene/src/main/java/org/apache/geode/cache/lucene/LuceneSerializer.java>:44: warning - Tag @link: reference not found: Field.Store#NO
<https://builds.apache.org/job/Geode-nightly-flaky/ws/geode-lucene/src/main/java/org/apache/geode/cache/lucene/LuceneSerializer.java>:44: warning - Tag @link: reference not found: Field.Store#NO
<https://builds.apache.org/job/Geode-nightly-flaky/ws/geode-lucene/src/main/java/org/apache/geode/cache/lucene/LuceneSerializer.java>:44: warning - Tag @link: reference not found: Field.Store#NO
7 warnings
:geode-lucene:javadocJar
:geode-lucene:sourcesJar
:geode-lucene:signArchives SKIPPED
:geode-old-client-support:jar
:geode-old-client-support:javadoc
:geode-old-client-support:javadocJar
:geode-old-client-support:sourcesJar
:geode-old-client-support:signArchives SKIPPED
:geode-protobuf:jar
:geode-protobuf:javadoc
:geode-protobuf:javadocJar
:geode-protobuf:sourcesJar
:geode-protobuf:signArchives SKIPPED
:geode-pulse:javadoc
:geode-pulse:javadocJar
:geode-pulse:sourcesJar
:geode-pulse:war
:geode-pulse:signArchives SKIPPED
:geode-rebalancer:jar
:geode-rebalancer:javadoc
:geode-rebalancer:javadocJar
:geode-rebalancer:sourcesJar
:geode-rebalancer:signArchives SKIPPED
:geode-wan:jar
:geode-wan:javadoc
:geode-wan:javadocJar
:geode-wan:sourcesJar
:geode-wan:signArchives SKIPPED
:geode-web:javadoc NO-SOURCE
:geode-web:javadocJar
:geode-web:sourcesJar
:geode-web:war
:geode-web:signArchives SKIPPED
:geode-web-api:javadoc
:geode-web-api:javadocJar
:geode-web-api:sourcesJar
:geode-web-api:war
:geode-web-api:signArchives SKIPPED
:geode-assembly:installDist
:geode-pulse:jar
:geode-assembly:compileTestJava
Download https://repo1.maven.org/maven2/org/codehaus/cargo/cargo-core-uberjar/1.6.3/cargo-core-uberjar-1.6.3.pom
Download https://repo1.maven.org/maven2/org/codehaus/cargo/cargo-core/1.6.3/cargo-core-1.6.3.pom
Download https://repo1.maven.org/maven2/org/codehaus/cargo/codehaus-cargo/1.6.3/codehaus-cargo-1.6.3.pom
Download https://repo1.maven.org/maven2/org/codehaus/cargo/cargo-core-uberjar/1.6.3/cargo-core-uberjar-1.6.3.jar
Note: Some input files use or override a deprecated API.
Note: Recompile with -Xlint:deprecation for details.
Note: Some input files use unchecked or unsafe operations.
Note: Recompile with -Xlint:unchecked for details.
:geode-assembly:processTestResources
:geode-assembly:testClasses
:geode-assembly:flakyTest
:geode-benchmarks:compileTestJava NO-SOURCE
:geode-benchmarks:processTestResources NO-SOURCE
:geode-benchmarks:testClasses UP-TO-DATE
:geode-benchmarks:flakyTest NO-SOURCE
:geode-common:compileTestJava
:geode-common:processTestResources NO-SOURCE
:geode-common:testClasses
:geode-common:flakyTest
:geode-concurrency-test:generateJpfProperties
:geode-concurrency-test:compileTestJava NO-SOURCE
:geode-concurrency-test:processTestResources NO-SOURCE
:geode-concurrency-test:testClasses UP-TO-DATE
:geode-concurrency-test:flakyTest NO-SOURCE
:geode-core:flakyTest
org.apache.geode.management.RegionManagementDUnitTest > testNavigationAPIS FAILED
org.apache.geode.test.dunit.RMIException: While invoking org.apache.geode.test.dunit.NamedRunnable.run in VM 0 running on Host pomona.apache.org with 4 VMs
at org.apache.geode.test.dunit.VM.invoke(VM.java:393)
at org.apache.geode.test.dunit.VM.invoke(VM.java:363)
at org.apache.geode.test.dunit.VM.invoke(VM.java:296)
at org.apache.geode.management.RegionManagementDUnitTest.verifyNavigationApis(RegionManagementDUnitTest.java:406)
at org.apache.geode.management.RegionManagementDUnitTest.testNavigationAPIS(RegionManagementDUnitTest.java:267)
Caused by:
org.awaitility.core.ConditionTimeoutException: Condition defined as a lambda expression in org.apache.geode.management.RegionManagementDUnitTest that uses org.apache.geode.management.DistributedSystemMXBean, org.apache.geode.management.DistributedSystemMXBeanint expected:<[4]> but was:<[5]> within 2 minutes.
at org.awaitility.core.ConditionAwaiter.await(ConditionAwaiter.java:104)
at org.awaitility.core.AssertionCondition.await(AssertionCondition.java:117)
at org.awaitility.core.AssertionCondition.await(AssertionCondition.java:32)
at org.awaitility.core.ConditionFactory.until(ConditionFactory.java:809)
at org.awaitility.core.ConditionFactory.until(ConditionFactory.java:648)
at org.apache.geode.management.RegionManagementDUnitTest.awaitMemberCount(RegionManagementDUnitTest.java:1049)
at org.apache.geode.management.RegionManagementDUnitTest.lambda$verifyNavigationApis$8ec4a763$1(RegionManagementDUnitTest.java:410)
277 tests completed, 1 failed, 8 skipped
:geode-core:flakyTest FAILED
:geode-cq:compileTestJavaNote: Some input files use or override a deprecated API.
Note: Recompile with -Xlint:deprecation for details.
Note: Some input files use unchecked or unsafe operations.
Note: Recompile with -Xlint:unchecked for details.
:geode-cq:processTestResources
:geode-cq:testClasses
:geode-cq:flakyTest
:geode-json:compileTestJava NO-SOURCE
:geode-json:processTestResources
:geode-json:testClasses
:geode-json:flakyTest NO-SOURCE
:geode-junit:compileTestJavaNote: <https://builds.apache.org/job/Geode-nightly-flaky/ws/geode-junit/src/test/java/org/apache/geode/test/compiler/JarBuilderTest.java> uses or overrides a deprecated API.
Note: Recompile with -Xlint:deprecation for details.
Note: <https://builds.apache.org/job/Geode-nightly-flaky/ws/geode-junit/src/test/java/org/apache/geode/test/compiler/ClassNameExtractorTest.java> uses unchecked or unsafe operations.
Note: Recompile with -Xlint:unchecked for details.
:geode-junit:processTestResources
:geode-junit:testClasses
:geode-junit:flakyTest
:geode-lucene:compileTestJava
Download https://repo1.maven.org/maven2/org/apache/lucene/lucene-test-framework/6.4.1/lucene-test-framework-6.4.1.pom
Download https://repo1.maven.org/maven2/org/apache/lucene/lucene-codecs/6.4.1/lucene-codecs-6.4.1.pom
Download https://repo1.maven.org/maven2/com/carrotsearch/randomizedtesting/randomizedtesting-runner/2.4.0/randomizedtesting-runner-2.4.0.pom
Download https://repo1.maven.org/maven2/com/carrotsearch/randomizedtesting/randomizedtesting-parent/2.4.0/randomizedtesting-parent-2.4.0.pom
Download https://repo1.maven.org/maven2/org/apache/lucene/lucene-test-framework/6.4.1/lucene-test-framework-6.4.1.jar
Download https://repo1.maven.org/maven2/org/apache/lucene/lucene-codecs/6.4.1/lucene-codecs-6.4.1.jar
Download https://repo1.maven.org/maven2/com/carrotsearch/randomizedtesting/randomizedtesting-runner/2.4.0/randomizedtesting-runner-2.4.0.jar
Note: Some input files use or override a deprecated API.
Note: Recompile with -Xlint:deprecation for details.
Note: Some input files use unchecked or unsafe operations.
Note: Recompile with -Xlint:unchecked for details.
:geode-lucene:processTestResources
:geode-lucene:testClasses
:geode-lucene:flakyTest
:geode-old-client-support:compileTestJavaNote: <https://builds.apache.org/job/Geode-nightly-flaky/ws/geode-old-client-support/src/test/java/com/gemstone/gemfire/cache/execute/FunctionExceptionTest.java> uses or overrides a deprecated API.
Note: Recompile with -Xlint:deprecation for details.
:geode-old-client-support:processTestResources NO-SOURCE
:geode-old-client-support:testClasses
:geode-old-client-support:flakyTest
:geode-old-versions:compileTestJava NO-SOURCE
:geode-old-versions:processTestResources NO-SOURCE
:geode-old-versions:testClasses UP-TO-DATE
:geode-old-versions:flakyTest NO-SOURCE
:geode-protobuf:extractIncludeTestProto
Download https://repo1.maven.org/maven2/org/powermock/powermock-api-mockito/1.7.1/powermock-api-mockito-1.7.1.pom
Download https://repo1.maven.org/maven2/org/powermock/powermock-api-mockito/1.7.1/powermock-api-mockito-1.7.1.jar
:geode-protobuf:extractTestProto
:geode-protobuf:generateTestProto NO-SOURCE
:geode-protobuf:compileTestJavaNote: Some input files use or override a deprecated API.
Note: Recompile with -Xlint:deprecation for details.
Note: Some input files use unchecked or unsafe operations.
Note: Recompile with -Xlint:unchecked for details.
:geode-protobuf:processTestResources
:geode-protobuf:testClasses
:geode-protobuf:flakyTest
:geode-pulse:compileTestJava
Download https://repo1.maven.org/maven2/com/codeborne/phantomjsdriver/1.3.0/phantomjsdriver-1.3.0.pom
Download https://repo1.maven.org/maven2/org/seleniumhq/selenium/selenium-api/3.0.1/selenium-api-3.0.1.pom
Download https://repo1.maven.org/maven2/org/seleniumhq/selenium/selenium-remote-driver/3.0.1/selenium-remote-driver-3.0.1.pom
Download https://repo1.maven.org/maven2/org/seleniumhq/selenium/selenium-support/3.0.1/selenium-support-3.0.1.pom
Download https://repo1.maven.org/maven2/com/codeborne/phantomjsdriver/1.3.0/phantomjsdriver-1.3.0.jar
Download https://repo1.maven.org/maven2/org/seleniumhq/selenium/selenium-api/3.0.1/selenium-api-3.0.1.jar
Download https://repo1.maven.org/maven2/org/seleniumhq/selenium/selenium-remote-driver/3.0.1/selenium-remote-driver-3.0.1.jar
Download https://repo1.maven.org/maven2/org/seleniumhq/selenium/selenium-support/3.0.1/selenium-support-3.0.1.jar
Note: Some input files use or override a deprecated API.
Note: Recompile with -Xlint:deprecation for details.
Note: <https://builds.apache.org/job/Geode-nightly-flaky/ws/geode-pulse/src/test/java/org/apache/geode/tools/pulse/controllers/PulseControllerJUnitTest.java> uses unchecked or unsafe operations.
Note: Recompile with -Xlint:unchecked for details.
:geode-pulse:processTestResources
:geode-pulse:testClasses
:geode-pulse:flakyTest
:geode-rebalancer:compileTestJava
:geode-rebalancer:processTestResources NO-SOURCE
:geode-rebalancer:testClasses
:geode-rebalancer:flakyTest
:geode-wan:compileTestJavaNote: Some input files use or override a deprecated API.
Note: Recompile with -Xlint:deprecation for details.
Note: Some input files use unchecked or unsafe operations.
Note: Recompile with -Xlint:unchecked for details.
:geode-wan:processTestResources
:geode-wan:testClasses
:geode-wan:flakyTest
:geode-web:compileTestJavaNote: Some input files use or override a deprecated API.
Note: Recompile with -Xlint:deprecation for details.
:geode-web:processTestResources NO-SOURCE
:geode-web:testClasses
:geode-web:flakyTest
:geode-web-api:compileTestJava
:geode-web-api:processTestResources NO-SOURCE
:geode-web-api:testClasses
:geode-web-api:flakyTest
:combineReports
All test reports at <https://builds.apache.org/job/Geode-nightly-flaky/ws/build/reports/combined>
FAILURE: Build failed with an exception.
* What went wrong:
Execution failed for task ':geode-core:flakyTest'.
> There were failing tests. See the report at: file://<https://builds.apache.org/job/Geode-nightly-flaky/ws/geode-core/build/reports/flakyTest/index.html>
* Try:
Run with --stacktrace option to get the stack trace. Run with --info or --debug option to get more log output.
BUILD FAILED
Total time: 2 hrs 9 mins 52.98 secs
Build step 'Invoke Gradle script' changed build result to FAILURE
Build step 'Invoke Gradle script' marked build as failure
Archiving artifacts
Recording test results