You are viewing a plain text version of this content. The canonical link for it is here.
Posted to m2-dev@maven.apache.org by jv...@maven.org on 2004/08/26 14:02:56 UTC
[maven2 build] Thu Aug 26 07:59:18 EDT 2004
Performing a clean check out of maven-components ...
Updates occured, build required ...
-----------------------------------------------------------------------
Building mboot ...
-----------------------------------------------------------------------
-----------------------------------------------------------------------
Building maven2 components ...
-----------------------------------------------------------------------
Using the following for your maven.repo.local: /home/users/jvanzyl/maven-repo-local
Checking for MBoot's dependencies ...
...........................................................................
.
....
.
...........................
.
.......................................................................
.
...............................................................
.
...............................................
.
.....................................
.
..
.
Installing POM: /home/users/jvanzyl/maven-repo-local/maven/poms/maven-component-2.0-SNAPSHOT.pom
Installing POM: /home/users/jvanzyl/maven-repo-local/maven/poms/maven-plugin-parent-2.0-SNAPSHOT.pom
Building project in /home/users/jvanzyl/m2-build/maven-components/maven-model ...
--------------------------------------------------------------------
Building project in /home/users/jvanzyl/m2-build/maven-components/maven-model
Cleaning /home/users/jvanzyl/m2-build/maven-components/maven-model/target...
Downloading dependencies ...
..................................................................................................
..........................
.
Model exists!
Generating java in /home/users/jvanzyl/m2-build/maven-components/maven-model/target/generated-sources from /home/users/jvanzyl/m2-build/maven-components/maven-model/maven.mdo
Generating java in /home/users/jvanzyl/m2-build/maven-components/maven-model/target/generated-sources from /home/users/jvanzyl/m2-build/maven-components/maven-model/maven.mdo
Generating xpp3 unmarshaller in /home/users/jvanzyl/m2-build/maven-components/maven-model/target/generated-sources from /home/users/jvanzyl/m2-build/maven-components/maven-model/maven.mdo
Generating xpp3 marshaller in /home/users/jvanzyl/m2-build/maven-components/maven-model/target/generated-sources from /home/users/jvanzyl/m2-build/maven-components/maven-model/maven.mdo
Generating xpp3 unmarshaller in /home/users/jvanzyl/m2-build/maven-components/maven-model/target/generated-sources from /home/users/jvanzyl/m2-build/maven-components/maven-model/maven.mdo
Generating xpp3 marshaller in /home/users/jvanzyl/m2-build/maven-components/maven-model/target/generated-sources from /home/users/jvanzyl/m2-build/maven-components/maven-model/maven.mdo
Compiling sources ...
Packaging resources ...
Compiling test sources ...
Packaging test resources ...
-------------------------------------------------------
T E S T S
-------------------------------------------------------
There are no test to run.
Resume :
[surefire] Tests run: 0, Failures: 0, Errors: 0
Installing POM: /home/users/jvanzyl/maven-repo-local/maven/poms/maven-model-2.0-SNAPSHOT.pom
Installing JAR: /home/users/jvanzyl/maven-repo-local/maven/jars/maven-model-2.0-SNAPSHOT.jar
--------------------------------------------------------------------
Building project in /home/users/jvanzyl/m2-build/maven-components/maven-plugin ...
--------------------------------------------------------------------
Building project in /home/users/jvanzyl/m2-build/maven-components/maven-plugin
Cleaning /home/users/jvanzyl/m2-build/maven-components/maven-plugin/target...
Downloading dependencies ...
Compiling sources ...
Packaging resources ...
Compiling test sources ...
Packaging test resources ...
-------------------------------------------------------
T E S T S
-------------------------------------------------------
[surefire] Running org.apache.maven.plugin.BeanTest
[surefire] Tests run: 1, Failures: 0, Errors: 0, Time elapsed: 0.007 sec
[surefire] Running org.apache.maven.plugin.TestPluginTest
[surefire] Tests run: 1, Failures: 0, Errors: 0, Time elapsed: 0.001 sec
There are no test to run.
Resume :
[surefire] Tests run: 2, Failures: 0, Errors: 0
Installing POM: /home/users/jvanzyl/maven-repo-local/maven/poms/maven-plugin-2.0-SNAPSHOT.pom
Installing JAR: /home/users/jvanzyl/maven-repo-local/maven/jars/maven-plugin-2.0-SNAPSHOT.jar
--------------------------------------------------------------------
Building project in /home/users/jvanzyl/m2-build/maven-components/maven-plugin-tools ...
--------------------------------------------------------------------
Building project in /home/users/jvanzyl/m2-build/maven-components/maven-plugin-tools
Cleaning /home/users/jvanzyl/m2-build/maven-components/maven-plugin-tools/target...
Downloading dependencies ...
.
Compiling sources ...
Packaging resources ...
Compiling test sources ...
Packaging test resources ...
-------------------------------------------------------
T E S T S
-------------------------------------------------------
[surefire] Running org.apache.maven.plugin.generator.jelly.JellyHarnessGeneratorTest
[surefire] Tests run: 1, Failures: 0, Errors: 0, Time elapsed: 0.471 sec
[surefire] Running org.apache.maven.plugin.generator.BeanGeneratorTest
[surefire] Tests run: 1, Failures: 0, Errors: 0, Time elapsed: 0.085 sec
[surefire] Running org.apache.maven.plugin.generator.PluginDescriptorGeneratorTest
[surefire] Tests run: 1, Failures: 0, Errors: 0, Time elapsed: 0.088 sec
[surefire] Running org.apache.maven.plugin.generator.PluginXdocGeneratorTest
[surefire] Tests run: 1, Failures: 0, Errors: 0, Time elapsed: 0.008 sec
There are no test to run.
Resume :
[surefire] Tests run: 4, Failures: 0, Errors: 0
Installing POM: /home/users/jvanzyl/maven-repo-local/maven/poms/maven-plugin-tools-2.0-SNAPSHOT.pom
Installing JAR: /home/users/jvanzyl/maven-repo-local/maven/jars/maven-plugin-tools-2.0-SNAPSHOT.jar
--------------------------------------------------------------------
Building project in /home/users/jvanzyl/m2-build/maven-components/maven-artifact ...
--------------------------------------------------------------------
Building project in /home/users/jvanzyl/m2-build/maven-components/maven-artifact
Cleaning /home/users/jvanzyl/m2-build/maven-components/maven-artifact/target...
Downloading dependencies ...
.................................
.
.
.
Compiling sources ...
Packaging resources ...
Compiling test sources ...
Packaging test resources ...
-------------------------------------------------------
T E S T S
-------------------------------------------------------
[surefire] Running org.apache.maven.artifact.deployer.ArtifactDeployerTest
[surefire] Tests run: 1, Failures: 0, Errors: 0, Time elapsed: 0.453 sec
[INFO] Installing /home/users/jvanzyl/m2-build/maven-components/maven-artifact/src/test/resources/artifact-install/artifact-1.0.jar to target/test-classes/repositories/installer/local-repository/maven/jars/artifact-1.0.jar
[surefire] Running org.apache.maven.artifact.installer.ArtifactInstallerTest
[surefire] Tests run: 1, Failures: 0, Errors: 0, Time elapsed: 0.044 sec
[ERROR] Nonexistent component: org.apache.maven.wagon.Wagond
[surefire] Running org.apache.maven.artifact.manager.DefaultWagonManagerTest
[surefire] Tests run: 1, Failures: 0, Errors: 0, Time elapsed: 0.042 sec
[surefire] Running org.apache.maven.artifact.resolver.ArtifactResolverTest
[surefire] Tests run: 8, Failures: 0, Errors: 0, Time elapsed: 0.046 sec
There are no test to run.
Resume :
[surefire] Tests run: 11, Failures: 0, Errors: 0
Installing POM: /home/users/jvanzyl/maven-repo-local/maven/poms/maven-artifact-2.0-SNAPSHOT.pom
Installing JAR: /home/users/jvanzyl/maven-repo-local/maven/jars/maven-artifact-2.0-SNAPSHOT.jar
--------------------------------------------------------------------
Building project in /home/users/jvanzyl/m2-build/maven-components/maven-core ...
--------------------------------------------------------------------
Building project in /home/users/jvanzyl/m2-build/maven-components/maven-core
Cleaning /home/users/jvanzyl/m2-build/maven-components/maven-core/target...
Downloading dependencies ...
.....
.
.
.....................
.
......
.
......................................................................................................
.
.........................
.
Compiling sources ...
Packaging resources ...
Compiling test sources ...
Packaging test resources ...
-------------------------------------------------------
T E S T S
-------------------------------------------------------
[surefire] Running org.apache.maven.lifecycle.goal.phase.GoalResolutionPhaseTest
[surefire] Tests run: 5, Failures: 0, Errors: 0, Time elapsed: 0.038 sec
[surefire] Running org.apache.maven.lifecycle.MavenLifecycleManagerTest
[surefire] Tests run: 1, Failures: 0, Errors: 0, Time elapsed: 0.052 sec
[surefire] Running org.apache.maven.plugin.OgnlProjectValueExtractorTest
[surefire] Tests run: 5, Failures: 0, Errors: 0, Time elapsed: 0.061 sec
[surefire] Running org.apache.maven.plugin.PluginTest
[surefire] Tests run: 1, Failures: 0, Errors: 0, Time elapsed: 0.027 sec
[surefire] Running org.apache.maven.project.ProjectBaseDirectoryAlignmentTest
[surefire] Tests run: 1, Failures: 0, Errors: 0, Time elapsed: 0.051 sec
[surefire] Running org.apache.maven.project.inheritance.t00.ProjectInheritanceTest
[surefire] Tests run: 1, Failures: 0, Errors: 0, Time elapsed: 0.11 sec
[surefire] Running org.apache.maven.project.inheritance.t01.ProjectInheritanceTest
[surefire] Tests run: 1, Failures: 0, Errors: 0, Time elapsed: 0.301 sec
[surefire] Running org.apache.maven.project.inheritance.DefaultModelInheritanceAssemblerTest
[surefire] Tests run: 1, Failures: 0, Errors: 0, Time elapsed: 0 sec
[surefire] Running org.apache.maven.project.validation.DefaultModelValidatorTest
[surefire] Tests run: 5, Failures: 0, Errors: 0, Time elapsed: 0.026 sec
There are no test to run.
Resume :
[surefire] Tests run: 21, Failures: 0, Errors: 0
Installing POM: /home/users/jvanzyl/maven-repo-local/maven/poms/maven-core-2.0-SNAPSHOT.pom
Installing JAR: /home/users/jvanzyl/maven-repo-local/maven/jars/maven-core-2.0-SNAPSHOT.jar
--------------------------------------------------------------------
Building project in /home/users/jvanzyl/m2-build/maven-components/maven-core-it-verifier ...
--------------------------------------------------------------------
Building project in /home/users/jvanzyl/m2-build/maven-components/maven-core-it-verifier
Cleaning /home/users/jvanzyl/m2-build/maven-components/maven-core-it-verifier/target...
Downloading dependencies ...
Compiling sources ...
Packaging resources ...
Compiling test sources ...
Packaging test resources ...
-------------------------------------------------------
T E S T S
-------------------------------------------------------
There are no test to run.
Resume :
[surefire] Tests run: 0, Failures: 0, Errors: 0
Installing POM: /home/users/jvanzyl/maven-repo-local/maven/poms/maven-core-it-verifier-1.0.pom
Installing JAR: /home/users/jvanzyl/maven-repo-local/maven/jars/maven-core-it-verifier-1.0.jar
--------------------------------------------------------------------
Building project in /home/users/jvanzyl/m2-build/maven-components/maven-plugins/maven-clean-plugin ...
--------------------------------------------------------------------
Building project in /home/users/jvanzyl/m2-build/maven-components/maven-plugins/maven-clean-plugin
Cleaning /home/users/jvanzyl/m2-build/maven-components/maven-plugins/maven-clean-plugin/target...
Downloading dependencies ...
Compiling sources ...
Generating maven plugin descriptor ...
Packaging resources ...
Compiling test sources ...
Packaging test resources ...
-------------------------------------------------------
T E S T S
-------------------------------------------------------
There are no test to run.
Resume :
[surefire] Tests run: 0, Failures: 0, Errors: 0
Installing POM: /home/users/jvanzyl/maven-repo-local/maven/poms/maven-clean-plugin-1.0-SNAPSHOT.pom
Installing Plugin: /home/users/jvanzyl/maven-repo-local/maven/plugins/maven-clean-plugin-1.0-SNAPSHOT.jar
--------------------------------------------------------------------
Building project in /home/users/jvanzyl/m2-build/maven-components/maven-plugins/maven-compiler-plugin ...
--------------------------------------------------------------------
Building project in /home/users/jvanzyl/m2-build/maven-components/maven-plugins/maven-compiler-plugin
Cleaning /home/users/jvanzyl/m2-build/maven-components/maven-plugins/maven-compiler-plugin/target...
Downloading dependencies ...
.....
.
...
.
Compiling sources ...
Generating maven plugin descriptor ...
Packaging resources ...
Compiling test sources ...
Packaging test resources ...
-------------------------------------------------------
T E S T S
-------------------------------------------------------
There are no test to run.
Resume :
[surefire] Tests run: 0, Failures: 0, Errors: 0
Installing POM: /home/users/jvanzyl/maven-repo-local/maven/poms/maven-compiler-plugin-1.0-SNAPSHOT.pom
Installing Plugin: /home/users/jvanzyl/maven-repo-local/maven/plugins/maven-compiler-plugin-1.0-SNAPSHOT.jar
--------------------------------------------------------------------
Building project in /home/users/jvanzyl/m2-build/maven-components/maven-plugins/maven-install-plugin ...
--------------------------------------------------------------------
Building project in /home/users/jvanzyl/m2-build/maven-components/maven-plugins/maven-install-plugin
Cleaning /home/users/jvanzyl/m2-build/maven-components/maven-plugins/maven-install-plugin/target...
Downloading dependencies ...
.
Compiling sources ...
Generating maven plugin descriptor ...
Packaging resources ...
Compiling test sources ...
Packaging test resources ...
-------------------------------------------------------
T E S T S
-------------------------------------------------------
There are no test to run.
Resume :
[surefire] Tests run: 0, Failures: 0, Errors: 0
Installing POM: /home/users/jvanzyl/maven-repo-local/maven/poms/maven-install-plugin-1.0-SNAPSHOT.pom
Installing Plugin: /home/users/jvanzyl/maven-repo-local/maven/plugins/maven-install-plugin-1.0-SNAPSHOT.jar
--------------------------------------------------------------------
Building project in /home/users/jvanzyl/m2-build/maven-components/maven-plugins/maven-jar-plugin ...
--------------------------------------------------------------------
Building project in /home/users/jvanzyl/m2-build/maven-components/maven-plugins/maven-jar-plugin
Cleaning /home/users/jvanzyl/m2-build/maven-components/maven-plugins/maven-jar-plugin/target...
Downloading dependencies ...
Compiling sources ...
Generating maven plugin descriptor ...
Packaging resources ...
Compiling test sources ...
Packaging test resources ...
-------------------------------------------------------
T E S T S
-------------------------------------------------------
There are no test to run.
Resume :
[surefire] Tests run: 0, Failures: 0, Errors: 0
Installing POM: /home/users/jvanzyl/maven-repo-local/maven/poms/maven-jar-plugin-1.0-SNAPSHOT.pom
Installing Plugin: /home/users/jvanzyl/maven-repo-local/maven/plugins/maven-jar-plugin-1.0-SNAPSHOT.jar
--------------------------------------------------------------------
Building project in /home/users/jvanzyl/m2-build/maven-components/maven-plugins/maven-plugin-plugin ...
--------------------------------------------------------------------
Building project in /home/users/jvanzyl/m2-build/maven-components/maven-plugins/maven-plugin-plugin
Cleaning /home/users/jvanzyl/m2-build/maven-components/maven-plugins/maven-plugin-plugin/target...
Downloading dependencies ...
Compiling sources ...
Generating maven plugin descriptor ...
Packaging resources ...
Compiling test sources ...
Packaging test resources ...
-------------------------------------------------------
T E S T S
-------------------------------------------------------
There are no test to run.
Resume :
[surefire] Tests run: 0, Failures: 0, Errors: 0
Installing POM: /home/users/jvanzyl/maven-repo-local/maven/poms/maven-plugin-plugin-1.0-SNAPSHOT.pom
Installing Plugin: /home/users/jvanzyl/maven-repo-local/maven/plugins/maven-plugin-plugin-1.0-SNAPSHOT.jar
--------------------------------------------------------------------
Building project in /home/users/jvanzyl/m2-build/maven-components/maven-plugins/maven-pom-plugin ...
--------------------------------------------------------------------
Building project in /home/users/jvanzyl/m2-build/maven-components/maven-plugins/maven-pom-plugin
Cleaning /home/users/jvanzyl/m2-build/maven-components/maven-plugins/maven-pom-plugin/target...
Downloading dependencies ...
Compiling sources ...
Generating maven plugin descriptor ...
Packaging resources ...
Compiling test sources ...
Packaging test resources ...
-------------------------------------------------------
T E S T S
-------------------------------------------------------
There are no test to run.
Resume :
[surefire] Tests run: 0, Failures: 0, Errors: 0
Installing POM: /home/users/jvanzyl/maven-repo-local/maven/poms/maven-pom-plugin-1.0-SNAPSHOT.pom
Installing Plugin: /home/users/jvanzyl/maven-repo-local/maven/plugins/maven-pom-plugin-1.0-SNAPSHOT.jar
--------------------------------------------------------------------
Building project in /home/users/jvanzyl/m2-build/maven-components/maven-plugins/maven-resources-plugin ...
--------------------------------------------------------------------
Building project in /home/users/jvanzyl/m2-build/maven-components/maven-plugins/maven-resources-plugin
Cleaning /home/users/jvanzyl/m2-build/maven-components/maven-plugins/maven-resources-plugin/target...
Downloading dependencies ...
Compiling sources ...
Generating maven plugin descriptor ...
Packaging resources ...
Compiling test sources ...
Packaging test resources ...
-------------------------------------------------------
T E S T S
-------------------------------------------------------
There are no test to run.
Resume :
[surefire] Tests run: 0, Failures: 0, Errors: 0
Installing POM: /home/users/jvanzyl/maven-repo-local/maven/poms/maven-resources-plugin-1.0-SNAPSHOT.pom
Installing Plugin: /home/users/jvanzyl/maven-repo-local/maven/plugins/maven-resources-plugin-1.0-SNAPSHOT.jar
--------------------------------------------------------------------
Building project in /home/users/jvanzyl/m2-build/maven-components/maven-plugins/maven-surefire-plugin ...
--------------------------------------------------------------------
Building project in /home/users/jvanzyl/m2-build/maven-components/maven-plugins/maven-surefire-plugin
Cleaning /home/users/jvanzyl/m2-build/maven-components/maven-plugins/maven-surefire-plugin/target...
Downloading dependencies ...
Compiling sources ...
Generating maven plugin descriptor ...
Packaging resources ...
Compiling test sources ...
Packaging test resources ...
-------------------------------------------------------
T E S T S
-------------------------------------------------------
There are no test to run.
Resume :
[surefire] Tests run: 0, Failures: 0, Errors: 0
Installing POM: /home/users/jvanzyl/maven-repo-local/maven/poms/maven-surefire-plugin-1.0-SNAPSHOT.pom
Installing Plugin: /home/users/jvanzyl/maven-repo-local/maven/plugins/maven-surefire-plugin-1.0-SNAPSHOT.jar
--------------------------------------------------------------------
Executing "chmod +x /home/users/jvanzyl/m2/bin/m2"
Total time: 59 seconds
Finished at: Thu Aug 26 08:02:19 EDT 2004
Running maven-core integration tests ...
org.apache.maven.artifact.resolver.ArtifactResolutionException: Error transitively resolving artifacts:
at org.apache.maven.artifact.resolver.DefaultArtifactResolver.resolveTransitively(DefaultArtifactResolver.java:129)
at org.codehaus.plexus.DefaultArtifactEnabledContainer.addComponent(DefaultArtifactEnabledContainer.java:111)
at org.apache.maven.plugin.DefaultPluginManager.addPlugin(DefaultPluginManager.java:267)
at org.apache.maven.plugin.DefaultPluginManager.verifyPluginForGoal(DefaultPluginManager.java:239)
at org.apache.maven.plugin.DefaultPluginManager.processEdge(DefaultPluginManager.java:168)
at org.apache.maven.plugin.DefaultPluginManager.processPluginDescriptor(DefaultPluginManager.java:132)
at org.apache.maven.plugin.DefaultPluginManager.componentDiscovered(DefaultPluginManager.java:196)
at org.codehaus.plexus.component.discovery.DefaultComponentDiscovererManager.fireComponentDiscoveryEvent(DefaultComponentDiscovererManager.java:47)
at org.codehaus.plexus.component.discovery.AbstractComponentDiscoverer.findComponents(AbstractComponentDiscoverer.java:61)
at org.codehaus.plexus.DefaultPlexusContainer.discoverComponents(DefaultPlexusContainer.java:486)
at org.codehaus.plexus.DefaultArtifactEnabledContainer.addComponent(DefaultArtifactEnabledContainer.java:76)
at org.apache.maven.plugin.DefaultPluginManager.addPlugin(DefaultPluginManager.java:267)
at org.apache.maven.plugin.DefaultPluginManager.verifyPluginForGoal(DefaultPluginManager.java:239)
at org.apache.maven.plugin.DefaultPluginManager.processEdge(DefaultPluginManager.java:168)
at org.apache.maven.plugin.DefaultPluginManager.processPluginDescriptor(DefaultPluginManager.java:132)
at org.apache.maven.plugin.DefaultPluginManager.componentDiscovered(DefaultPluginManager.java:196)
at org.codehaus.plexus.component.discovery.DefaultComponentDiscovererManager.fireComponentDiscoveryEvent(DefaultComponentDiscovererManager.java:47)
at org.codehaus.plexus.component.discovery.AbstractComponentDiscoverer.findComponents(AbstractComponentDiscoverer.java:61)
at org.codehaus.plexus.DefaultPlexusContainer.discoverComponents(DefaultPlexusContainer.java:486)
at org.codehaus.plexus.DefaultArtifactEnabledContainer.addComponent(DefaultArtifactEnabledContainer.java:76)
at org.apache.maven.plugin.DefaultPluginManager.addPlugin(DefaultPluginManager.java:267)
at org.apache.maven.plugin.DefaultPluginManager.verifyPluginForGoal(DefaultPluginManager.java:239)
at org.apache.maven.lifecycle.goal.phase.GoalResolutionPhase.resolveTopLevel(GoalResolutionPhase.java:81)
at org.apache.maven.lifecycle.goal.phase.GoalResolutionPhase.execute(GoalResolutionPhase.java:53)
at org.apache.maven.lifecycle.goal.DefaultMavenGoalPhaseManager.execute(DefaultMavenGoalPhaseManager.java:48)
at org.apache.maven.lifecycle.session.phase.GoalExecutionPhase.execute(GoalExecutionPhase.java:50)
at org.apache.maven.lifecycle.session.DefaultMavenSessionPhaseManager.execute(DefaultMavenSessionPhaseManager.java:48)
at org.apache.maven.DefaultMaven.execute(DefaultMaven.java:97)
at org.apache.maven.DefaultMaven.execute(DefaultMaven.java:82)
at org.apache.maven.MavenCli.main(MavenCli.java:151)
at sun.reflect.NativeMethodAccessorImpl.invoke0(Native Method)
at sun.reflect.NativeMethodAccessorImpl.invoke(NativeMethodAccessorImpl.java:39)
at sun.reflect.DelegatingMethodAccessorImpl.invoke(DelegatingMethodAccessorImpl.java:25)
at java.lang.reflect.Method.invoke(Method.java:324)
at org.codehaus.classworlds.Launcher.launchEnhanced(Launcher.java:350)
at org.codehaus.classworlds.Launcher.launch(Launcher.java:290)
at org.codehaus.classworlds.Launcher.main(Launcher.java:433)
Caused by: org.apache.maven.artifact.resolver.TransitiveArtifactResolutionException: Error retrieving metadata:
at org.apache.maven.artifact.resolver.DefaultArtifactResolver.collect(DefaultArtifactResolver.java:208)
at org.apache.maven.artifact.resolver.DefaultArtifactResolver.resolveTransitively(DefaultArtifactResolver.java:122)
... 36 more
Caused by: org.apache.maven.artifact.metadata.ArtifactMetadataRetrievalException: Cannot read artifact source:
at org.apache.maven.artifact.MavenMetadataSource.retrieve(MavenMetadataSource.java:79)
at org.apache.maven.artifact.resolver.DefaultArtifactResolver.collect(DefaultArtifactResolver.java:204)
... 37 more
Caused by: org.apache.maven.artifact.resolver.ArtifactResolutionException: The artifact is not present locally as:
/home/users/jvanzyl/maven-repo-local/plexus/poms/plexus-0.17.pom
or in any of the specified remote repositories:
http://www.ibiblio.org/maven
at org.apache.maven.artifact.resolver.DefaultArtifactResolver.resolve(DefaultArtifactResolver.java:53)
at org.apache.maven.artifact.MavenMetadataSource.retrieve(MavenMetadataSource.java:71)
... 38 more
Caused by: org.apache.maven.wagon.TransferFailedException: Unable to download the artifact from any repository
at org.apache.maven.artifact.manager.DefaultWagonManager.get(DefaultWagonManager.java:239)
at org.apache.maven.artifact.manager.DefaultWagonManager.get(DefaultWagonManager.java:109)
at org.apache.maven.artifact.resolver.DefaultArtifactResolver.resolve(DefaultArtifactResolver.java:49)
... 39 more
org.apache.maven.artifact.resolver.ArtifactResolutionException: Error transitively resolving artifacts:
at org.apache.maven.artifact.resolver.DefaultArtifactResolver.resolveTransitively(DefaultArtifactResolver.java:129)
at org.codehaus.plexus.DefaultArtifactEnabledContainer.addComponent(DefaultArtifactEnabledContainer.java:111)
at org.apache.maven.plugin.DefaultPluginManager.addPlugin(DefaultPluginManager.java:267)
at org.apache.maven.plugin.DefaultPluginManager.verifyPluginForGoal(DefaultPluginManager.java:239)
at org.apache.maven.plugin.DefaultPluginManager.processEdge(DefaultPluginManager.java:168)
at org.apache.maven.plugin.DefaultPluginManager.processPluginDescriptor(DefaultPluginManager.java:132)
at org.apache.maven.plugin.DefaultPluginManager.componentDiscovered(DefaultPluginManager.java:196)
at org.codehaus.plexus.component.discovery.DefaultComponentDiscovererManager.fireComponentDiscoveryEvent(DefaultComponentDiscovererManager.java:47)
at org.codehaus.plexus.component.discovery.AbstractComponentDiscoverer.findComponents(AbstractComponentDiscoverer.java:61)
at org.codehaus.plexus.DefaultPlexusContainer.discoverComponents(DefaultPlexusContainer.java:486)
at org.codehaus.plexus.DefaultArtifactEnabledContainer.addComponent(DefaultArtifactEnabledContainer.java:76)
at org.apache.maven.plugin.DefaultPluginManager.addPlugin(DefaultPluginManager.java:267)
at org.apache.maven.plugin.DefaultPluginManager.verifyPluginForGoal(DefaultPluginManager.java:239)
at org.apache.maven.plugin.DefaultPluginManager.processEdge(DefaultPluginManager.java:168)
at org.apache.maven.plugin.DefaultPluginManager.processPluginDescriptor(DefaultPluginManager.java:132)
at org.apache.maven.plugin.DefaultPluginManager.componentDiscovered(DefaultPluginManager.java:196)
at org.codehaus.plexus.component.discovery.DefaultComponentDiscovererManager.fireComponentDiscoveryEvent(DefaultComponentDiscovererManager.java:47)
at org.codehaus.plexus.component.discovery.AbstractComponentDiscoverer.findComponents(AbstractComponentDiscoverer.java:61)
at org.codehaus.plexus.DefaultPlexusContainer.discoverComponents(DefaultPlexusContainer.java:486)
at org.codehaus.plexus.DefaultArtifactEnabledContainer.addComponent(DefaultArtifactEnabledContainer.java:76)
at org.apache.maven.plugin.DefaultPluginManager.addPlugin(DefaultPluginManager.java:267)
at org.apache.maven.plugin.DefaultPluginManager.verifyPluginForGoal(DefaultPluginManager.java:239)
at org.apache.maven.lifecycle.goal.phase.GoalResolutionPhase.resolveTopLevel(GoalResolutionPhase.java:81)
at org.apache.maven.lifecycle.goal.phase.GoalResolutionPhase.execute(GoalResolutionPhase.java:53)
at org.apache.maven.lifecycle.goal.DefaultMavenGoalPhaseManager.execute(DefaultMavenGoalPhaseManager.java:48)
at org.apache.maven.lifecycle.session.phase.GoalExecutionPhase.execute(GoalExecutionPhase.java:50)
at org.apache.maven.lifecycle.session.DefaultMavenSessionPhaseManager.execute(DefaultMavenSessionPhaseManager.java:48)
at org.apache.maven.DefaultMaven.execute(DefaultMaven.java:97)
at org.apache.maven.DefaultMaven.execute(DefaultMaven.java:82)
at org.apache.maven.MavenCli.main(MavenCli.java:151)
at sun.reflect.NativeMethodAccessorImpl.invoke0(Native Method)
at sun.reflect.NativeMethodAccessorImpl.invoke(NativeMethodAccessorImpl.java:39)
at sun.reflect.DelegatingMethodAccessorImpl.invoke(DelegatingMethodAccessorImpl.java:25)
at java.lang.reflect.Method.invoke(Method.java:324)
at org.codehaus.classworlds.Launcher.launchEnhanced(Launcher.java:350)
at org.codehaus.classworlds.Launcher.launch(Launcher.java:290)
at org.codehaus.classworlds.Launcher.main(Launcher.java:433)
Caused by: org.apache.maven.artifact.resolver.TransitiveArtifactResolutionException: Error retrieving metadata:
at org.apache.maven.artifact.resolver.DefaultArtifactResolver.collect(DefaultArtifactResolver.java:208)
at org.apache.maven.artifact.resolver.DefaultArtifactResolver.resolveTransitively(DefaultArtifactResolver.java:122)
... 36 more
Caused by: org.apache.maven.artifact.metadata.ArtifactMetadataRetrievalException: Cannot read artifact source:
at org.apache.maven.artifact.MavenMetadataSource.retrieve(MavenMetadataSource.java:79)
at org.apache.maven.artifact.resolver.DefaultArtifactResolver.collect(DefaultArtifactResolver.java:204)
... 37 more
Caused by: org.apache.maven.artifact.resolver.ArtifactResolutionException: The artifact is not present locally as:
/home/users/jvanzyl/maven-repo-local/plexus/poms/plexus-0.17.pom
or in any of the specified remote repositories:
http://www.ibiblio.org/maven
at org.apache.maven.artifact.resolver.DefaultArtifactResolver.resolve(DefaultArtifactResolver.java:53)
at org.apache.maven.artifact.MavenMetadataSource.retrieve(MavenMetadataSource.java:71)
... 38 more
Caused by: org.apache.maven.wagon.TransferFailedException: Unable to download the artifact from any repository
at org.apache.maven.artifact.manager.DefaultWagonManager.get(DefaultWagonManager.java:239)
at org.apache.maven.artifact.manager.DefaultWagonManager.get(DefaultWagonManager.java:109)
at org.apache.maven.artifact.resolver.DefaultArtifactResolver.resolve(DefaultArtifactResolver.java:49)
... 39 more
Integration test it0000 FAILED!
Details:
[INFO] [clean:clean]
[INFO] ----------------------------------------------------------------------------
[ERROR] BUILD ERROR
[INFO] ----------------------------------------------------------------------------
[ERROR] Cause:
org.apache.maven.lifecycle.goal.GoalExecutionException: Error resolving goals:
at org.apache.maven.lifecycle.goal.phase.GoalResolutionPhase.execute(GoalResolutionPhase.java:68)
at org.apache.maven.lifecycle.goal.DefaultMavenGoalPhaseManager.execute(DefaultMavenGoalPhaseManager.java:48)
at org.apache.maven.lifecycle.session.phase.GoalExecutionPhase.execute(GoalExecutionPhase.java:50)
at org.apache.maven.lifecycle.session.DefaultMavenSessionPhaseManager.execute(DefaultMavenSessionPhaseManager.java:48)
at org.apache.maven.DefaultMaven.execute(DefaultMaven.java:97)
at org.apache.maven.DefaultMaven.execute(DefaultMaven.java:82)
at org.apache.maven.MavenCli.main(MavenCli.java:151)
at sun.reflect.NativeMethodAccessorImpl.invoke0(Native Method)
at sun.reflect.NativeMethodAccessorImpl.invoke(NativeMethodAccessorImpl.java:39)
at sun.reflect.DelegatingMethodAccessorImpl.invoke(DelegatingMethodAccessorImpl.java:25)
at java.lang.reflect.Method.invoke(Method.java:324)
at org.codehaus.classworlds.Launcher.launchEnhanced(Launcher.java:350)
at org.codehaus.classworlds.Launcher.launch(Launcher.java:290)
at org.codehaus.classworlds.Launcher.main(Launcher.java:433)
Caused by: org.apache.maven.artifact.resolver.ArtifactResolutionException: Error transitively resolving artifacts:
at org.apache.maven.artifact.resolver.DefaultArtifactResolver.resolveTransitively(DefaultArtifactResolver.java:129)
at org.codehaus.plexus.DefaultArtifactEnabledContainer.addComponent(DefaultArtifactEnabledContainer.java:111)
at org.apache.maven.plugin.DefaultPluginManager.addPlugin(DefaultPluginManager.java:267)
at org.apache.maven.plugin.DefaultPluginManager.verifyPluginForGoal(DefaultPluginManager.java:239)
at org.apache.maven.lifecycle.goal.phase.GoalResolutionPhase.resolveTopLevel(GoalResolutionPhase.java:81)
at org.apache.maven.lifecycle.goal.phase.GoalResolutionPhase.execute(GoalResolutionPhase.java:53)
... 13 more
Caused by: org.apache.maven.artifact.resolver.TransitiveArtifactResolutionException: Error retrieving metadata:
at org.apache.maven.artifact.resolver.DefaultArtifactResolver.collect(DefaultArtifactResolver.java:208)
at org.apache.maven.artifact.resolver.DefaultArtifactResolver.resolveTransitively(DefaultArtifactResolver.java:122)
... 18 more
Caused by: org.apache.maven.artifact.metadata.ArtifactMetadataRetrievalException: Cannot read artifact source:
at org.apache.maven.artifact.MavenMetadataSource.retrieve(MavenMetadataSource.java:79)
at org.apache.maven.artifact.resolver.DefaultArtifactResolver.collect(DefaultArtifactResolver.java:204)
... 19 more
Caused by: org.apache.maven.artifact.resolver.ArtifactResolutionException: The artifact is not present locally as:
/home/users/jvanzyl/maven-repo-local/plexus/poms/plexus-0.17.pom
or in any of the specified remote repositories:
http://www.ibiblio.org/maven
at org.apache.maven.artifact.resolver.DefaultArtifactResolver.resolve(DefaultArtifactResolver.java:53)
at org.apache.maven.artifact.MavenMetadataSource.retrieve(MavenMetadataSource.java:71)
... 20 more
Caused by: org.apache.maven.wagon.TransferFailedException: Unable to download the artifact from any repository
at org.apache.maven.artifact.manager.DefaultWagonManager.get(DefaultWagonManager.java:239)
at org.apache.maven.artifact.manager.DefaultWagonManager.get(DefaultWagonManager.java:109)
at org.apache.maven.artifact.resolver.DefaultArtifactResolver.resolve(DefaultArtifactResolver.java:49)
... 21 more
[INFO] ----------------------------------------------------------------------------
[INFO] Total time: 4 seconds
[INFO] Finished at: Thu Aug 26 08:02:25 EDT 2004
[INFO] Final Memory: 0M/1M
[INFO] ----------------------------------------------------------------------------
org.apache.maven.it.VerificationException: Expected file was not found: ./target/classes/org/apache/maven/it0000/Person.class
org.apache.maven.artifact.resolver.ArtifactResolutionException: Error transitively resolving artifacts:
at org.apache.maven.artifact.resolver.DefaultArtifactResolver.resolveTransitively(DefaultArtifactResolver.java:129)
at org.codehaus.plexus.DefaultArtifactEnabledContainer.addComponent(DefaultArtifactEnabledContainer.java:111)
at org.apache.maven.plugin.DefaultPluginManager.addPlugin(DefaultPluginManager.java:267)
at org.apache.maven.plugin.DefaultPluginManager.verifyPluginForGoal(DefaultPluginManager.java:239)
at org.apache.maven.plugin.DefaultPluginManager.processEdge(DefaultPluginManager.java:168)
at org.apache.maven.plugin.DefaultPluginManager.processPluginDescriptor(DefaultPluginManager.java:132)
at org.apache.maven.plugin.DefaultPluginManager.componentDiscovered(DefaultPluginManager.java:196)
at org.codehaus.plexus.component.discovery.DefaultComponentDiscovererManager.fireComponentDiscoveryEvent(DefaultComponentDiscovererManager.java:47)
at org.codehaus.plexus.component.discovery.AbstractComponentDiscoverer.findComponents(AbstractComponentDiscoverer.java:61)
at org.codehaus.plexus.DefaultPlexusContainer.discoverComponents(DefaultPlexusContainer.java:486)
at org.codehaus.plexus.DefaultArtifactEnabledContainer.addComponent(DefaultArtifactEnabledContainer.java:76)
at org.apache.maven.plugin.DefaultPluginManager.addPlugin(DefaultPluginManager.java:267)
at org.apache.maven.plugin.DefaultPluginManager.verifyPluginForGoal(DefaultPluginManager.java:239)
at org.apache.maven.plugin.DefaultPluginManager.processEdge(DefaultPluginManager.java:168)
at org.apache.maven.plugin.DefaultPluginManager.processPluginDescriptor(DefaultPluginManager.java:132)
at org.apache.maven.plugin.DefaultPluginManager.componentDiscovered(DefaultPluginManager.java:196)
at org.codehaus.plexus.component.discovery.DefaultComponentDiscovererManager.fireComponentDiscoveryEvent(DefaultComponentDiscovererManager.java:47)
at org.codehaus.plexus.component.discovery.AbstractComponentDiscoverer.findComponents(AbstractComponentDiscoverer.java:61)
at org.codehaus.plexus.DefaultPlexusContainer.discoverComponents(DefaultPlexusContainer.java:486)
at org.codehaus.plexus.DefaultArtifactEnabledContainer.addComponent(DefaultArtifactEnabledContainer.java:76)
at org.apache.maven.plugin.DefaultPluginManager.addPlugin(DefaultPluginManager.java:267)
at org.apache.maven.plugin.DefaultPluginManager.verifyPluginForGoal(DefaultPluginManager.java:239)
at org.apache.maven.lifecycle.goal.phase.GoalResolutionPhase.resolveTopLevel(GoalResolutionPhase.java:81)
at org.apache.maven.lifecycle.goal.phase.GoalResolutionPhase.execute(GoalResolutionPhase.java:53)
at org.apache.maven.lifecycle.goal.DefaultMavenGoalPhaseManager.execute(DefaultMavenGoalPhaseManager.java:48)
at org.apache.maven.lifecycle.session.phase.GoalExecutionPhase.execute(GoalExecutionPhase.java:50)
at org.apache.maven.lifecycle.session.DefaultMavenSessionPhaseManager.execute(DefaultMavenSessionPhaseManager.java:48)
at org.apache.maven.DefaultMaven.execute(DefaultMaven.java:97)
at org.apache.maven.DefaultMaven.execute(DefaultMaven.java:82)
at org.apache.maven.MavenCli.main(MavenCli.java:151)
at sun.reflect.NativeMethodAccessorImpl.invoke0(Native Method)
at sun.reflect.NativeMethodAccessorImpl.invoke(NativeMethodAccessorImpl.java:39)
at sun.reflect.DelegatingMethodAccessorImpl.invoke(DelegatingMethodAccessorImpl.java:25)
at java.lang.reflect.Method.invoke(Method.java:324)
at org.codehaus.classworlds.Launcher.launchEnhanced(Launcher.java:350)
at org.codehaus.classworlds.Launcher.launch(Launcher.java:290)
at org.codehaus.classworlds.Launcher.main(Launcher.java:433)
Caused by: org.apache.maven.artifact.resolver.TransitiveArtifactResolutionException: Error retrieving metadata:
at org.apache.maven.artifact.resolver.DefaultArtifactResolver.collect(DefaultArtifactResolver.java:208)
at org.apache.maven.artifact.resolver.DefaultArtifactResolver.resolveTransitively(DefaultArtifactResolver.java:122)
... 36 more
Caused by: org.apache.maven.artifact.metadata.ArtifactMetadataRetrievalException: Cannot read artifact source:
at org.apache.maven.artifact.MavenMetadataSource.retrieve(MavenMetadataSource.java:79)
at org.apache.maven.artifact.resolver.DefaultArtifactResolver.collect(DefaultArtifactResolver.java:204)
... 37 more
Caused by: org.apache.maven.artifact.resolver.ArtifactResolutionException: The artifact is not present locally as:
/home/users/jvanzyl/maven-repo-local/plexus/poms/plexus-0.17.pom
or in any of the specified remote repositories:
http://www.ibiblio.org/maven
at org.apache.maven.artifact.resolver.DefaultArtifactResolver.resolve(DefaultArtifactResolver.java:53)
at org.apache.maven.artifact.MavenMetadataSource.retrieve(MavenMetadataSource.java:71)
... 38 more
Caused by: org.apache.maven.wagon.TransferFailedException: Unable to download the artifact from any repository
at org.apache.maven.artifact.manager.DefaultWagonManager.get(DefaultWagonManager.java:239)
at org.apache.maven.artifact.manager.DefaultWagonManager.get(DefaultWagonManager.java:109)
at org.apache.maven.artifact.resolver.DefaultArtifactResolver.resolve(DefaultArtifactResolver.java:49)
... 39 more
org.apache.maven.artifact.resolver.ArtifactResolutionException: Error transitively resolving artifacts:
at org.apache.maven.artifact.resolver.DefaultArtifactResolver.resolveTransitively(DefaultArtifactResolver.java:129)
at org.codehaus.plexus.DefaultArtifactEnabledContainer.addComponent(DefaultArtifactEnabledContainer.java:111)
at org.apache.maven.plugin.DefaultPluginManager.addPlugin(DefaultPluginManager.java:267)
at org.apache.maven.plugin.DefaultPluginManager.verifyPluginForGoal(DefaultPluginManager.java:239)
at org.apache.maven.plugin.DefaultPluginManager.processEdge(DefaultPluginManager.java:168)
at org.apache.maven.plugin.DefaultPluginManager.processPluginDescriptor(DefaultPluginManager.java:132)
at org.apache.maven.plugin.DefaultPluginManager.componentDiscovered(DefaultPluginManager.java:196)
at org.codehaus.plexus.component.discovery.DefaultComponentDiscovererManager.fireComponentDiscoveryEvent(DefaultComponentDiscovererManager.java:47)
at org.codehaus.plexus.component.discovery.AbstractComponentDiscoverer.findComponents(AbstractComponentDiscoverer.java:61)
at org.codehaus.plexus.DefaultPlexusContainer.discoverComponents(DefaultPlexusContainer.java:486)
at org.codehaus.plexus.DefaultArtifactEnabledContainer.addComponent(DefaultArtifactEnabledContainer.java:76)
at org.apache.maven.plugin.DefaultPluginManager.addPlugin(DefaultPluginManager.java:267)
at org.apache.maven.plugin.DefaultPluginManager.verifyPluginForGoal(DefaultPluginManager.java:239)
at org.apache.maven.plugin.DefaultPluginManager.processEdge(DefaultPluginManager.java:168)
at org.apache.maven.plugin.DefaultPluginManager.processPluginDescriptor(DefaultPluginManager.java:132)
at org.apache.maven.plugin.DefaultPluginManager.componentDiscovered(DefaultPluginManager.java:196)
at org.codehaus.plexus.component.discovery.DefaultComponentDiscovererManager.fireComponentDiscoveryEvent(DefaultComponentDiscovererManager.java:47)
at org.codehaus.plexus.component.discovery.AbstractComponentDiscoverer.findComponents(AbstractComponentDiscoverer.java:61)
at org.codehaus.plexus.DefaultPlexusContainer.discoverComponents(DefaultPlexusContainer.java:486)
at org.codehaus.plexus.DefaultArtifactEnabledContainer.addComponent(DefaultArtifactEnabledContainer.java:76)
at org.apache.maven.plugin.DefaultPluginManager.addPlugin(DefaultPluginManager.java:267)
at org.apache.maven.plugin.DefaultPluginManager.verifyPluginForGoal(DefaultPluginManager.java:239)
at org.apache.maven.lifecycle.goal.phase.GoalResolutionPhase.resolveTopLevel(GoalResolutionPhase.java:81)
at org.apache.maven.lifecycle.goal.phase.GoalResolutionPhase.execute(GoalResolutionPhase.java:53)
at org.apache.maven.lifecycle.goal.DefaultMavenGoalPhaseManager.execute(DefaultMavenGoalPhaseManager.java:48)
at org.apache.maven.lifecycle.session.phase.GoalExecutionPhase.execute(GoalExecutionPhase.java:50)
at org.apache.maven.lifecycle.session.DefaultMavenSessionPhaseManager.execute(DefaultMavenSessionPhaseManager.java:48)
at org.apache.maven.DefaultMaven.execute(DefaultMaven.java:97)
at org.apache.maven.DefaultMaven.execute(DefaultMaven.java:82)
at org.apache.maven.MavenCli.main(MavenCli.java:151)
at sun.reflect.NativeMethodAccessorImpl.invoke0(Native Method)
at sun.reflect.NativeMethodAccessorImpl.invoke(NativeMethodAccessorImpl.java:39)
at sun.reflect.DelegatingMethodAccessorImpl.invoke(DelegatingMethodAccessorImpl.java:25)
at java.lang.reflect.Method.invoke(Method.java:324)
at org.codehaus.classworlds.Launcher.launchEnhanced(Launcher.java:350)
at org.codehaus.classworlds.Launcher.launch(Launcher.java:290)
at org.codehaus.classworlds.Launcher.main(Launcher.java:433)
Caused by: org.apache.maven.artifact.resolver.TransitiveArtifactResolutionException: Error retrieving metadata:
at org.apache.maven.artifact.resolver.DefaultArtifactResolver.collect(DefaultArtifactResolver.java:208)
at org.apache.maven.artifact.resolver.DefaultArtifactResolver.resolveTransitively(DefaultArtifactResolver.java:122)
... 36 more
Caused by: org.apache.maven.artifact.metadata.ArtifactMetadataRetrievalException: Cannot read artifact source:
at org.apache.maven.artifact.MavenMetadataSource.retrieve(MavenMetadataSource.java:79)
at org.apache.maven.artifact.resolver.DefaultArtifactResolver.collect(DefaultArtifactResolver.java:204)
... 37 more
Caused by: org.apache.maven.artifact.resolver.ArtifactResolutionException: The artifact is not present locally as:
/home/users/jvanzyl/maven-repo-local/plexus/poms/plexus-0.17.pom
or in any of the specified remote repositories:
http://www.ibiblio.org/maven
at org.apache.maven.artifact.resolver.DefaultArtifactResolver.resolve(DefaultArtifactResolver.java:53)
at org.apache.maven.artifact.MavenMetadataSource.retrieve(MavenMetadataSource.java:71)
... 38 more
Caused by: org.apache.maven.wagon.TransferFailedException: Unable to download the artifact from any repository
at org.apache.maven.artifact.manager.DefaultWagonManager.get(DefaultWagonManager.java:239)
at org.apache.maven.artifact.manager.DefaultWagonManager.get(DefaultWagonManager.java:109)
at org.apache.maven.artifact.resolver.DefaultArtifactResolver.resolve(DefaultArtifactResolver.java:49)
... 39 more
Integration test it0001 FAILED!
Details:
[INFO] [clean:clean]
[INFO] ----------------------------------------------------------------------------
[ERROR] BUILD ERROR
[INFO] ----------------------------------------------------------------------------
[ERROR] Cause:
org.apache.maven.lifecycle.goal.GoalExecutionException: Error resolving goals:
at org.apache.maven.lifecycle.goal.phase.GoalResolutionPhase.execute(GoalResolutionPhase.java:68)
at org.apache.maven.lifecycle.goal.DefaultMavenGoalPhaseManager.execute(DefaultMavenGoalPhaseManager.java:48)
at org.apache.maven.lifecycle.session.phase.GoalExecutionPhase.execute(GoalExecutionPhase.java:50)
at org.apache.maven.lifecycle.session.DefaultMavenSessionPhaseManager.execute(DefaultMavenSessionPhaseManager.java:48)
at org.apache.maven.DefaultMaven.execute(DefaultMaven.java:97)
at org.apache.maven.DefaultMaven.execute(DefaultMaven.java:82)
at org.apache.maven.MavenCli.main(MavenCli.java:151)
at sun.reflect.NativeMethodAccessorImpl.invoke0(Native Method)
at sun.reflect.NativeMethodAccessorImpl.invoke(NativeMethodAccessorImpl.java:39)
at sun.reflect.DelegatingMethodAccessorImpl.invoke(DelegatingMethodAccessorImpl.java:25)
at java.lang.reflect.Method.invoke(Method.java:324)
at org.codehaus.classworlds.Launcher.launchEnhanced(Launcher.java:350)
at org.codehaus.classworlds.Launcher.launch(Launcher.java:290)
at org.codehaus.classworlds.Launcher.main(Launcher.java:433)
Caused by: org.apache.maven.artifact.resolver.ArtifactResolutionException: Error transitively resolving artifacts:
at org.apache.maven.artifact.resolver.DefaultArtifactResolver.resolveTransitively(DefaultArtifactResolver.java:129)
at org.codehaus.plexus.DefaultArtifactEnabledContainer.addComponent(DefaultArtifactEnabledContainer.java:111)
at org.apache.maven.plugin.DefaultPluginManager.addPlugin(DefaultPluginManager.java:267)
at org.apache.maven.plugin.DefaultPluginManager.verifyPluginForGoal(DefaultPluginManager.java:239)
at org.apache.maven.lifecycle.goal.phase.GoalResolutionPhase.resolveTopLevel(GoalResolutionPhase.java:81)
at org.apache.maven.lifecycle.goal.phase.GoalResolutionPhase.execute(GoalResolutionPhase.java:53)
... 13 more
Caused by: org.apache.maven.artifact.resolver.TransitiveArtifactResolutionException: Error retrieving metadata:
at org.apache.maven.artifact.resolver.DefaultArtifactResolver.collect(DefaultArtifactResolver.java:208)
at org.apache.maven.artifact.resolver.DefaultArtifactResolver.resolveTransitively(DefaultArtifactResolver.java:122)
... 18 more
Caused by: org.apache.maven.artifact.metadata.ArtifactMetadataRetrievalException: Cannot read artifact source:
at org.apache.maven.artifact.MavenMetadataSource.retrieve(MavenMetadataSource.java:79)
at org.apache.maven.artifact.resolver.DefaultArtifactResolver.collect(DefaultArtifactResolver.java:204)
... 19 more
Caused by: org.apache.maven.artifact.resolver.ArtifactResolutionException: The artifact is not present locally as:
/home/users/jvanzyl/maven-repo-local/plexus/poms/plexus-0.17.pom
or in any of the specified remote repositories:
http://www.ibiblio.org/maven
at org.apache.maven.artifact.resolver.DefaultArtifactResolver.resolve(DefaultArtifactResolver.java:53)
at org.apache.maven.artifact.MavenMetadataSource.retrieve(MavenMetadataSource.java:71)
... 20 more
Caused by: org.apache.maven.wagon.TransferFailedException: Unable to download the artifact from any repository
at org.apache.maven.artifact.manager.DefaultWagonManager.get(DefaultWagonManager.java:239)
at org.apache.maven.artifact.manager.DefaultWagonManager.get(DefaultWagonManager.java:109)
at org.apache.maven.artifact.resolver.DefaultArtifactResolver.resolve(DefaultArtifactResolver.java:49)
... 21 more
[INFO] ----------------------------------------------------------------------------
[INFO] Total time: 0 seconds
[INFO] Finished at: Thu Aug 26 08:02:27 EDT 2004
[INFO] Final Memory: 0M/1M
[INFO] ----------------------------------------------------------------------------
org.apache.maven.it.VerificationException: Expected file was not found: ./target/classes/org/apache/maven/it0001/Person.class
org.apache.maven.artifact.resolver.ArtifactResolutionException: Error transitively resolving artifacts:
at org.apache.maven.artifact.resolver.DefaultArtifactResolver.resolveTransitively(DefaultArtifactResolver.java:129)
at org.codehaus.plexus.DefaultArtifactEnabledContainer.addComponent(DefaultArtifactEnabledContainer.java:111)
at org.apache.maven.plugin.DefaultPluginManager.addPlugin(DefaultPluginManager.java:267)
at org.apache.maven.plugin.DefaultPluginManager.verifyPluginForGoal(DefaultPluginManager.java:239)
at org.apache.maven.plugin.DefaultPluginManager.processEdge(DefaultPluginManager.java:168)
at org.apache.maven.plugin.DefaultPluginManager.processPluginDescriptor(DefaultPluginManager.java:132)
at org.apache.maven.plugin.DefaultPluginManager.componentDiscovered(DefaultPluginManager.java:196)
at org.codehaus.plexus.component.discovery.DefaultComponentDiscovererManager.fireComponentDiscoveryEvent(DefaultComponentDiscovererManager.java:47)
at org.codehaus.plexus.component.discovery.AbstractComponentDiscoverer.findComponents(AbstractComponentDiscoverer.java:61)
at org.codehaus.plexus.DefaultPlexusContainer.discoverComponents(DefaultPlexusContainer.java:486)
at org.codehaus.plexus.DefaultArtifactEnabledContainer.addComponent(DefaultArtifactEnabledContainer.java:76)
at org.apache.maven.plugin.DefaultPluginManager.addPlugin(DefaultPluginManager.java:267)
at org.apache.maven.plugin.DefaultPluginManager.verifyPluginForGoal(DefaultPluginManager.java:239)
at org.apache.maven.plugin.DefaultPluginManager.processEdge(DefaultPluginManager.java:168)
at org.apache.maven.plugin.DefaultPluginManager.processPluginDescriptor(DefaultPluginManager.java:132)
at org.apache.maven.plugin.DefaultPluginManager.componentDiscovered(DefaultPluginManager.java:196)
at org.codehaus.plexus.component.discovery.DefaultComponentDiscovererManager.fireComponentDiscoveryEvent(DefaultComponentDiscovererManager.java:47)
at org.codehaus.plexus.component.discovery.AbstractComponentDiscoverer.findComponents(AbstractComponentDiscoverer.java:61)
at org.codehaus.plexus.DefaultPlexusContainer.discoverComponents(DefaultPlexusContainer.java:486)
at org.codehaus.plexus.DefaultArtifactEnabledContainer.addComponent(DefaultArtifactEnabledContainer.java:76)
at org.apache.maven.plugin.DefaultPluginManager.addPlugin(DefaultPluginManager.java:267)
at org.apache.maven.plugin.DefaultPluginManager.verifyPluginForGoal(DefaultPluginManager.java:239)
at org.apache.maven.lifecycle.goal.phase.GoalResolutionPhase.resolveTopLevel(GoalResolutionPhase.java:81)
at org.apache.maven.lifecycle.goal.phase.GoalResolutionPhase.execute(GoalResolutionPhase.java:53)
at org.apache.maven.lifecycle.goal.DefaultMavenGoalPhaseManager.execute(DefaultMavenGoalPhaseManager.java:48)
at org.apache.maven.lifecycle.session.phase.GoalExecutionPhase.execute(GoalExecutionPhase.java:50)
at org.apache.maven.lifecycle.session.DefaultMavenSessionPhaseManager.execute(DefaultMavenSessionPhaseManager.java:48)
at org.apache.maven.DefaultMaven.execute(DefaultMaven.java:97)
at org.apache.maven.DefaultMaven.execute(DefaultMaven.java:82)
at org.apache.maven.MavenCli.main(MavenCli.java:151)
at sun.reflect.NativeMethodAccessorImpl.invoke0(Native Method)
at sun.reflect.NativeMethodAccessorImpl.invoke(NativeMethodAccessorImpl.java:39)
at sun.reflect.DelegatingMethodAccessorImpl.invoke(DelegatingMethodAccessorImpl.java:25)
at java.lang.reflect.Method.invoke(Method.java:324)
at org.codehaus.classworlds.Launcher.launchEnhanced(Launcher.java:350)
at org.codehaus.classworlds.Launcher.launch(Launcher.java:290)
at org.codehaus.classworlds.Launcher.main(Launcher.java:433)
Caused by: org.apache.maven.artifact.resolver.TransitiveArtifactResolutionException: Error retrieving metadata:
at org.apache.maven.artifact.resolver.DefaultArtifactResolver.collect(DefaultArtifactResolver.java:208)
at org.apache.maven.artifact.resolver.DefaultArtifactResolver.resolveTransitively(DefaultArtifactResolver.java:122)
... 36 more
Caused by: org.apache.maven.artifact.metadata.ArtifactMetadataRetrievalException: Cannot read artifact source:
at org.apache.maven.artifact.MavenMetadataSource.retrieve(MavenMetadataSource.java:79)
at org.apache.maven.artifact.resolver.DefaultArtifactResolver.collect(DefaultArtifactResolver.java:204)
... 37 more
Caused by: org.apache.maven.artifact.resolver.ArtifactResolutionException: The artifact is not present locally as:
/home/users/jvanzyl/maven-repo-local/plexus/poms/plexus-0.17.pom
or in any of the specified remote repositories:
http://www.ibiblio.org/maven
at org.apache.maven.artifact.resolver.DefaultArtifactResolver.resolve(DefaultArtifactResolver.java:53)
at org.apache.maven.artifact.MavenMetadataSource.retrieve(MavenMetadataSource.java:71)
... 38 more
Caused by: org.apache.maven.wagon.TransferFailedException: Unable to download the artifact from any repository
at org.apache.maven.artifact.manager.DefaultWagonManager.get(DefaultWagonManager.java:239)
at org.apache.maven.artifact.manager.DefaultWagonManager.get(DefaultWagonManager.java:109)
at org.apache.maven.artifact.resolver.DefaultArtifactResolver.resolve(DefaultArtifactResolver.java:49)
... 39 more
org.apache.maven.artifact.resolver.ArtifactResolutionException: Error transitively resolving artifacts:
at org.apache.maven.artifact.resolver.DefaultArtifactResolver.resolveTransitively(DefaultArtifactResolver.java:129)
at org.codehaus.plexus.DefaultArtifactEnabledContainer.addComponent(DefaultArtifactEnabledContainer.java:111)
at org.apache.maven.plugin.DefaultPluginManager.addPlugin(DefaultPluginManager.java:267)
at org.apache.maven.plugin.DefaultPluginManager.verifyPluginForGoal(DefaultPluginManager.java:239)
at org.apache.maven.plugin.DefaultPluginManager.processEdge(DefaultPluginManager.java:168)
at org.apache.maven.plugin.DefaultPluginManager.processPluginDescriptor(DefaultPluginManager.java:132)
at org.apache.maven.plugin.DefaultPluginManager.componentDiscovered(DefaultPluginManager.java:196)
at org.codehaus.plexus.component.discovery.DefaultComponentDiscovererManager.fireComponentDiscoveryEvent(DefaultComponentDiscovererManager.java:47)
at org.codehaus.plexus.component.discovery.AbstractComponentDiscoverer.findComponents(AbstractComponentDiscoverer.java:61)
at org.codehaus.plexus.DefaultPlexusContainer.discoverComponents(DefaultPlexusContainer.java:486)
at org.codehaus.plexus.DefaultArtifactEnabledContainer.addComponent(DefaultArtifactEnabledContainer.java:76)
at org.apache.maven.plugin.DefaultPluginManager.addPlugin(DefaultPluginManager.java:267)
at org.apache.maven.plugin.DefaultPluginManager.verifyPluginForGoal(DefaultPluginManager.java:239)
at org.apache.maven.plugin.DefaultPluginManager.processEdge(DefaultPluginManager.java:168)
at org.apache.maven.plugin.DefaultPluginManager.processPluginDescriptor(DefaultPluginManager.java:132)
at org.apache.maven.plugin.DefaultPluginManager.componentDiscovered(DefaultPluginManager.java:196)
at org.codehaus.plexus.component.discovery.DefaultComponentDiscovererManager.fireComponentDiscoveryEvent(DefaultComponentDiscovererManager.java:47)
at org.codehaus.plexus.component.discovery.AbstractComponentDiscoverer.findComponents(AbstractComponentDiscoverer.java:61)
at org.codehaus.plexus.DefaultPlexusContainer.discoverComponents(DefaultPlexusContainer.java:486)
at org.codehaus.plexus.DefaultArtifactEnabledContainer.addComponent(DefaultArtifactEnabledContainer.java:76)
at org.apache.maven.plugin.DefaultPluginManager.addPlugin(DefaultPluginManager.java:267)
at org.apache.maven.plugin.DefaultPluginManager.verifyPluginForGoal(DefaultPluginManager.java:239)
at org.apache.maven.lifecycle.goal.phase.GoalResolutionPhase.resolveTopLevel(GoalResolutionPhase.java:81)
at org.apache.maven.lifecycle.goal.phase.GoalResolutionPhase.execute(GoalResolutionPhase.java:53)
at org.apache.maven.lifecycle.goal.DefaultMavenGoalPhaseManager.execute(DefaultMavenGoalPhaseManager.java:48)
at org.apache.maven.lifecycle.session.phase.GoalExecutionPhase.execute(GoalExecutionPhase.java:50)
at org.apache.maven.lifecycle.session.DefaultMavenSessionPhaseManager.execute(DefaultMavenSessionPhaseManager.java:48)
at org.apache.maven.DefaultMaven.execute(DefaultMaven.java:97)
at org.apache.maven.DefaultMaven.execute(DefaultMaven.java:82)
at org.apache.maven.MavenCli.main(MavenCli.java:151)
at sun.reflect.NativeMethodAccessorImpl.invoke0(Native Method)
at sun.reflect.NativeMethodAccessorImpl.invoke(NativeMethodAccessorImpl.java:39)
at sun.reflect.DelegatingMethodAccessorImpl.invoke(DelegatingMethodAccessorImpl.java:25)
at java.lang.reflect.Method.invoke(Method.java:324)
at org.codehaus.classworlds.Launcher.launchEnhanced(Launcher.java:350)
at org.codehaus.classworlds.Launcher.launch(Launcher.java:290)
at org.codehaus.classworlds.Launcher.main(Launcher.java:433)
Caused by: org.apache.maven.artifact.resolver.TransitiveArtifactResolutionException: Error retrieving metadata:
at org.apache.maven.artifact.resolver.DefaultArtifactResolver.collect(DefaultArtifactResolver.java:208)
at org.apache.maven.artifact.resolver.DefaultArtifactResolver.resolveTransitively(DefaultArtifactResolver.java:122)
... 36 more
Caused by: org.apache.maven.artifact.metadata.ArtifactMetadataRetrievalException: Cannot read artifact source:
at org.apache.maven.artifact.MavenMetadataSource.retrieve(MavenMetadataSource.java:79)
at org.apache.maven.artifact.resolver.DefaultArtifactResolver.collect(DefaultArtifactResolver.java:204)
... 37 more
Caused by: org.apache.maven.artifact.resolver.ArtifactResolutionException: The artifact is not present locally as:
/home/users/jvanzyl/maven-repo-local/plexus/poms/plexus-0.17.pom
or in any of the specified remote repositories:
http://www.ibiblio.org/maven
at org.apache.maven.artifact.resolver.DefaultArtifactResolver.resolve(DefaultArtifactResolver.java:53)
at org.apache.maven.artifact.MavenMetadataSource.retrieve(MavenMetadataSource.java:71)
... 38 more
Caused by: org.apache.maven.wagon.TransferFailedException: Unable to download the artifact from any repository
at org.apache.maven.artifact.manager.DefaultWagonManager.get(DefaultWagonManager.java:239)
at org.apache.maven.artifact.manager.DefaultWagonManager.get(DefaultWagonManager.java:109)
at org.apache.maven.artifact.resolver.DefaultArtifactResolver.resolve(DefaultArtifactResolver.java:49)
... 39 more
Integration test it0002 FAILED!
Details:
Removing maven-it-support-1.0.jar from the local repository so we can verify its downloading ...
[INFO] [clean:clean]
[INFO] ----------------------------------------------------------------------------
[ERROR] BUILD ERROR
[INFO] ----------------------------------------------------------------------------
[ERROR] Cause:
org.apache.maven.lifecycle.goal.GoalExecutionException: Error resolving goals:
at org.apache.maven.lifecycle.goal.phase.GoalResolutionPhase.execute(GoalResolutionPhase.java:68)
at org.apache.maven.lifecycle.goal.DefaultMavenGoalPhaseManager.execute(DefaultMavenGoalPhaseManager.java:48)
at org.apache.maven.lifecycle.session.phase.GoalExecutionPhase.execute(GoalExecutionPhase.java:50)
at org.apache.maven.lifecycle.session.DefaultMavenSessionPhaseManager.execute(DefaultMavenSessionPhaseManager.java:48)
at org.apache.maven.DefaultMaven.execute(DefaultMaven.java:97)
at org.apache.maven.DefaultMaven.execute(DefaultMaven.java:82)
at org.apache.maven.MavenCli.main(MavenCli.java:151)
at sun.reflect.NativeMethodAccessorImpl.invoke0(Native Method)
at sun.reflect.NativeMethodAccessorImpl.invoke(NativeMethodAccessorImpl.java:39)
at sun.reflect.DelegatingMethodAccessorImpl.invoke(DelegatingMethodAccessorImpl.java:25)
at java.lang.reflect.Method.invoke(Method.java:324)
at org.codehaus.classworlds.Launcher.launchEnhanced(Launcher.java:350)
at org.codehaus.classworlds.Launcher.launch(Launcher.java:290)
at org.codehaus.classworlds.Launcher.main(Launcher.java:433)
Caused by: org.apache.maven.artifact.resolver.ArtifactResolutionException: Error transitively resolving artifacts:
at org.apache.maven.artifact.resolver.DefaultArtifactResolver.resolveTransitively(DefaultArtifactResolver.java:129)
at org.codehaus.plexus.DefaultArtifactEnabledContainer.addComponent(DefaultArtifactEnabledContainer.java:111)
at org.apache.maven.plugin.DefaultPluginManager.addPlugin(DefaultPluginManager.java:267)
at org.apache.maven.plugin.DefaultPluginManager.verifyPluginForGoal(DefaultPluginManager.java:239)
at org.apache.maven.lifecycle.goal.phase.GoalResolutionPhase.resolveTopLevel(GoalResolutionPhase.java:81)
at org.apache.maven.lifecycle.goal.phase.GoalResolutionPhase.execute(GoalResolutionPhase.java:53)
... 13 more
Caused by: org.apache.maven.artifact.resolver.TransitiveArtifactResolutionException: Error retrieving metadata:
at org.apache.maven.artifact.resolver.DefaultArtifactResolver.collect(DefaultArtifactResolver.java:208)
at org.apache.maven.artifact.resolver.DefaultArtifactResolver.resolveTransitively(DefaultArtifactResolver.java:122)
... 18 more
Caused by: org.apache.maven.artifact.metadata.ArtifactMetadataRetrievalException: Cannot read artifact source:
at org.apache.maven.artifact.MavenMetadataSource.retrieve(MavenMetadataSource.java:79)
at org.apache.maven.artifact.resolver.DefaultArtifactResolver.collect(DefaultArtifactResolver.java:204)
... 19 more
Caused by: org.apache.maven.artifact.resolver.ArtifactResolutionException: The artifact is not present locally as:
/home/users/jvanzyl/maven-repo-local/plexus/poms/plexus-0.17.pom
or in any of the specified remote repositories:
http://www.ibiblio.org/maven
at org.apache.maven.artifact.resolver.DefaultArtifactResolver.resolve(DefaultArtifactResolver.java:53)
at org.apache.maven.artifact.MavenMetadataSource.retrieve(MavenMetadataSource.java:71)
... 20 more
Caused by: org.apache.maven.wagon.TransferFailedException: Unable to download the artifact from any repository
at org.apache.maven.artifact.manager.DefaultWagonManager.get(DefaultWagonManager.java:239)
at org.apache.maven.artifact.manager.DefaultWagonManager.get(DefaultWagonManager.java:109)
at org.apache.maven.artifact.resolver.DefaultArtifactResolver.resolve(DefaultArtifactResolver.java:49)
... 21 more
[INFO] ----------------------------------------------------------------------------
[INFO] Total time: 2 seconds
[INFO] Finished at: Thu Aug 26 08:02:31 EDT 2004
[INFO] Final Memory: 0M/1M
[INFO] ----------------------------------------------------------------------------
org.apache.maven.it.VerificationException: Expected file was not found: ./target/classes/org/apache/maven/it0002/Person.class
org.apache.maven.artifact.resolver.ArtifactResolutionException: Error transitively resolving artifacts:
at org.apache.maven.artifact.resolver.DefaultArtifactResolver.resolveTransitively(DefaultArtifactResolver.java:129)
at org.codehaus.plexus.DefaultArtifactEnabledContainer.addComponent(DefaultArtifactEnabledContainer.java:111)
at org.apache.maven.plugin.DefaultPluginManager.addPlugin(DefaultPluginManager.java:267)
at org.apache.maven.plugin.DefaultPluginManager.verifyPluginForGoal(DefaultPluginManager.java:239)
at org.apache.maven.plugin.DefaultPluginManager.processEdge(DefaultPluginManager.java:168)
at org.apache.maven.plugin.DefaultPluginManager.processPluginDescriptor(DefaultPluginManager.java:132)
at org.apache.maven.plugin.DefaultPluginManager.componentDiscovered(DefaultPluginManager.java:196)
at org.codehaus.plexus.component.discovery.DefaultComponentDiscovererManager.fireComponentDiscoveryEvent(DefaultComponentDiscovererManager.java:47)
at org.codehaus.plexus.component.discovery.AbstractComponentDiscoverer.findComponents(AbstractComponentDiscoverer.java:61)
at org.codehaus.plexus.DefaultPlexusContainer.discoverComponents(DefaultPlexusContainer.java:486)
at org.codehaus.plexus.DefaultArtifactEnabledContainer.addComponent(DefaultArtifactEnabledContainer.java:76)
at org.apache.maven.plugin.DefaultPluginManager.addPlugin(DefaultPluginManager.java:267)
at org.apache.maven.plugin.DefaultPluginManager.verifyPluginForGoal(DefaultPluginManager.java:239)
at org.apache.maven.plugin.DefaultPluginManager.processEdge(DefaultPluginManager.java:168)
at org.apache.maven.plugin.DefaultPluginManager.processPluginDescriptor(DefaultPluginManager.java:132)
at org.apache.maven.plugin.DefaultPluginManager.componentDiscovered(DefaultPluginManager.java:196)
at org.codehaus.plexus.component.discovery.DefaultComponentDiscovererManager.fireComponentDiscoveryEvent(DefaultComponentDiscovererManager.java:47)
at org.codehaus.plexus.component.discovery.AbstractComponentDiscoverer.findComponents(AbstractComponentDiscoverer.java:61)
at org.codehaus.plexus.DefaultPlexusContainer.discoverComponents(DefaultPlexusContainer.java:486)
at org.codehaus.plexus.DefaultArtifactEnabledContainer.addComponent(DefaultArtifactEnabledContainer.java:76)
at org.apache.maven.plugin.DefaultPluginManager.addPlugin(DefaultPluginManager.java:267)
at org.apache.maven.plugin.DefaultPluginManager.verifyPluginForGoal(DefaultPluginManager.java:239)
at org.apache.maven.lifecycle.goal.phase.GoalResolutionPhase.resolveTopLevel(GoalResolutionPhase.java:81)
at org.apache.maven.lifecycle.goal.phase.GoalResolutionPhase.execute(GoalResolutionPhase.java:53)
at org.apache.maven.lifecycle.goal.DefaultMavenGoalPhaseManager.execute(DefaultMavenGoalPhaseManager.java:48)
at org.apache.maven.lifecycle.session.phase.GoalExecutionPhase.execute(GoalExecutionPhase.java:50)
at org.apache.maven.lifecycle.session.DefaultMavenSessionPhaseManager.execute(DefaultMavenSessionPhaseManager.java:48)
at org.apache.maven.DefaultMaven.execute(DefaultMaven.java:97)
at org.apache.maven.DefaultMaven.execute(DefaultMaven.java:82)
at org.apache.maven.MavenCli.main(MavenCli.java:151)
at sun.reflect.NativeMethodAccessorImpl.invoke0(Native Method)
at sun.reflect.NativeMethodAccessorImpl.invoke(NativeMethodAccessorImpl.java:39)
at sun.reflect.DelegatingMethodAccessorImpl.invoke(DelegatingMethodAccessorImpl.java:25)
at java.lang.reflect.Method.invoke(Method.java:324)
at org.codehaus.classworlds.Launcher.launchEnhanced(Launcher.java:350)
at org.codehaus.classworlds.Launcher.launch(Launcher.java:290)
at org.codehaus.classworlds.Launcher.main(Launcher.java:433)
Caused by: org.apache.maven.artifact.resolver.TransitiveArtifactResolutionException: Error retrieving metadata:
at org.apache.maven.artifact.resolver.DefaultArtifactResolver.collect(DefaultArtifactResolver.java:208)
at org.apache.maven.artifact.resolver.DefaultArtifactResolver.resolveTransitively(DefaultArtifactResolver.java:122)
... 36 more
Caused by: org.apache.maven.artifact.metadata.ArtifactMetadataRetrievalException: Cannot read artifact source:
at org.apache.maven.artifact.MavenMetadataSource.retrieve(MavenMetadataSource.java:79)
at org.apache.maven.artifact.resolver.DefaultArtifactResolver.collect(DefaultArtifactResolver.java:204)
... 37 more
Caused by: org.apache.maven.artifact.resolver.ArtifactResolutionException: The artifact is not present locally as:
/home/users/jvanzyl/maven-repo-local/plexus/poms/plexus-0.17.pom
or in any of the specified remote repositories:
http://www.ibiblio.org/maven
at org.apache.maven.artifact.resolver.DefaultArtifactResolver.resolve(DefaultArtifactResolver.java:53)
at org.apache.maven.artifact.MavenMetadataSource.retrieve(MavenMetadataSource.java:71)
... 38 more
Caused by: org.apache.maven.wagon.TransferFailedException: Unable to download the artifact from any repository
at org.apache.maven.artifact.manager.DefaultWagonManager.get(DefaultWagonManager.java:239)
at org.apache.maven.artifact.manager.DefaultWagonManager.get(DefaultWagonManager.java:109)
at org.apache.maven.artifact.resolver.DefaultArtifactResolver.resolve(DefaultArtifactResolver.java:49)
... 39 more
org.apache.maven.artifact.resolver.ArtifactResolutionException: Error transitively resolving artifacts:
at org.apache.maven.artifact.resolver.DefaultArtifactResolver.resolveTransitively(DefaultArtifactResolver.java:129)
at org.codehaus.plexus.DefaultArtifactEnabledContainer.addComponent(DefaultArtifactEnabledContainer.java:111)
at org.apache.maven.plugin.DefaultPluginManager.addPlugin(DefaultPluginManager.java:267)
at org.apache.maven.plugin.DefaultPluginManager.verifyPluginForGoal(DefaultPluginManager.java:239)
at org.apache.maven.plugin.DefaultPluginManager.processEdge(DefaultPluginManager.java:168)
at org.apache.maven.plugin.DefaultPluginManager.processPluginDescriptor(DefaultPluginManager.java:132)
at org.apache.maven.plugin.DefaultPluginManager.componentDiscovered(DefaultPluginManager.java:196)
at org.codehaus.plexus.component.discovery.DefaultComponentDiscovererManager.fireComponentDiscoveryEvent(DefaultComponentDiscovererManager.java:47)
at org.codehaus.plexus.component.discovery.AbstractComponentDiscoverer.findComponents(AbstractComponentDiscoverer.java:61)
at org.codehaus.plexus.DefaultPlexusContainer.discoverComponents(DefaultPlexusContainer.java:486)
at org.codehaus.plexus.DefaultArtifactEnabledContainer.addComponent(DefaultArtifactEnabledContainer.java:76)
at org.apache.maven.plugin.DefaultPluginManager.addPlugin(DefaultPluginManager.java:267)
at org.apache.maven.plugin.DefaultPluginManager.verifyPluginForGoal(DefaultPluginManager.java:239)
at org.apache.maven.plugin.DefaultPluginManager.processEdge(DefaultPluginManager.java:168)
at org.apache.maven.plugin.DefaultPluginManager.processPluginDescriptor(DefaultPluginManager.java:132)
at org.apache.maven.plugin.DefaultPluginManager.componentDiscovered(DefaultPluginManager.java:196)
at org.codehaus.plexus.component.discovery.DefaultComponentDiscovererManager.fireComponentDiscoveryEvent(DefaultComponentDiscovererManager.java:47)
at org.codehaus.plexus.component.discovery.AbstractComponentDiscoverer.findComponents(AbstractComponentDiscoverer.java:61)
at org.codehaus.plexus.DefaultPlexusContainer.discoverComponents(DefaultPlexusContainer.java:486)
at org.codehaus.plexus.DefaultArtifactEnabledContainer.addComponent(DefaultArtifactEnabledContainer.java:76)
at org.apache.maven.plugin.DefaultPluginManager.addPlugin(DefaultPluginManager.java:267)
at org.apache.maven.plugin.DefaultPluginManager.verifyPluginForGoal(DefaultPluginManager.java:239)
at org.apache.maven.lifecycle.goal.phase.GoalResolutionPhase.resolveTopLevel(GoalResolutionPhase.java:81)
at org.apache.maven.lifecycle.goal.phase.GoalResolutionPhase.execute(GoalResolutionPhase.java:53)
at org.apache.maven.lifecycle.goal.DefaultMavenGoalPhaseManager.execute(DefaultMavenGoalPhaseManager.java:48)
at org.apache.maven.lifecycle.session.phase.GoalExecutionPhase.execute(GoalExecutionPhase.java:50)
at org.apache.maven.lifecycle.session.DefaultMavenSessionPhaseManager.execute(DefaultMavenSessionPhaseManager.java:48)
at org.apache.maven.DefaultMaven.execute(DefaultMaven.java:97)
at org.apache.maven.DefaultMaven.execute(DefaultMaven.java:82)
at org.apache.maven.MavenCli.main(MavenCli.java:151)
at sun.reflect.NativeMethodAccessorImpl.invoke0(Native Method)
at sun.reflect.NativeMethodAccessorImpl.invoke(NativeMethodAccessorImpl.java:39)
at sun.reflect.DelegatingMethodAccessorImpl.invoke(DelegatingMethodAccessorImpl.java:25)
at java.lang.reflect.Method.invoke(Method.java:324)
at org.codehaus.classworlds.Launcher.launchEnhanced(Launcher.java:350)
at org.codehaus.classworlds.Launcher.launch(Launcher.java:290)
at org.codehaus.classworlds.Launcher.main(Launcher.java:433)
Caused by: org.apache.maven.artifact.resolver.TransitiveArtifactResolutionException: Error retrieving metadata:
at org.apache.maven.artifact.resolver.DefaultArtifactResolver.collect(DefaultArtifactResolver.java:208)
at org.apache.maven.artifact.resolver.DefaultArtifactResolver.resolveTransitively(DefaultArtifactResolver.java:122)
... 36 more
Caused by: org.apache.maven.artifact.metadata.ArtifactMetadataRetrievalException: Cannot read artifact source:
at org.apache.maven.artifact.MavenMetadataSource.retrieve(MavenMetadataSource.java:79)
at org.apache.maven.artifact.resolver.DefaultArtifactResolver.collect(DefaultArtifactResolver.java:204)
... 37 more
Caused by: org.apache.maven.artifact.resolver.ArtifactResolutionException: The artifact is not present locally as:
/home/users/jvanzyl/maven-repo-local/plexus/poms/plexus-0.17.pom
or in any of the specified remote repositories:
http://www.ibiblio.org/maven
at org.apache.maven.artifact.resolver.DefaultArtifactResolver.resolve(DefaultArtifactResolver.java:53)
at org.apache.maven.artifact.MavenMetadataSource.retrieve(MavenMetadataSource.java:71)
... 38 more
Caused by: org.apache.maven.wagon.TransferFailedException: Unable to download the artifact from any repository
at org.apache.maven.artifact.manager.DefaultWagonManager.get(DefaultWagonManager.java:239)
at org.apache.maven.artifact.manager.DefaultWagonManager.get(DefaultWagonManager.java:109)
at org.apache.maven.artifact.resolver.DefaultArtifactResolver.resolve(DefaultArtifactResolver.java:49)
... 39 more
Integration test it0003 FAILED!
Details:
Removing maven-core-it0003-1.0.jar from the local repository so we can verify jar installation ...
[INFO] [clean:clean]
[INFO] ----------------------------------------------------------------------------
[ERROR] BUILD ERROR
[INFO] ----------------------------------------------------------------------------
[ERROR] Cause:
org.apache.maven.lifecycle.goal.GoalExecutionException: Error resolving goals:
at org.apache.maven.lifecycle.goal.phase.GoalResolutionPhase.execute(GoalResolutionPhase.java:68)
at org.apache.maven.lifecycle.goal.DefaultMavenGoalPhaseManager.execute(DefaultMavenGoalPhaseManager.java:48)
at org.apache.maven.lifecycle.session.phase.GoalExecutionPhase.execute(GoalExecutionPhase.java:50)
at org.apache.maven.lifecycle.session.DefaultMavenSessionPhaseManager.execute(DefaultMavenSessionPhaseManager.java:48)
at org.apache.maven.DefaultMaven.execute(DefaultMaven.java:97)
at org.apache.maven.DefaultMaven.execute(DefaultMaven.java:82)
at org.apache.maven.MavenCli.main(MavenCli.java:151)
at sun.reflect.NativeMethodAccessorImpl.invoke0(Native Method)
at sun.reflect.NativeMethodAccessorImpl.invoke(NativeMethodAccessorImpl.java:39)
at sun.reflect.DelegatingMethodAccessorImpl.invoke(DelegatingMethodAccessorImpl.java:25)
at java.lang.reflect.Method.invoke(Method.java:324)
at org.codehaus.classworlds.Launcher.launchEnhanced(Launcher.java:350)
at org.codehaus.classworlds.Launcher.launch(Launcher.java:290)
at org.codehaus.classworlds.Launcher.main(Launcher.java:433)
Caused by: org.apache.maven.artifact.resolver.ArtifactResolutionException: Error transitively resolving artifacts:
at org.apache.maven.artifact.resolver.DefaultArtifactResolver.resolveTransitively(DefaultArtifactResolver.java:129)
at org.codehaus.plexus.DefaultArtifactEnabledContainer.addComponent(DefaultArtifactEnabledContainer.java:111)
at org.apache.maven.plugin.DefaultPluginManager.addPlugin(DefaultPluginManager.java:267)
at org.apache.maven.plugin.DefaultPluginManager.verifyPluginForGoal(DefaultPluginManager.java:239)
at org.apache.maven.lifecycle.goal.phase.GoalResolutionPhase.resolveTopLevel(GoalResolutionPhase.java:81)
at org.apache.maven.lifecycle.goal.phase.GoalResolutionPhase.execute(GoalResolutionPhase.java:53)
... 13 more
Caused by: org.apache.maven.artifact.resolver.TransitiveArtifactResolutionException: Error retrieving metadata:
at org.apache.maven.artifact.resolver.DefaultArtifactResolver.collect(DefaultArtifactResolver.java:208)
at org.apache.maven.artifact.resolver.DefaultArtifactResolver.resolveTransitively(DefaultArtifactResolver.java:122)
... 18 more
Caused by: org.apache.maven.artifact.metadata.ArtifactMetadataRetrievalException: Cannot read artifact source:
at org.apache.maven.artifact.MavenMetadataSource.retrieve(MavenMetadataSource.java:79)
at org.apache.maven.artifact.resolver.DefaultArtifactResolver.collect(DefaultArtifactResolver.java:204)
... 19 more
Caused by: org.apache.maven.artifact.resolver.ArtifactResolutionException: The artifact is not present locally as:
/home/users/jvanzyl/maven-repo-local/plexus/poms/plexus-0.17.pom
or in any of the specified remote repositories:
http://www.ibiblio.org/maven
at org.apache.maven.artifact.resolver.DefaultArtifactResolver.resolve(DefaultArtifactResolver.java:53)
at org.apache.maven.artifact.MavenMetadataSource.retrieve(MavenMetadataSource.java:71)
... 20 more
Caused by: org.apache.maven.wagon.TransferFailedException: Unable to download the artifact from any repository
at org.apache.maven.artifact.manager.DefaultWagonManager.get(DefaultWagonManager.java:239)
at org.apache.maven.artifact.manager.DefaultWagonManager.get(DefaultWagonManager.java:109)
at org.apache.maven.artifact.resolver.DefaultArtifactResolver.resolve(DefaultArtifactResolver.java:49)
... 21 more
[INFO] ----------------------------------------------------------------------------
[INFO] Total time: 1 seconds
[INFO] Finished at: Thu Aug 26 08:02:34 EDT 2004
[INFO] Final Memory: 0M/1M
[INFO] ----------------------------------------------------------------------------
org.apache.maven.it.VerificationException: Expected file was not found: ./target/classes/org/apache/maven/it0003/Person.class
Integration test it0004 FAILED!
Details:
Removing maven-core-it0004-1.0.pom from the local repository so we can verify pom installation ...
[INFO] [clean:clean]
[INFO] ----------------------------------------------------------------------------
[ERROR] BUILD ERROR
[INFO] ----------------------------------------------------------------------------
[ERROR] Cause:
org.apache.maven.lifecycle.goal.GoalExecutionException: Error resolving goals:
at org.apache.maven.lifecycle.goal.phase.GoalResolutionPhase.execute(GoalResolutionPhase.java:68)
at org.apache.maven.lifecycle.goal.DefaultMavenGoalPhaseManager.execute(DefaultMavenGoalPhaseManager.java:48)
at org.apache.maven.lifecycle.session.phase.GoalExecutionPhase.execute(GoalExecutionPhase.java:50)
at org.apache.maven.lifecycle.session.DefaultMavenSessionPhaseManager.execute(DefaultMavenSessionPhaseManager.java:48)
at org.apache.maven.DefaultMaven.execute(DefaultMaven.java:97)
at org.apache.maven.DefaultMaven.execute(DefaultMaven.java:82)
at org.apache.maven.MavenCli.main(MavenCli.java:151)
at sun.reflect.NativeMethodAccessorImpl.invoke0(Native Method)
at sun.reflect.NativeMethodAccessorImpl.invoke(NativeMethodAccessorImpl.java:39)
at sun.reflect.DelegatingMethodAccessorImpl.invoke(DelegatingMethodAccessorImpl.java:25)
at java.lang.reflect.Method.invoke(Method.java:324)
at org.codehaus.classworlds.Launcher.launchEnhanced(Launcher.java:350)
at org.codehaus.classworlds.Launcher.launch(Launcher.java:290)
at org.codehaus.classworlds.Launcher.main(Launcher.java:433)
Caused by: org.apache.maven.artifact.resolver.ArtifactResolutionException: Error transitively resolving artifacts:
at org.apache.maven.artifact.resolver.DefaultArtifactResolver.resolveTransitively(DefaultArtifactResolver.java:129)
at org.codehaus.plexus.DefaultArtifactEnabledContainer.addComponent(DefaultArtifactEnabledContainer.java:111)
at org.apache.maven.plugin.DefaultPluginManager.addPlugin(DefaultPluginManager.java:267)
at org.apache.maven.plugin.DefaultPluginManager.verifyPluginForGoal(DefaultPluginManager.java:239)
at org.apache.maven.lifecycle.goal.phase.GoalResolutionPhase.resolveTopLevel(GoalResolutionPhase.java:81)
at org.apache.maven.lifecycle.goal.phase.GoalResolutionPhase.execute(GoalResolutionPhase.java:53)
... 13 more
Caused by: org.apache.maven.artifact.resolver.TransitiveArtifactResolutionException: Error retrieving metadata:
at org.apache.maven.artifact.resolver.DefaultArtifactResolver.collect(DefaultArtifactResolver.java:208)
at org.apache.maven.artifact.resolver.DefaultArtifactResolver.resolveTransitively(DefaultArtifactResolver.java:122)
... 18 more
Caused by: org.apache.maven.artifact.metadata.ArtifactMetadataRetrievalException: Cannot read artifact source:
at org.apache.maven.artifact.MavenMetadataSource.retrieve(MavenMetadataSource.java:79)
at org.apache.maven.artifact.resolver.DefaultArtifactResolver.collect(DefaultArtifactResolver.java:204)
... 19 more
Caused by: org.apache.maven.artifact.resolver.ArtifactResolutionException: The artifact is not present locally as:
/home/users/jvanzyl/maven-repo-local/plexus/poms/plexus-0.17.pom
or in any of the specified remote repositories:
http://www.ibiblio.org/maven
at org.apache.maven.artifact.resolver.DefaultArtifactResolver.resolve(DefaultArtifactResolver.java:53)
at org.apache.maven.artifact.MavenMetadataSource.retrieve(MavenMetadataSource.java:71)
... 20 more
Caused by: org.apache.maven.wagon.TransferFailedException: Unable to download the artifact from any repository
at org.apache.maven.artifact.manager.DefaultWagonManager.get(DefaultWagonManager.java:239)
at org.apache.maven.artifact.manager.DefaultWagonManager.get(DefaultWagonManager.java:109)
at org.apache.maven.artifact.resolver.DefaultArtifactResolver.resolve(DefaultArtifactResolver.java:49)
... 21 more
[INFO] ----------------------------------------------------------------------------
[INFO] Total time: 2 seconds
[INFO] Finished at: Thu Aug 26 08:02:37 EDT 2004
[INFO] Final Memory: 0M/1M
[INFO] ----------------------------------------------------------------------------
org.apache.maven.it.VerificationException: Expected file was not found: /home/users/jvanzyl/maven-repo-local/maven/poms/maven-core-it0004-1.0.pom
Integration test it0005 FAILED!
Details:
Removing maven-core-it0005-1.0.pom from the local repository so we can verify pom installation ...
[INFO] [clean:clean]
[INFO] ----------------------------------------------------------------------------
[ERROR] BUILD ERROR
[INFO] ----------------------------------------------------------------------------
[ERROR] Cause:
org.apache.maven.lifecycle.goal.GoalExecutionException: Error resolving goals:
at org.apache.maven.lifecycle.goal.phase.GoalResolutionPhase.execute(GoalResolutionPhase.java:68)
at org.apache.maven.lifecycle.goal.DefaultMavenGoalPhaseManager.execute(DefaultMavenGoalPhaseManager.java:48)
at org.apache.maven.lifecycle.session.phase.GoalExecutionPhase.execute(GoalExecutionPhase.java:50)
at org.apache.maven.lifecycle.session.DefaultMavenSessionPhaseManager.execute(DefaultMavenSessionPhaseManager.java:48)
at org.apache.maven.DefaultMaven.execute(DefaultMaven.java:97)
at org.apache.maven.DefaultMaven.execute(DefaultMaven.java:82)
at org.apache.maven.MavenCli.main(MavenCli.java:151)
at sun.reflect.NativeMethodAccessorImpl.invoke0(Native Method)
at sun.reflect.NativeMethodAccessorImpl.invoke(NativeMethodAccessorImpl.java:39)
at sun.reflect.DelegatingMethodAccessorImpl.invoke(DelegatingMethodAccessorImpl.java:25)
at java.lang.reflect.Method.invoke(Method.java:324)
at org.codehaus.classworlds.Launcher.launchEnhanced(Launcher.java:350)
at org.codehaus.classworlds.Launcher.launch(Launcher.java:290)
at org.codehaus.classworlds.Launcher.main(Launcher.java:433)
Caused by: org.apache.maven.artifact.resolver.ArtifactResolutionException: Error transitively resolving artifacts:
at org.apache.maven.artifact.resolver.DefaultArtifactResolver.resolveTransitively(DefaultArtifactResolver.java:129)
at org.codehaus.plexus.DefaultArtifactEnabledContainer.addComponent(DefaultArtifactEnabledContainer.java:111)
at org.apache.maven.plugin.DefaultPluginManager.addPlugin(DefaultPluginManager.java:267)
at org.apache.maven.plugin.DefaultPluginManager.verifyPluginForGoal(DefaultPluginManager.java:239)
at org.apache.maven.lifecycle.goal.phase.GoalResolutionPhase.resolveTopLevel(GoalResolutionPhase.java:81)
at org.apache.maven.lifecycle.goal.phase.GoalResolutionPhase.execute(GoalResolutionPhase.java:53)
... 13 more
Caused by: org.apache.maven.artifact.resolver.TransitiveArtifactResolutionException: Error retrieving metadata:
at org.apache.maven.artifact.resolver.DefaultArtifactResolver.collect(DefaultArtifactResolver.java:208)
at org.apache.maven.artifact.resolver.DefaultArtifactResolver.resolveTransitively(DefaultArtifactResolver.java:122)
... 18 more
Caused by: org.apache.maven.artifact.metadata.ArtifactMetadataRetrievalException: Cannot read artifact source:
at org.apache.maven.artifact.MavenMetadataSource.retrieve(MavenMetadataSource.java:79)
at org.apache.maven.artifact.resolver.DefaultArtifactResolver.collect(DefaultArtifactResolver.java:204)
... 19 more
Caused by: org.apache.maven.artifact.resolver.ArtifactResolutionException: The artifact is not present locally as:
/home/users/jvanzyl/maven-repo-local/plexus/poms/plexus-0.17.pom
or in any of the specified remote repositories:
http://www.ibiblio.org/maven
at org.apache.maven.artifact.resolver.DefaultArtifactResolver.resolve(DefaultArtifactResolver.java:53)
at org.apache.maven.artifact.MavenMetadataSource.retrieve(MavenMetadataSource.java:71)
... 20 more
Caused by: org.apache.maven.wagon.TransferFailedException: Unable to download the artifact from any repository
at org.apache.maven.artifact.manager.DefaultWagonManager.get(DefaultWagonManager.java:239)
at org.apache.maven.artifact.manager.DefaultWagonManager.get(DefaultWagonManager.java:109)
at org.apache.maven.artifact.resolver.DefaultArtifactResolver.resolve(DefaultArtifactResolver.java:49)
... 21 more
[INFO] ----------------------------------------------------------------------------
[INFO] Total time: 0 seconds
[INFO] Finished at: Thu Aug 26 08:02:41 EDT 2004
[INFO] Final Memory: 0M/1M
[INFO] ----------------------------------------------------------------------------
org.apache.maven.it.VerificationException: Expected file was not found: /home/users/jvanzyl/maven-repo-local/maven/poms/maven-core-it0005-1.0-SNAPSHOT.pom
Integration test it0006 OK
org.apache.maven.artifact.resolver.ArtifactResolutionException: Error transitively resolving artifacts:
at org.apache.maven.artifact.resolver.DefaultArtifactResolver.resolveTransitively(DefaultArtifactResolver.java:129)
at org.codehaus.plexus.DefaultArtifactEnabledContainer.addComponent(DefaultArtifactEnabledContainer.java:111)
at org.apache.maven.plugin.DefaultPluginManager.addPlugin(DefaultPluginManager.java:267)
at org.apache.maven.plugin.DefaultPluginManager.verifyPluginForGoal(DefaultPluginManager.java:239)
at org.apache.maven.plugin.DefaultPluginManager.processEdge(DefaultPluginManager.java:168)
at org.apache.maven.plugin.DefaultPluginManager.processPluginDescriptor(DefaultPluginManager.java:132)
at org.apache.maven.plugin.DefaultPluginManager.componentDiscovered(DefaultPluginManager.java:196)
at org.codehaus.plexus.component.discovery.DefaultComponentDiscovererManager.fireComponentDiscoveryEvent(DefaultComponentDiscovererManager.java:47)
at org.codehaus.plexus.component.discovery.AbstractComponentDiscoverer.findComponents(AbstractComponentDiscoverer.java:61)
at org.codehaus.plexus.DefaultPlexusContainer.discoverComponents(DefaultPlexusContainer.java:486)
at org.codehaus.plexus.DefaultArtifactEnabledContainer.addComponent(DefaultArtifactEnabledContainer.java:76)
at org.apache.maven.plugin.DefaultPluginManager.addPlugin(DefaultPluginManager.java:267)
at org.apache.maven.plugin.DefaultPluginManager.verifyPluginForGoal(DefaultPluginManager.java:239)
at org.apache.maven.plugin.DefaultPluginManager.processEdge(DefaultPluginManager.java:168)
at org.apache.maven.plugin.DefaultPluginManager.processPluginDescriptor(DefaultPluginManager.java:132)
at org.apache.maven.plugin.DefaultPluginManager.componentDiscovered(DefaultPluginManager.java:196)
at org.codehaus.plexus.component.discovery.DefaultComponentDiscovererManager.fireComponentDiscoveryEvent(DefaultComponentDiscovererManager.java:47)
at org.codehaus.plexus.component.discovery.AbstractComponentDiscoverer.findComponents(AbstractComponentDiscoverer.java:61)
at org.codehaus.plexus.DefaultPlexusContainer.discoverComponents(DefaultPlexusContainer.java:486)
at org.codehaus.plexus.DefaultArtifactEnabledContainer.addComponent(DefaultArtifactEnabledContainer.java:76)
at org.apache.maven.plugin.DefaultPluginManager.addPlugin(DefaultPluginManager.java:267)
at org.apache.maven.plugin.DefaultPluginManager.verifyPluginForGoal(DefaultPluginManager.java:239)
at org.apache.maven.lifecycle.goal.phase.GoalResolutionPhase.resolveTopLevel(GoalResolutionPhase.java:81)
at org.apache.maven.lifecycle.goal.phase.GoalResolutionPhase.execute(GoalResolutionPhase.java:53)
at org.apache.maven.lifecycle.goal.DefaultMavenGoalPhaseManager.execute(DefaultMavenGoalPhaseManager.java:48)
at org.apache.maven.lifecycle.session.phase.GoalExecutionPhase.execute(GoalExecutionPhase.java:50)
at org.apache.maven.lifecycle.session.DefaultMavenSessionPhaseManager.execute(DefaultMavenSessionPhaseManager.java:48)
at org.apache.maven.DefaultMaven.execute(DefaultMaven.java:97)
at org.apache.maven.DefaultMaven.execute(DefaultMaven.java:82)
at org.apache.maven.MavenCli.main(MavenCli.java:151)
at sun.reflect.NativeMethodAccessorImpl.invoke0(Native Method)
at sun.reflect.NativeMethodAccessorImpl.invoke(NativeMethodAccessorImpl.java:39)
at sun.reflect.DelegatingMethodAccessorImpl.invoke(DelegatingMethodAccessorImpl.java:25)
at java.lang.reflect.Method.invoke(Method.java:324)
at org.codehaus.classworlds.Launcher.launchEnhanced(Launcher.java:350)
at org.codehaus.classworlds.Launcher.launch(Launcher.java:290)
at org.codehaus.classworlds.Launcher.main(Launcher.java:433)
Caused by: org.apache.maven.artifact.resolver.TransitiveArtifactResolutionException: Error retrieving metadata:
at org.apache.maven.artifact.resolver.DefaultArtifactResolver.collect(DefaultArtifactResolver.java:208)
at org.apache.maven.artifact.resolver.DefaultArtifactResolver.resolveTransitively(DefaultArtifactResolver.java:122)
... 36 more
Caused by: org.apache.maven.artifact.metadata.ArtifactMetadataRetrievalException: Cannot read artifact source:
at org.apache.maven.artifact.MavenMetadataSource.retrieve(MavenMetadataSource.java:79)
at org.apache.maven.artifact.resolver.DefaultArtifactResolver.collect(DefaultArtifactResolver.java:204)
... 37 more
Caused by: org.apache.maven.artifact.resolver.ArtifactResolutionException: The artifact is not present locally as:
/home/users/jvanzyl/maven-repo-local/plexus/poms/plexus-0.17.pom
or in any of the specified remote repositories:
http://www.ibiblio.org/maven
at org.apache.maven.artifact.resolver.DefaultArtifactResolver.resolve(DefaultArtifactResolver.java:53)
at org.apache.maven.artifact.MavenMetadataSource.retrieve(MavenMetadataSource.java:71)
... 38 more
Caused by: org.apache.maven.wagon.TransferFailedException: Unable to download the artifact from any repository
at org.apache.maven.artifact.manager.DefaultWagonManager.get(DefaultWagonManager.java:239)
at org.apache.maven.artifact.manager.DefaultWagonManager.get(DefaultWagonManager.java:109)
at org.apache.maven.artifact.resolver.DefaultArtifactResolver.resolve(DefaultArtifactResolver.java:49)
... 39 more
org.apache.maven.artifact.resolver.ArtifactResolutionException: Error transitively resolving artifacts:
at org.apache.maven.artifact.resolver.DefaultArtifactResolver.resolveTransitively(DefaultArtifactResolver.java:129)
at org.codehaus.plexus.DefaultArtifactEnabledContainer.addComponent(DefaultArtifactEnabledContainer.java:111)
at org.apache.maven.plugin.DefaultPluginManager.addPlugin(DefaultPluginManager.java:267)
at org.apache.maven.plugin.DefaultPluginManager.verifyPluginForGoal(DefaultPluginManager.java:239)
at org.apache.maven.plugin.DefaultPluginManager.processEdge(DefaultPluginManager.java:168)
at org.apache.maven.plugin.DefaultPluginManager.processPluginDescriptor(DefaultPluginManager.java:132)
at org.apache.maven.plugin.DefaultPluginManager.componentDiscovered(DefaultPluginManager.java:196)
at org.codehaus.plexus.component.discovery.DefaultComponentDiscovererManager.fireComponentDiscoveryEvent(DefaultComponentDiscovererManager.java:47)
at org.codehaus.plexus.component.discovery.AbstractComponentDiscoverer.findComponents(AbstractComponentDiscoverer.java:61)
at org.codehaus.plexus.DefaultPlexusContainer.discoverComponents(DefaultPlexusContainer.java:486)
at org.codehaus.plexus.DefaultArtifactEnabledContainer.addComponent(DefaultArtifactEnabledContainer.java:76)
at org.apache.maven.plugin.DefaultPluginManager.addPlugin(DefaultPluginManager.java:267)
at org.apache.maven.plugin.DefaultPluginManager.verifyPluginForGoal(DefaultPluginManager.java:239)
at org.apache.maven.plugin.DefaultPluginManager.processEdge(DefaultPluginManager.java:168)
at org.apache.maven.plugin.DefaultPluginManager.processPluginDescriptor(DefaultPluginManager.java:132)
at org.apache.maven.plugin.DefaultPluginManager.componentDiscovered(DefaultPluginManager.java:196)
at org.codehaus.plexus.component.discovery.DefaultComponentDiscovererManager.fireComponentDiscoveryEvent(DefaultComponentDiscovererManager.java:47)
at org.codehaus.plexus.component.discovery.AbstractComponentDiscoverer.findComponents(AbstractComponentDiscoverer.java:61)
at org.codehaus.plexus.DefaultPlexusContainer.discoverComponents(DefaultPlexusContainer.java:486)
at org.codehaus.plexus.DefaultArtifactEnabledContainer.addComponent(DefaultArtifactEnabledContainer.java:76)
at org.apache.maven.plugin.DefaultPluginManager.addPlugin(DefaultPluginManager.java:267)
at org.apache.maven.plugin.DefaultPluginManager.verifyPluginForGoal(DefaultPluginManager.java:239)
at org.apache.maven.lifecycle.goal.phase.GoalResolutionPhase.resolveTopLevel(GoalResolutionPhase.java:81)
at org.apache.maven.lifecycle.goal.phase.GoalResolutionPhase.execute(GoalResolutionPhase.java:53)
at org.apache.maven.lifecycle.goal.DefaultMavenGoalPhaseManager.execute(DefaultMavenGoalPhaseManager.java:48)
at org.apache.maven.lifecycle.session.phase.GoalExecutionPhase.execute(GoalExecutionPhase.java:50)
at org.apache.maven.lifecycle.session.DefaultMavenSessionPhaseManager.execute(DefaultMavenSessionPhaseManager.java:48)
at org.apache.maven.DefaultMaven.execute(DefaultMaven.java:97)
at org.apache.maven.DefaultMaven.execute(DefaultMaven.java:82)
at org.apache.maven.MavenCli.main(MavenCli.java:151)
at sun.reflect.NativeMethodAccessorImpl.invoke0(Native Method)
at sun.reflect.NativeMethodAccessorImpl.invoke(NativeMethodAccessorImpl.java:39)
at sun.reflect.DelegatingMethodAccessorImpl.invoke(DelegatingMethodAccessorImpl.java:25)
at java.lang.reflect.Method.invoke(Method.java:324)
at org.codehaus.classworlds.Launcher.launchEnhanced(Launcher.java:350)
at org.codehaus.classworlds.Launcher.launch(Launcher.java:290)
at org.codehaus.classworlds.Launcher.main(Launcher.java:433)
Caused by: org.apache.maven.artifact.resolver.TransitiveArtifactResolutionException: Error retrieving metadata:
at org.apache.maven.artifact.resolver.DefaultArtifactResolver.collect(DefaultArtifactResolver.java:208)
at org.apache.maven.artifact.resolver.DefaultArtifactResolver.resolveTransitively(DefaultArtifactResolver.java:122)
... 36 more
Caused by: org.apache.maven.artifact.metadata.ArtifactMetadataRetrievalException: Cannot read artifact source:
at org.apache.maven.artifact.MavenMetadataSource.retrieve(MavenMetadataSource.java:79)
at org.apache.maven.artifact.resolver.DefaultArtifactResolver.collect(DefaultArtifactResolver.java:204)
... 37 more
Caused by: org.apache.maven.artifact.resolver.ArtifactResolutionException: The artifact is not present locally as:
/home/users/jvanzyl/maven-repo-local/plexus/poms/plexus-0.17.pom
or in any of the specified remote repositories:
http://www.ibiblio.org/maven
at org.apache.maven.artifact.resolver.DefaultArtifactResolver.resolve(DefaultArtifactResolver.java:53)
at org.apache.maven.artifact.MavenMetadataSource.retrieve(MavenMetadataSource.java:71)
... 38 more
Caused by: org.apache.maven.wagon.TransferFailedException: Unable to download the artifact from any repository
at org.apache.maven.artifact.manager.DefaultWagonManager.get(DefaultWagonManager.java:239)
at org.apache.maven.artifact.manager.DefaultWagonManager.get(DefaultWagonManager.java:109)
at org.apache.maven.artifact.resolver.DefaultArtifactResolver.resolve(DefaultArtifactResolver.java:49)
... 39 more
Integration test it0007 FAILED!
Details:
Removing maven-it-support-parent-1.0.pom from the local repository so we can verify its downloading ...
[INFO] [clean:clean]
[INFO] ----------------------------------------------------------------------------
[ERROR] BUILD ERROR
[INFO] ----------------------------------------------------------------------------
[ERROR] Cause:
org.apache.maven.lifecycle.goal.GoalExecutionException: Error resolving goals:
at org.apache.maven.lifecycle.goal.phase.GoalResolutionPhase.execute(GoalResolutionPhase.java:68)
at org.apache.maven.lifecycle.goal.DefaultMavenGoalPhaseManager.execute(DefaultMavenGoalPhaseManager.java:48)
at org.apache.maven.lifecycle.session.phase.GoalExecutionPhase.execute(GoalExecutionPhase.java:50)
at org.apache.maven.lifecycle.session.DefaultMavenSessionPhaseManager.execute(DefaultMavenSessionPhaseManager.java:48)
at org.apache.maven.DefaultMaven.execute(DefaultMaven.java:97)
at org.apache.maven.DefaultMaven.execute(DefaultMaven.java:82)
at org.apache.maven.MavenCli.main(MavenCli.java:151)
at sun.reflect.NativeMethodAccessorImpl.invoke0(Native Method)
at sun.reflect.NativeMethodAccessorImpl.invoke(NativeMethodAccessorImpl.java:39)
at sun.reflect.DelegatingMethodAccessorImpl.invoke(DelegatingMethodAccessorImpl.java:25)
at java.lang.reflect.Method.invoke(Method.java:324)
at org.codehaus.classworlds.Launcher.launchEnhanced(Launcher.java:350)
at org.codehaus.classworlds.Launcher.launch(Launcher.java:290)
at org.codehaus.classworlds.Launcher.main(Launcher.java:433)
Caused by: org.apache.maven.artifact.resolver.ArtifactResolutionException: Error transitively resolving artifacts:
at org.apache.maven.artifact.resolver.DefaultArtifactResolver.resolveTransitively(DefaultArtifactResolver.java:129)
at org.codehaus.plexus.DefaultArtifactEnabledContainer.addComponent(DefaultArtifactEnabledContainer.java:111)
at org.apache.maven.plugin.DefaultPluginManager.addPlugin(DefaultPluginManager.java:267)
at org.apache.maven.plugin.DefaultPluginManager.verifyPluginForGoal(DefaultPluginManager.java:239)
at org.apache.maven.lifecycle.goal.phase.GoalResolutionPhase.resolveTopLevel(GoalResolutionPhase.java:81)
at org.apache.maven.lifecycle.goal.phase.GoalResolutionPhase.execute(GoalResolutionPhase.java:53)
... 13 more
Caused by: org.apache.maven.artifact.resolver.TransitiveArtifactResolutionException: Error retrieving metadata:
at org.apache.maven.artifact.resolver.DefaultArtifactResolver.collect(DefaultArtifactResolver.java:208)
at org.apache.maven.artifact.resolver.DefaultArtifactResolver.resolveTransitively(DefaultArtifactResolver.java:122)
... 18 more
Caused by: org.apache.maven.artifact.metadata.ArtifactMetadataRetrievalException: Cannot read artifact source:
at org.apache.maven.artifact.MavenMetadataSource.retrieve(MavenMetadataSource.java:79)
at org.apache.maven.artifact.resolver.DefaultArtifactResolver.collect(DefaultArtifactResolver.java:204)
... 19 more
Caused by: org.apache.maven.artifact.resolver.ArtifactResolutionException: The artifact is not present locally as:
/home/users/jvanzyl/maven-repo-local/plexus/poms/plexus-0.17.pom
or in any of the specified remote repositories:
http://www.ibiblio.org/maven
at org.apache.maven.artifact.resolver.DefaultArtifactResolver.resolve(DefaultArtifactResolver.java:53)
at org.apache.maven.artifact.MavenMetadataSource.retrieve(MavenMetadataSource.java:71)
... 20 more
Caused by: org.apache.maven.wagon.TransferFailedException: Unable to download the artifact from any repository
at org.apache.maven.artifact.manager.DefaultWagonManager.get(DefaultWagonManager.java:239)
at org.apache.maven.artifact.manager.DefaultWagonManager.get(DefaultWagonManager.java:109)
at org.apache.maven.artifact.resolver.DefaultArtifactResolver.resolve(DefaultArtifactResolver.java:49)
... 21 more
[INFO] ----------------------------------------------------------------------------
[INFO] Total time: 1 seconds
[INFO] Finished at: Thu Aug 26 08:02:49 EDT 2004
[INFO] Final Memory: 0M/1M
[INFO] ----------------------------------------------------------------------------
org.apache.maven.it.VerificationException: Expected file was not found: ./target/classes/org/apache/maven/it0007/Person.class
Creating m2 distribution for public consumption: http://www.codehaus.org/~jvanzyl/m2/m2-20045926.075918.tar.gz