You are viewing a plain text version of this content. The canonical link for it is here.
Posted to oak-dev@jackrabbit.apache.org by Apache Jenkins Server <je...@builds.apache.org> on 2019/09/02 15:49:07 UTC
BUILD FAILURE: Jackrabbit Oak - Build # 2352 - Failure
The Apache Jenkins build system has built Jackrabbit Oak (build #2352)
Status: Failure
Check console output at https://builds.apache.org/job/Jackrabbit%20Oak/2352/ to view the results.
Changes:
[tommaso] OAK-8587 - added documentation for fv similarity search
Test results:
2 tests failed.
FAILED: org.apache.jackrabbit.oak.plugins.index.solr.configuration.DefaultAnalyzersConfigurationTest.org.apache.jackrabbit.oak.plugins.index.solr.configuration.DefaultAnalyzersConfigurationTest
Error Message:
1 thread leaked from SUITE scope at org.apache.jackrabbit.oak.plugins.index.solr.configuration.DefaultAnalyzersConfigurationTest:
1) Thread[id=139, name=oak-scheduled-executor-57, state=TIMED_WAITING, group=main]
at sun.misc.Unsafe.park(Native Method)
at java.util.concurrent.locks.LockSupport.parkNanos(LockSupport.java:215)
at java.util.concurrent.locks.AbstractQueuedSynchronizer$ConditionObject.awaitNanos(AbstractQueuedSynchronizer.java:2078)
at java.util.concurrent.ScheduledThreadPoolExecutor$DelayedWorkQueue.poll(ScheduledThreadPoolExecutor.java:1129)
at java.util.concurrent.ScheduledThreadPoolExecutor$DelayedWorkQueue.poll(ScheduledThreadPoolExecutor.java:809)
at java.util.concurrent.ThreadPoolExecutor.getTask(ThreadPoolExecutor.java:1073)
at java.util.concurrent.ThreadPoolExecutor.runWorker(ThreadPoolExecutor.java:1134)
at java.util.concurrent.ThreadPoolExecutor$Worker.run(ThreadPoolExecutor.java:624)
at java.lang.Thread.run(Thread.java:748)
Stack Trace:
com.carrotsearch.randomizedtesting.ThreadLeakError:
1 thread leaked from SUITE scope at org.apache.jackrabbit.oak.plugins.index.solr.configuration.DefaultAnalyzersConfigurationTest:
1) Thread[id=139, name=oak-scheduled-executor-57, state=TIMED_WAITING, group=main]
at sun.misc.Unsafe.park(Native Method)
at java.util.concurrent.locks.LockSupport.parkNanos(LockSupport.java:215)
at java.util.concurrent.locks.AbstractQueuedSynchronizer$ConditionObject.awaitNanos(AbstractQueuedSynchronizer.java:2078)
at java.util.concurrent.ScheduledThreadPoolExecutor$DelayedWorkQueue.poll(ScheduledThreadPoolExecutor.java:1129)
at java.util.concurrent.ScheduledThreadPoolExecutor$DelayedWorkQueue.poll(ScheduledThreadPoolExecutor.java:809)
at java.util.concurrent.ThreadPoolExecutor.getTask(ThreadPoolExecutor.java:1073)
at java.util.concurrent.ThreadPoolExecutor.runWorker(ThreadPoolExecutor.java:1134)
at java.util.concurrent.ThreadPoolExecutor$Worker.run(ThreadPoolExecutor.java:624)
at java.lang.Thread.run(Thread.java:748)
at __randomizedtesting.SeedInfo.seed([C280DB7DDC7D4AC9]:0)
FAILED: org.apache.jackrabbit.oak.plugins.index.solr.configuration.DefaultAnalyzersConfigurationTest.org.apache.jackrabbit.oak.plugins.index.solr.configuration.DefaultAnalyzersConfigurationTest
Error Message:
There are still zombie threads that couldn't be terminated:
1) Thread[id=139, name=oak-scheduled-executor-57, state=TIMED_WAITING, group=main]
at sun.misc.Unsafe.park(Native Method)
at java.util.concurrent.locks.LockSupport.parkNanos(LockSupport.java:215)
at java.util.concurrent.locks.AbstractQueuedSynchronizer$ConditionObject.awaitNanos(AbstractQueuedSynchronizer.java:2078)
at java.util.concurrent.ScheduledThreadPoolExecutor$DelayedWorkQueue.poll(ScheduledThreadPoolExecutor.java:1129)
at java.util.concurrent.ScheduledThreadPoolExecutor$DelayedWorkQueue.poll(ScheduledThreadPoolExecutor.java:809)
at java.util.concurrent.ThreadPoolExecutor.getTask(ThreadPoolExecutor.java:1073)
at java.util.concurrent.ThreadPoolExecutor.runWorker(ThreadPoolExecutor.java:1134)
at java.util.concurrent.ThreadPoolExecutor$Worker.run(ThreadPoolExecutor.java:624)
at java.lang.Thread.run(Thread.java:748)
Stack Trace:
com.carrotsearch.randomizedtesting.ThreadLeakError:
There are still zombie threads that couldn't be terminated:
1) Thread[id=139, name=oak-scheduled-executor-57, state=TIMED_WAITING, group=main]
at sun.misc.Unsafe.park(Native Method)
at java.util.concurrent.locks.LockSupport.parkNanos(LockSupport.java:215)
at java.util.concurrent.locks.AbstractQueuedSynchronizer$ConditionObject.awaitNanos(AbstractQueuedSynchronizer.java:2078)
at java.util.concurrent.ScheduledThreadPoolExecutor$DelayedWorkQueue.poll(ScheduledThreadPoolExecutor.java:1129)
at java.util.concurrent.ScheduledThreadPoolExecutor$DelayedWorkQueue.poll(ScheduledThreadPoolExecutor.java:809)
at java.util.concurrent.ThreadPoolExecutor.getTask(ThreadPoolExecutor.java:1073)
at java.util.concurrent.ThreadPoolExecutor.runWorker(ThreadPoolExecutor.java:1134)
at java.util.concurrent.ThreadPoolExecutor$Worker.run(ThreadPoolExecutor.java:624)
at java.lang.Thread.run(Thread.java:748)
at __randomizedtesting.SeedInfo.seed([C280DB7DDC7D4AC9]:0)
BUILD FAILURE: Jackrabbit Oak - Build # 2356 - Still Failing
Posted by Apache Jenkins Server <je...@builds.apache.org>.
The Apache Jenkins build system has built Jackrabbit Oak (build #2356)
Status: Still Failing
Check console output at https://builds.apache.org/job/Jackrabbit%20Oak/2356/ to view the results.
Changes:
[mreutegg] OAK-3895: Expose jmx to invalidate cache entries
Patch provided by José Cordero
Test results:
All tests passed
BUILD FAILURE: Jackrabbit Oak - Build # 2355 - Still Failing
Posted by Apache Jenkins Server <je...@builds.apache.org>.
The Apache Jenkins build system has built Jackrabbit Oak (build #2355)
Status: Still Failing
Check console output at https://builds.apache.org/job/Jackrabbit%20Oak/2355/ to view the results.
Changes:
[mattryan] OAK-8590: Fix broken hrefs in direct binary access docs
Test results:
All tests passed
BUILD FAILURE: Jackrabbit Oak - Build # 2354 - Still Failing
Posted by Apache Jenkins Server <je...@builds.apache.org>.
The Apache Jenkins build system has built Jackrabbit Oak (build #2354)
Status: Still Failing
Check console output at https://builds.apache.org/job/Jackrabbit%20Oak/2354/ to view the results.
Changes:
[mreutegg] OAK-8592: Incorrect annotation on LoggingDocumentStoreWrapper.createOrUpdate()
Test results:
All tests passed
BUILD FAILURE: Jackrabbit Oak - Build # 2353 - Still Failing
Posted by Apache Jenkins Server <je...@builds.apache.org>.
The Apache Jenkins build system has built Jackrabbit Oak (build #2353)
Status: Still Failing
Check console output at https://builds.apache.org/job/Jackrabbit%20Oak/2353/ to view the results.
Changes:
[mreutegg] OAK-4508: LoggingDocumentStore: better support for multiple instances
Patch provided by José Cordero
[mreutegg] OAK-8591: Conflict exception on commit
Add ignored test
Test results:
All tests passed