You are viewing a plain text version of this content. The canonical link for it is here.
Posted to dev@hbase.apache.org by Kannan Muthukkaruppan <Ka...@facebook.com> on 2010/08/27 14:32:26 UTC
intermittent diff (?)- testIncrementColumnValue_BumpSnapshot
Hi,
Noticed this in our test run once. Didn't repro on a rerun though. But wanted to share with the list in case anyone was familiar with the test.
-------------------------------------------------------------------------------
Test set: org.apache.hadoop.hbase.regionserver.TestHRegion
-------------------------------------------------------------------------------
Tests run: 50, Failures: 1, Errors: 0, Skipped: 0, Time elapsed: 94.343 sec <<< FAILURE!
testIncrementColumnValue_BumpSnapshot(org.apache.hadoop.hbase.regionserver.TestHRegion) Time elapsed: 0.052 sec <<< FAILURE!
junit.framework.AssertionFailedError: ICV failed to upgrade timestamp
at junit.framework.Assert.fail(Assert.java:47)
at junit.framework.Assert.assertTrue(Assert.java:20)
at org.apache.hadoop.hbase.regionserver.TestHRegion.testIncrementColumnValue_BumpSnapshot(TestHRegion.java:1900)
regards,
Kannan
Re: intermittent diff (?)- testIncrementColumnValue_BumpSnapshot
Posted by Jean-Daniel Cryans <jd...@apache.org>.
Anything obvious in the logs? Also how old is your branch?
J-D
On Fri, Aug 27, 2010 at 5:32 AM, Kannan Muthukkaruppan
<Ka...@facebook.com> wrote:
> Hi,
>
> Noticed this in our test run once. Didn't repro on a rerun though. But wanted to share with the list in case anyone was familiar with the test.
>
> -------------------------------------------------------------------------------
> Test set: org.apache.hadoop.hbase.regionserver.TestHRegion
> -------------------------------------------------------------------------------
> Tests run: 50, Failures: 1, Errors: 0, Skipped: 0, Time elapsed: 94.343 sec <<< FAILURE!
> testIncrementColumnValue_BumpSnapshot(org.apache.hadoop.hbase.regionserver.TestHRegion) Time elapsed: 0.052 sec <<< FAILURE!
> junit.framework.AssertionFailedError: ICV failed to upgrade timestamp
> at junit.framework.Assert.fail(Assert.java:47)
> at junit.framework.Assert.assertTrue(Assert.java:20)
> at org.apache.hadoop.hbase.regionserver.TestHRegion.testIncrementColumnValue_BumpSnapshot(TestHRegion.java:1900)
>
> regards,
> Kannan
>