You are viewing a plain text version of this content. The canonical link for it is here.
Posted to dev@zookeeper.apache.org by Apache Jenkins Server <je...@builds.apache.org> on 2014/11/02 00:34:30 UTC

Failed: ZOOKEEPER-2069 PreCommit Build #2415

Jira: https://issues.apache.org/jira/browse/ZOOKEEPER-2069
Build: https://builds.apache.org/job/PreCommit-ZOOKEEPER-Build/2415/

###################################################################################
########################## LAST 60 LINES OF THE CONSOLE ###########################
[...truncated 380227 lines...]
     [exec] 
     [exec]     +1 @author.  The patch does not contain any @author tags.
     [exec] 
     [exec]     +1 tests included.  The patch appears to include 6 new or modified tests.
     [exec] 
     [exec]     +1 javadoc.  The javadoc tool did not generate any warning messages.
     [exec] 
     [exec]     +1 javac.  The applied patch does not increase the total number of javac compiler warnings.
     [exec] 
     [exec]     +1 findbugs.  The patch does not introduce any new Findbugs (version 2.0.3) warnings.
     [exec] 
     [exec]     +1 release audit.  The applied patch does not increase the total number of release audit warnings.
     [exec] 
     [exec]     -1 core tests.  The patch failed core unit tests.
     [exec] 
     [exec]     +1 contrib tests.  The patch passed contrib unit tests.
     [exec] 
     [exec] Test results: https://builds.apache.org/job/PreCommit-ZOOKEEPER-Build/2415//testReport/
     [exec] Findbugs warnings: https://builds.apache.org/job/PreCommit-ZOOKEEPER-Build/2415//artifact/trunk/build/test/findbugs/newPatchFindbugsWarnings.html
     [exec] Console output: https://builds.apache.org/job/PreCommit-ZOOKEEPER-Build/2415//console
     [exec] 
     [exec] This message is automatically generated.
     [exec] 
     [exec] 
     [exec] ======================================================================
     [exec] ======================================================================
     [exec]     Adding comment to Jira.
     [exec] ======================================================================
     [exec] ======================================================================
     [exec] 
     [exec] 
     [exec] Comment added.
     [exec] a8044fc5731f8129ab85cc3aa0fe13e2821e2e89 logged out
     [exec] 
     [exec] 
     [exec] ======================================================================
     [exec] ======================================================================
     [exec]     Finished build.
     [exec] ======================================================================
     [exec] ======================================================================
     [exec] 
     [exec] 

BUILD FAILED
/home/jenkins/jenkins-slave/workspace/PreCommit-ZOOKEEPER-Build/trunk/build.xml:1714: exec returned: 1

Total time: 43 minutes 45 seconds
Build step 'Execute shell' marked build as failure
Archiving artifacts
Sending artifact delta relative to PreCommit-ZOOKEEPER-Build #2409
Archived 7 artifacts
Archive block size is 32768
Received 6 blocks and 352292 bytes
Compression is 35.8%
Took 2.6 sec
Recording test results
Description set: ZOOKEEPER-2069
Email was triggered for: Failure
Sending email for trigger: Failure



###################################################################################
############################## FAILED TESTS (if any) ##############################
1 tests failed.
REGRESSION:  org.apache.zookeeper.test.ReconfigTest.testPortChange

Error Message:
expected:<test[1]> but was:<test[0]>

Stack Trace:
junit.framework.AssertionFailedError: expected:<test[1]> but was:<test[0]>
	at org.apache.zookeeper.test.ReconfigTest.testNormalOperation(ReconfigTest.java:151)
	at org.apache.zookeeper.test.ReconfigTest.testPortChange(ReconfigTest.java:600)
	at org.apache.zookeeper.JUnit4ZKTestRunner$LoggedInvokeMethod.evaluate(JUnit4ZKTestRunner.java:52)



Failed: ZOOKEEPER-2069 PreCommit Build #2416

Posted by Apache Jenkins Server <je...@builds.apache.org>.
Jira: https://issues.apache.org/jira/browse/ZOOKEEPER-2069
Build: https://builds.apache.org/job/PreCommit-ZOOKEEPER-Build/2416/

###################################################################################
########################## LAST 60 LINES OF THE CONSOLE ###########################
[...truncated 380616 lines...]
     [exec] 
     [exec]     +1 @author.  The patch does not contain any @author tags.
     [exec] 
     [exec]     +1 tests included.  The patch appears to include 6 new or modified tests.
     [exec] 
     [exec]     +1 javadoc.  The javadoc tool did not generate any warning messages.
     [exec] 
     [exec]     +1 javac.  The applied patch does not increase the total number of javac compiler warnings.
     [exec] 
     [exec]     -1 findbugs.  The patch appears to introduce 2 new Findbugs (version 2.0.3) warnings.
     [exec] 
     [exec]     +1 release audit.  The applied patch does not increase the total number of release audit warnings.
     [exec] 
     [exec]     -1 core tests.  The patch failed core unit tests.
     [exec] 
     [exec]     +1 contrib tests.  The patch passed contrib unit tests.
     [exec] 
     [exec] Test results: https://builds.apache.org/job/PreCommit-ZOOKEEPER-Build/2416//testReport/
     [exec] Findbugs warnings: https://builds.apache.org/job/PreCommit-ZOOKEEPER-Build/2416//artifact/trunk/build/test/findbugs/newPatchFindbugsWarnings.html
     [exec] Console output: https://builds.apache.org/job/PreCommit-ZOOKEEPER-Build/2416//console
     [exec] 
     [exec] This message is automatically generated.
     [exec] 
     [exec] 
     [exec] ======================================================================
     [exec] ======================================================================
     [exec]     Adding comment to Jira.
     [exec] ======================================================================
     [exec] ======================================================================
     [exec] 
     [exec] 
     [exec] Comment added.
     [exec] e42df5758747b94e68cb1e793b48a5903218a7f3 logged out
     [exec] 
     [exec] 
     [exec] ======================================================================
     [exec] ======================================================================
     [exec]     Finished build.
     [exec] ======================================================================
     [exec] ======================================================================
     [exec] 
     [exec] 

BUILD FAILED
/home/jenkins/jenkins-slave/workspace/PreCommit-ZOOKEEPER-Build/trunk/build.xml:1714: exec returned: 2

Total time: 44 minutes 37 seconds
Build step 'Execute shell' marked build as failure
Archiving artifacts
Sending artifact delta relative to PreCommit-ZOOKEEPER-Build #2409
Archived 7 artifacts
Archive block size is 32768
Received 6 blocks and 370879 bytes
Compression is 34.6%
Took 0.93 sec
Recording test results
Description set: ZOOKEEPER-2069
Email was triggered for: Failure
Sending email for trigger: Failure



###################################################################################
############################## FAILED TESTS (if any) ##############################
2 tests failed.
REGRESSION:  org.apache.zookeeper.server.quorum.ReconfigRecoveryTest.testNextConfigAlreadyActive

Error Message:
waiting for server 1 being up

Stack Trace:
junit.framework.AssertionFailedError: waiting for server 1 being up
	at org.apache.zookeeper.server.quorum.ReconfigRecoveryTest.testNextConfigAlreadyActive(ReconfigRecoveryTest.java:357)
	at org.apache.zookeeper.JUnit4ZKTestRunner$LoggedInvokeMethod.evaluate(JUnit4ZKTestRunner.java:52)


FAILED:  org.apache.zookeeper.test.ReconfigTest.testPortChange

Error Message:
expected:<test[1]> but was:<test[0]>

Stack Trace:
junit.framework.AssertionFailedError: expected:<test[1]> but was:<test[0]>
	at org.apache.zookeeper.test.ReconfigTest.testNormalOperation(ReconfigTest.java:151)
	at org.apache.zookeeper.test.ReconfigTest.testPortChange(ReconfigTest.java:600)
	at org.apache.zookeeper.JUnit4ZKTestRunner$LoggedInvokeMethod.evaluate(JUnit4ZKTestRunner.java:52)