You are viewing a plain text version of this content. The canonical link for it is here.
Posted to builds@cassandra.apache.org by Apache Jenkins Server <je...@builds.apache.org> on 2026/03/13 01:49:27 UTC
Build complete: Cassandra-5.0 #566 [UNSTABLE] ddfba19f9e547b102a54a700a0f99bcae565d06b
-------------------------------------------------------------------------------
Build Cassandra-5.0 #566 Still Unstable
URL: https://ci-cassandra.apache.org/job/Cassandra-5.0/566/
-------------------------------------------------------------------------------
Changes:
No changes
-------------------------------------------------------------------------------
Failed Tests:
33 tests failed.
FAILED: dtest-novnode.materialized_views_test.TestMaterializedViews.Tests / dtest-novnode jdk17 52/64 / test_drop_mv
FAILED: dtest-upgrade-large-novnode.upgrade_tests.upgrade_through_versions_test.TestUpgrade_current_5_0_x_To_indev_5_0_x.Tests / dtest-upgrade-large-novnode jdk11 10/32 / test_bootstrap_multidc
FAILED: dtest-upgrade-large.upgrade_tests.upgrade_through_versions_test.TestUpgrade_current_5_0_x_To_indev_5_0_x.Tests / dtest-upgrade-large jdk11 10/32 / test_bootstrap_multidc
FAILED: dtest-upgrade-novnode.upgrade_tests.cql_tests.TestCQLNodes2RF1_Upgrade_current_5_0_x_To_indev_5_0_x.Tests / dtest-upgrade-novnode jdk11 7/128 / test_order_by_multikey
FAILED: dtest-upgrade-novnode.upgrade_tests.cql_tests.TestCQLNodes3RF3_Upgrade_current_4_0_x_To_indev_5_0_x.Tests / dtest-upgrade-novnode jdk11 20/128 / test_select_distinct_with_deletions
FAILED: dtest-upgrade-novnode.upgrade_tests.cql_tests.TestCQLNodes3RF3_Upgrade_current_5_0_x_To_indev_5_0_x.Tests / dtest-upgrade-novnode jdk11 27/128 / test_composite_index_collections
FAILED: dtest-upgrade-novnode.upgrade_tests.cql_tests.TestCQLNodes3RF3_Upgrade_current_5_0_x_To_indev_5_0_x.Tests / dtest-upgrade-novnode jdk11 34/128 / test_multi_in_compact_non_composite
FAILED: dtest-upgrade-novnode.upgrade_tests.cql_tests.TestCQLNodes3RF3_Upgrade_current_5_0_x_To_indev_5_0_x.Tests / dtest-upgrade-novnode jdk11 39/128 / test_query_compact_tables_during_upgrade
FAILED: dtest-upgrade-novnode.upgrade_tests.cql_tests.TestCQLNodes3RF3_Upgrade_current_5_0_x_To_indev_5_0_x.Tests / dtest-upgrade-novnode jdk11 20/128 / test_reversed_compact_multikey
FAILED: dtest-upgrade-novnode.upgrade_tests.cql_tests.TestCQLNodes3RF3_Upgrade_current_5_0_x_To_indev_5_0_x.Tests / dtest-upgrade-novnode jdk11 7/128 / test_row_existence
FAILED: dtest-upgrade.upgrade_tests.cql_tests.TestCQLNodes2RF1_Upgrade_indev_4_0_x_To_indev_5_0_x.Tests / dtest-upgrade jdk11 77/128 / test_clustering_order_and_functions
FAILED: dtest-upgrade.upgrade_tests.cql_tests.TestCQLNodes2RF1_Upgrade_indev_4_0_x_To_indev_5_0_x.Tests / dtest-upgrade jdk11 83/128 / test_empty_in
FAILED: dtest-upgrade.upgrade_tests.cql_tests.TestCQLNodes2RF1_Upgrade_indev_4_0_x_To_indev_5_0_x.Tests / dtest-upgrade jdk11 1/128 / test_static_cf
FAILED: dtest-upgrade.upgrade_tests.cql_tests.TestCQLNodes2RF1_Upgrade_indev_4_1_x_To_indev_5_0_x.Tests / dtest-upgrade jdk11 83/128 / test_function_and_reverse_type
FAILED: dtest-upgrade.upgrade_tests.cql_tests.TestCQLNodes3RF3_Upgrade_current_4_0_x_To_indev_5_0_x.Tests / dtest-upgrade jdk11 18/128 / test_in_order_by_without_selecting
FAILED: dtest-upgrade.upgrade_tests.cql_tests.TestCQLNodes3RF3_Upgrade_current_4_1_x_To_indev_5_0_x.Tests / dtest-upgrade jdk11 37/128 / test_cas_and_list_index
FAILED: dtest-upgrade.upgrade_tests.cql_tests.TestCQLNodes3RF3_Upgrade_current_5_0_x_To_indev_5_0_x.Tests / dtest-upgrade jdk11 25/128 / test_large_count
FAILED: dtest-upgrade.upgrade_tests.cql_tests.TestCQLNodes3RF3_Upgrade_current_5_0_x_To_indev_5_0_x.Tests / dtest-upgrade jdk11 118/128 / test_multi_in_compact
FAILED: dtest-upgrade.upgrade_tests.cql_tests.TestCQLNodes3RF3_Upgrade_current_5_0_x_To_indev_5_0_x.Tests / dtest-upgrade jdk11 77/128 / test_reversed_comparator
FAILED: dtest-upgrade.upgrade_tests.cql_tests.TestCQLNodes3RF3_Upgrade_current_5_0_x_To_indev_5_0_x.Tests / dtest-upgrade jdk11 15/128 / test_select_distinct_with_deletions
FAILED: dtest-upgrade.upgrade_tests.cql_tests.TestCQLNodes3RF3_Upgrade_current_5_0_x_To_indev_5_0_x.Tests / dtest-upgrade jdk11 31/128 / test_static_columns_with_2i
FAILED: dtest-upgrade.upgrade_tests.cql_tests.TestCQLNodes3RF3_Upgrade_indev_4_0_x_To_indev_5_0_x.Tests / dtest-upgrade jdk11 77/128 / test_limit_sparse
FAILED: dtest-upgrade.upgrade_tests.cql_tests.TestCQLNodes3RF3_Upgrade_indev_4_0_x_To_indev_5_0_x.Tests / dtest-upgrade jdk11 83/128 / test_order_by
FAILED: dtest-upgrade.upgrade_tests.cql_tests.TestCQLNodes3RF3_Upgrade_indev_4_0_x_To_indev_5_0_x.Tests / dtest-upgrade jdk11 77/128 / test_tracing_prevents_startup_after_upgrading
FAILED: dtest-upgrade.upgrade_tests.cql_tests.TestCQLNodes3RF3_Upgrade_indev_4_1_x_To_indev_5_0_x.Tests / dtest-upgrade jdk11 83/128 / test_dense_cf
FAILED: dtest-upgrade.upgrade_tests.paging_test.TestPagingDataNodes2RF1_Upgrade_indev_4_0_x_To_indev_5_0_x.Tests / dtest-upgrade jdk11 83/128 / test_basic_paging
FAILED: dtest.materialized_views_test.TestMaterializedViews.Tests / dtest jdk17 63/64 / test_drop_with_stopped_build
FAILED: dtest.secondary_indexes_test.TestSecondaryIndexes.Tests / dtest jdk17 63/64 / test_6924_dropping_ks
FAILED: org.apache.cassandra.db.compaction.CompactionTaskTest.Tests / test-cdc jdk17 3/8 / testFullyExpiredSSTablesAreNotReleasedPrematurely-cdc_jdk17_x86_64
FAILED: org.apache.cassandra.db.compaction.CompactionTaskTest.Tests / test-compression jdk11 11/16 / testFullyExpiredSSTablesAreNotReleasedPrematurely-compression_jdk11_x86_64
FAILED: dtest-novnode.materialized_views_test.TestMaterializedViews.Tests / dtest-novnode jdk17 23/64 / test_complex_mv_select_statements
FAILED: dtest-upgrade-novnode.upgrade_tests.cql_tests.TestCQLNodes3RF3_Upgrade_current_5_0_x_To_indev_5_0_x.Tests / dtest-upgrade-novnode jdk11 62/128 / test_cas_simple
FAILED: dtest-upgrade-novnode.upgrade_tests.cql_tests.TestCQLNodes3RF3_Upgrade_current_5_0_x_To_indev_5_0_x.Tests / dtest-upgrade-novnode jdk11 54/128 / test_range_key_ordered
-------------------------------------------------------------------------------
For complete test report and logs see https://nightlies.apache.org/cassandra/Cassandra-5.0/566/