You are viewing a plain text version of this content. The canonical link for it is here.
Posted to dev@kafka.apache.org by Apache Jenkins Server <je...@builds.apache.org> on 2023/08/08 19:12:36 UTC
Build failed in Jenkins: Kafka » Kafka Branch Builder » trunk #2075
See <https://ci-builds.apache.org/job/Kafka/job/kafka/job/trunk/2075/display/redirect>
Changes:
------------------------------------------
[...truncated 385714 lines...]
Gradle Test Run :core:integrationTest > Gradle Test Executor 192 > SaslOAuthBearerSslEndToEndAuthorizationTest > testNoDescribeProduceOrConsumeWithoutTopicDescribeAcl(String, boolean) > [4] quorum=zk, isIdempotenceEnabled=false STARTED
Gradle Test Run :core:integrationTest > Gradle Test Executor 192 > SaslOAuthBearerSslEndToEndAuthorizationTest > testNoDescribeProduceOrConsumeWithoutTopicDescribeAcl(String, boolean) > [4] quorum=zk, isIdempotenceEnabled=false PASSED
Gradle Test Run :core:integrationTest > Gradle Test Executor 192 > TransactionsTest > testFailureToFenceEpoch(String) > testFailureToFenceEpoch(String).quorum=zk STARTED
Gradle Test Run :core:integrationTest > Gradle Test Executor 191 > SslAdminIntegrationTest > testAsynchronousAuthorizerAclUpdatesDontBlockRequestThreads() PASSED
Gradle Test Run :core:integrationTest > Gradle Test Executor 191 > SslAdminIntegrationTest > testSynchronousAuthorizerAclUpdatesBlockRequestThreads() STARTED
Gradle Test Run :core:integrationTest > Gradle Test Executor 191 > SslAdminIntegrationTest > testSynchronousAuthorizerAclUpdatesBlockRequestThreads() PASSED
Gradle Test Run :core:integrationTest > Gradle Test Executor 192 > TransactionsTest > testFailureToFenceEpoch(String) > testFailureToFenceEpoch(String).quorum=zk PASSED
Gradle Test Run :core:integrationTest > Gradle Test Executor 192 > TransactionsTest > testFailureToFenceEpoch(String) > testFailureToFenceEpoch(String).quorum=kraft STARTED
Gradle Test Run :connect:mirror:integrationTest > Gradle Test Executor 128 > MirrorConnectorsIntegrationTransactionsTest > testOffsetTranslationBehindReplicationFlow() PASSED
Gradle Test Run :connect:mirror:integrationTest > Gradle Test Executor 128 > MirrorConnectorsIntegrationTransactionsTest > testNoCheckpointsIfNoRecordsAreMirrored() STARTED
Gradle Test Run :core:integrationTest > Gradle Test Executor 192 > TransactionsTest > testFailureToFenceEpoch(String) > testFailureToFenceEpoch(String).quorum=kraft PASSED
2039 tests completed, 8 failed, 4 skipped
There were failing tests. See the report at: file:///home/jenkins/jenkins-agent/workspace/Kafka_kafka_trunk/core/build/reports/tests/integrationTest/index.html
Deprecated Gradle features were used in this build, making it incompatible with Gradle 9.0.
You can use '--warning-mode all' to show the individual deprecation warnings and determine if they come from your own scripts or plugins.
For more on this, please refer to https://docs.gradle.org/8.2.1/userguide/command_line_interface.html#sec:command_line_warnings in the Gradle documentation.
BUILD SUCCESSFUL in 3h 48m 41s
231 actionable tasks: 124 executed, 107 up-to-date
Publishing build scan...
https://ge.apache.org/s/2hafwhveieh5g
See the profiling report at: file:///home/jenkins/jenkins-agent/workspace/Kafka_kafka_trunk/build/reports/profile/profile-2023-08-08-15-10-30.html
A fine-grained performance profile is available: use the --scan option.
[Pipeline] junit
Recording test results
Gradle Test Run :connect:mirror:integrationTest > Gradle Test Executor 128 > MirrorConnectorsIntegrationTransactionsTest > testNoCheckpointsIfNoRecordsAreMirrored() PASSED
Gradle Test Run :connect:mirror:integrationTest > Gradle Test Executor 128 > MirrorConnectorsIntegrationTransactionsTest > testOneWayReplicationWithAutoOffsetSync() STARTED
Gradle Test Run :connect:mirror:integrationTest > Gradle Test Executor 129 > MirrorConnectorsWithCustomForwardingAdminIntegrationTest > testReplicationWithEmptyPartition() PASSED
Gradle Test Run :connect:mirror:integrationTest > Gradle Test Executor 129 > MirrorConnectorsWithCustomForwardingAdminIntegrationTest > testReplicateSourceDefault() STARTED
[Checks API] No suitable checks publisher found.
[Pipeline] echo
Skipping Kafka Streams archetype test for Java 17
[Pipeline] }
[Pipeline] // withEnv
[Pipeline] }
[Pipeline] // withEnv
[Pipeline] }
[Pipeline] // withEnv
[Pipeline] }
[Pipeline] // node
[Pipeline] }
[Pipeline] // timestamps
[Pipeline] }
[Pipeline] // timeout
[Pipeline] }
[Pipeline] // stage
[Pipeline] }
Gradle Test Run :connect:mirror:integrationTest > Gradle Test Executor 129 > MirrorConnectorsWithCustomForwardingAdminIntegrationTest > testReplicateSourceDefault() PASSED
Gradle Test Run :connect:mirror:integrationTest > Gradle Test Executor 129 > MirrorConnectorsWithCustomForwardingAdminIntegrationTest > testOffsetSyncsTopicsOnTarget() STARTED
Gradle Test Run :connect:mirror:integrationTest > Gradle Test Executor 128 > MirrorConnectorsIntegrationTransactionsTest > testOneWayReplicationWithAutoOffsetSync() PASSED
Gradle Test Run :connect:mirror:integrationTest > Gradle Test Executor 128 > MirrorConnectorsIntegrationTransactionsTest > testSyncTopicConfigs() STARTED
Gradle Test Run :connect:mirror:integrationTest > Gradle Test Executor 129 > MirrorConnectorsWithCustomForwardingAdminIntegrationTest > testOffsetSyncsTopicsOnTarget() PASSED
Gradle Test Run :connect:mirror:integrationTest > Gradle Test Executor 129 > MirrorConnectorsWithCustomForwardingAdminIntegrationTest > testReplicateTargetDefault() STARTED
Gradle Test Run :connect:mirror:integrationTest > Gradle Test Executor 128 > MirrorConnectorsIntegrationTransactionsTest > testSyncTopicConfigs() PASSED
Gradle Test Run :connect:mirror:integrationTest > Gradle Test Executor 128 > MirrorConnectorsIntegrationTransactionsTest > testRestartReplication() STARTED
Gradle Test Run :connect:mirror:integrationTest > Gradle Test Executor 129 > MirrorConnectorsWithCustomForwardingAdminIntegrationTest > testReplicateTargetDefault() PASSED
Gradle Test Run :connect:mirror:integrationTest > Gradle Test Executor 129 > MirrorConnectorsWithCustomForwardingAdminIntegrationTest > testOffsetTranslationBehindReplicationFlow() STARTED
Gradle Test Run :connect:mirror:integrationTest > Gradle Test Executor 129 > MirrorConnectorsWithCustomForwardingAdminIntegrationTest > testOffsetTranslationBehindReplicationFlow() PASSED
Gradle Test Run :connect:mirror:integrationTest > Gradle Test Executor 129 > MirrorConnectorsWithCustomForwardingAdminIntegrationTest > testNoCheckpointsIfNoRecordsAreMirrored() STARTED
Gradle Test Run :connect:mirror:integrationTest > Gradle Test Executor 128 > MirrorConnectorsIntegrationTransactionsTest > testRestartReplication() PASSED
Gradle Test Run :connect:mirror:integrationTest > Gradle Test Executor 128 > MirrorConnectorsIntegrationTransactionsTest > testOneWayReplicationWithFrequentOffsetSyncs() STARTED
Gradle Test Run :connect:mirror:integrationTest > Gradle Test Executor 129 > MirrorConnectorsWithCustomForwardingAdminIntegrationTest > testNoCheckpointsIfNoRecordsAreMirrored() PASSED
Gradle Test Run :connect:mirror:integrationTest > Gradle Test Executor 129 > MirrorConnectorsWithCustomForwardingAdminIntegrationTest > testOneWayReplicationWithAutoOffsetSync() STARTED
Gradle Test Run :connect:mirror:integrationTest > Gradle Test Executor 129 > MirrorConnectorsWithCustomForwardingAdminIntegrationTest > testOneWayReplicationWithAutoOffsetSync() PASSED
Gradle Test Run :connect:mirror:integrationTest > Gradle Test Executor 129 > MirrorConnectorsWithCustomForwardingAdminIntegrationTest > testSyncTopicConfigs() STARTED
Gradle Test Run :connect:mirror:integrationTest > Gradle Test Executor 129 > MirrorConnectorsWithCustomForwardingAdminIntegrationTest > testSyncTopicConfigs() PASSED
Gradle Test Run :connect:mirror:integrationTest > Gradle Test Executor 129 > MirrorConnectorsWithCustomForwardingAdminIntegrationTest > testRestartReplication() STARTED
Gradle Test Run :connect:mirror:integrationTest > Gradle Test Executor 128 > MirrorConnectorsIntegrationTransactionsTest > testOneWayReplicationWithFrequentOffsetSyncs() PASSED
Gradle Test Run :connect:mirror:integrationTest > Gradle Test Executor 129 > MirrorConnectorsWithCustomForwardingAdminIntegrationTest > testRestartReplication() PASSED
Gradle Test Run :connect:mirror:integrationTest > Gradle Test Executor 129 > MirrorConnectorsWithCustomForwardingAdminIntegrationTest > testOneWayReplicationWithFrequentOffsetSyncs() STARTED
Gradle Test Run :connect:mirror:integrationTest > Gradle Test Executor 129 > MirrorConnectorsWithCustomForwardingAdminIntegrationTest > testOneWayReplicationWithFrequentOffsetSyncs() PASSED
Gradle Test Run :connect:mirror:integrationTest > Gradle Test Executor 129 > MirrorConnectorsWithCustomForwardingAdminIntegrationTest > testReplicationIsCreatingTopicsUsingProvidedForwardingAdmin() STARTED
Gradle Test Run :connect:mirror:integrationTest > Gradle Test Executor 129 > MirrorConnectorsWithCustomForwardingAdminIntegrationTest > testReplicationIsCreatingTopicsUsingProvidedForwardingAdmin() PASSED
Gradle Test Run :connect:mirror:integrationTest > Gradle Test Executor 129 > MirrorConnectorsWithCustomForwardingAdminIntegrationTest > testSyncTopicACLsUseProvidedForwardingAdmin() STARTED
Gradle Test Run :connect:mirror:integrationTest > Gradle Test Executor 129 > MirrorConnectorsWithCustomForwardingAdminIntegrationTest > testSyncTopicACLsUseProvidedForwardingAdmin() PASSED
Gradle Test Run :connect:mirror:integrationTest > Gradle Test Executor 129 > MirrorConnectorsWithCustomForwardingAdminIntegrationTest > testCreatePartitionsUseProvidedForwardingAdmin() STARTED
Gradle Test Run :connect:mirror:integrationTest > Gradle Test Executor 129 > MirrorConnectorsWithCustomForwardingAdminIntegrationTest > testCreatePartitionsUseProvidedForwardingAdmin() PASSED
Gradle Test Run :connect:mirror:integrationTest > Gradle Test Executor 129 > MirrorConnectorsWithCustomForwardingAdminIntegrationTest > testSyncTopicConfigUseProvidedForwardingAdmin() STARTED
Gradle Test Run :connect:mirror:integrationTest > Gradle Test Executor 129 > MirrorConnectorsWithCustomForwardingAdminIntegrationTest > testSyncTopicConfigUseProvidedForwardingAdmin() PASSED
Gradle Test Run :connect:mirror:integrationTest > Gradle Test Executor 184 > IdentityReplicationIntegrationTest > testOffsetSyncsTopicsOnTarget() STARTED
Gradle Test Run :connect:mirror:integrationTest > Gradle Test Executor 183 > DedicatedMirrorIntegrationTest > testMultiNodeCluster() STARTED
Gradle Test Run :connect:mirror:integrationTest > Gradle Test Executor 184 > IdentityReplicationIntegrationTest > testOffsetSyncsTopicsOnTarget() PASSED
Gradle Test Run :connect:mirror:integrationTest > Gradle Test Executor 183 > DedicatedMirrorIntegrationTest > testMultiNodeCluster() PASSED
Gradle Test Run :connect:mirror:integrationTest > Gradle Test Executor 183 > MirrorConnectorsIntegrationSSLTest > testOffsetTranslationBehindReplicationFlow() STARTED
Gradle Test Run :connect:mirror:integrationTest > Gradle Test Executor 183 > MirrorConnectorsIntegrationSSLTest > testOffsetTranslationBehindReplicationFlow() PASSED
75 tests completed, 3 failed
There were failing tests. See the report at: file:///home/jenkins/jenkins-agent/712657a4/workspace/Kafka_kafka_trunk/connect/mirror/build/reports/tests/integrationTest/index.html
FAILURE: Build completed with 4 failures.
1: Task failed with an exception.
-----------
* What went wrong:
Execution failed for task ':core:unitTest'.
> Process 'Gradle Test Executor 8' finished with non-zero exit value 137
This problem might be caused by incorrect test process configuration.
For more on test execution, please refer to https://docs.gradle.org/8.2.1/userguide/java_testing.html#sec:test_execution in the Gradle documentation.
* Try:
> Run with --stacktrace option to get the stack trace.
> Run with --info or --debug option to get more log output.
> Get more help at https://help.gradle.org.
==============================================================================
2: Task failed with an exception.
-----------
* What went wrong:
Execution failed for task ':core:integrationTest'.
> Process 'Gradle Test Executor 95' finished with non-zero exit value 1
This problem might be caused by incorrect test process configuration.
For more on test execution, please refer to https://docs.gradle.org/8.2.1/userguide/java_testing.html#sec:test_execution in the Gradle documentation.
* Try:
> Run with --stacktrace option to get the stack trace.
> Run with --info or --debug option to get more log output.
> Get more help at https://help.gradle.org.
==============================================================================
3: Task failed with an exception.
-----------
* What went wrong:
Execution failed for task ':streams:integrationTest'.
> Process 'Gradle Test Executor 112' finished with non-zero exit value 137
This problem might be caused by incorrect test process configuration.
For more on test execution, please refer to https://docs.gradle.org/8.2.1/userguide/java_testing.html#sec:test_execution in the Gradle documentation.
* Try:
> Run with --stacktrace option to get the stack trace.
> Run with --info or --debug option to get more log output.
> Get more help at https://help.gradle.org.
==============================================================================
4: Task failed with an exception.
-----------
* What went wrong:
Execution failed for task ':streams:upgrade-system-tests-24:integrationTest'.
> Process 'Gradle Test Executor 165' finished with non-zero exit value 1
This problem might be caused by incorrect test process configuration.
For more on test execution, please refer to https://docs.gradle.org/8.2.1/userguide/java_testing.html#sec:test_execution in the Gradle documentation.
* Try:
> Run with --stacktrace option to get the stack trace.
> Run with --info or --debug option to get more log output.
> Get more help at https://help.gradle.org.
==============================================================================
Deprecated Gradle features were used in this build, making it incompatible with Gradle 9.0.
You can use '--warning-mode all' to show the individual deprecation warnings and determine if they come from your own scripts or plugins.
For more on this, please refer to https://docs.gradle.org/8.2.1/userguide/command_line_interface.html#sec:command_line_warnings in the Gradle documentation.
BUILD FAILED in 3h 45m 9s
231 actionable tasks: 124 executed, 107 up-to-date
Publishing build scan...
https://ge.apache.org/s/k5chcvmkrnfaa
See the profiling report at: file:///home/jenkins/jenkins-agent/712657a4/workspace/Kafka_kafka_trunk/build/reports/profile/profile-2023-08-08-15-27-24.html
A fine-grained performance profile is available: use the --scan option.
[Pipeline] }
[Pipeline] // withEnv
[Pipeline] }
[Pipeline] // withEnv
[Pipeline] }
[Pipeline] // withEnv
[Pipeline] }
[Pipeline] // node
[Pipeline] }
[Pipeline] // timestamps
[Pipeline] }
[Pipeline] // timeout
[Pipeline] }
[Pipeline] // stage
[Pipeline] }
Failed in branch JDK 11 and Scala 2.13
[Pipeline] // parallel
[Pipeline] }
[Pipeline] // stage
[Pipeline] stage
[Pipeline] { (Declarative: Post Actions)
[Pipeline] script
[Pipeline] {
[Pipeline] node
Running on builds57 in /home/jenkins/jenkins-agent/workspace/Kafka_kafka_trunk
[Pipeline] {
[Pipeline] step
Jenkins build is still unstable: Kafka » Kafka Branch Builder » trunk #2094
Posted by Apache Jenkins Server <je...@builds.apache.org>.
See <https://ci-builds.apache.org/job/Kafka/job/kafka/job/trunk/2094/display/redirect>
Jenkins build is unstable: Kafka » Kafka Branch Builder » trunk #2093
Posted by Apache Jenkins Server <je...@builds.apache.org>.
See <https://ci-builds.apache.org/job/Kafka/job/kafka/job/trunk/2093/display/redirect>
Build failed in Jenkins: Kafka » Kafka Branch Builder » trunk #2092
Posted by Apache Jenkins Server <je...@builds.apache.org>.
See <https://ci-builds.apache.org/job/Kafka/job/kafka/job/trunk/2092/display/redirect>
Changes:
------------------------------------------
[...truncated 401822 lines...]
[INFO] --- compiler:3.1:compile (default-compile) @ streams.examples ---
[INFO] Changes detected - recompiling the module!
[INFO] Compiling 3 source files to /home/jenkins/jenkins-agent/workspace/Kafka_kafka_trunk_2/streams/quickstart/test-streams-archetype/streams.examples/target/classes
[INFO] ------------------------------------------------------------------------
[INFO] BUILD SUCCESS
[INFO] ------------------------------------------------------------------------
[INFO] Total time: 2.087 s
[INFO] Finished at: 2023-08-11T21:23:30Z
[INFO] ------------------------------------------------------------------------
[Pipeline] }
[Pipeline] // dir
[Pipeline] }
[Pipeline] // dir
[Pipeline] }
[Pipeline] // dir
[Pipeline] }
[Pipeline] // withEnv
[Pipeline] }
[Pipeline] // withEnv
[Pipeline] }
[Pipeline] // withEnv
[Pipeline] }
[Pipeline] // node
[Pipeline] }
[Pipeline] // timestamps
[Pipeline] }
[Pipeline] // timeout
[Pipeline] }
[Pipeline] // stage
[Pipeline] }
Gradle Test Run :streams:integrationTest > Gradle Test Executor 179 > KStreamAggregationDedupIntegrationTest > shouldReduce(TestInfo) PASSED
Gradle Test Run :streams:integrationTest > Gradle Test Executor 179 > KStreamAggregationDedupIntegrationTest > shouldGroupByKey(TestInfo) STARTED
Gradle Test Run :streams:integrationTest > Gradle Test Executor 179 > KStreamAggregationDedupIntegrationTest > shouldGroupByKey(TestInfo) PASSED
Gradle Test Run :streams:integrationTest > Gradle Test Executor 179 > KStreamAggregationDedupIntegrationTest > shouldReduceWindowed(TestInfo) STARTED
Gradle Test Run :streams:integrationTest > Gradle Test Executor 179 > KStreamAggregationDedupIntegrationTest > shouldReduceWindowed(TestInfo) PASSED
Gradle Test Run :streams:integrationTest > Gradle Test Executor 179 > KStreamKStreamIntegrationTest > shouldOuterJoin() STARTED
Gradle Test Run :streams:integrationTest > Gradle Test Executor 179 > KStreamKStreamIntegrationTest > shouldOuterJoin() PASSED
Gradle Test Run :streams:integrationTest > Gradle Test Executor 179 > KTableKTableForeignKeyInnerJoinMultiIntegrationTest > shouldInnerJoinMultiPartitionQueryable() STARTED
Gradle Test Run :streams:integrationTest > Gradle Test Executor 179 > KTableKTableForeignKeyInnerJoinMultiIntegrationTest > shouldInnerJoinMultiPartitionQueryable() PASSED
Gradle Test Run :streams:integrationTest > Gradle Test Executor 179 > KTableSourceTopicRestartIntegrationTest > shouldRestoreAndProgressWhenTopicNotWrittenToDuringRestoration() STARTED
Gradle Test Run :streams:integrationTest > Gradle Test Executor 179 > KTableSourceTopicRestartIntegrationTest > shouldRestoreAndProgressWhenTopicNotWrittenToDuringRestoration() PASSED
Gradle Test Run :streams:integrationTest > Gradle Test Executor 179 > KTableSourceTopicRestartIntegrationTest > shouldRestoreAndProgressWhenTopicWrittenToDuringRestorationWithEosAlphaEnabled() STARTED
Gradle Test Run :streams:integrationTest > Gradle Test Executor 179 > KTableSourceTopicRestartIntegrationTest > shouldRestoreAndProgressWhenTopicWrittenToDuringRestorationWithEosAlphaEnabled() PASSED
Gradle Test Run :streams:integrationTest > Gradle Test Executor 179 > KTableSourceTopicRestartIntegrationTest > shouldRestoreAndProgressWhenTopicWrittenToDuringRestorationWithEosDisabled() STARTED
Gradle Test Run :streams:integrationTest > Gradle Test Executor 179 > KTableSourceTopicRestartIntegrationTest > shouldRestoreAndProgressWhenTopicWrittenToDuringRestorationWithEosDisabled() PASSED
Gradle Test Run :streams:integrationTest > Gradle Test Executor 179 > KTableSourceTopicRestartIntegrationTest > shouldRestoreAndProgressWhenTopicWrittenToDuringRestorationWithEosV2Enabled() STARTED
Gradle Test Run :streams:integrationTest > Gradle Test Executor 179 > KTableSourceTopicRestartIntegrationTest > shouldRestoreAndProgressWhenTopicWrittenToDuringRestorationWithEosV2Enabled() PASSED
Gradle Test Run :streams:integrationTest > Gradle Test Executor 179 > LagFetchIntegrationTest > shouldFetchLagsDuringRebalancingWithOptimization() STARTED
Gradle Test Run :streams:integrationTest > Gradle Test Executor 179 > LagFetchIntegrationTest > shouldFetchLagsDuringRebalancingWithOptimization() PASSED
Gradle Test Run :streams:integrationTest > Gradle Test Executor 179 > LagFetchIntegrationTest > shouldFetchLagsDuringRestoration() STARTED
Gradle Test Run :streams:integrationTest > Gradle Test Executor 179 > LagFetchIntegrationTest > shouldFetchLagsDuringRestoration() PASSED
Gradle Test Run :streams:integrationTest > Gradle Test Executor 179 > LagFetchIntegrationTest > shouldFetchLagsDuringRebalancingWithNoOptimization() STARTED
Gradle Test Run :streams:integrationTest > Gradle Test Executor 179 > LagFetchIntegrationTest > shouldFetchLagsDuringRebalancingWithNoOptimization() PASSED
Gradle Test Run :streams:integrationTest > Gradle Test Executor 179 > OptimizedKTableIntegrationTest > shouldApplyUpdatesToStandbyStore(TestInfo) STARTED
Gradle Test Run :streams:integrationTest > Gradle Test Executor 179 > OptimizedKTableIntegrationTest > shouldApplyUpdatesToStandbyStore(TestInfo) PASSED
Gradle Test Run :streams:integrationTest > Gradle Test Executor 179 > RestoreIntegrationTest > shouldRecycleStateFromStandbyTaskPromotedToActiveTaskAndNotRestore(boolean) > [1] true STARTED
Gradle Test Run :streams:integrationTest > Gradle Test Executor 179 > RestoreIntegrationTest > shouldRecycleStateFromStandbyTaskPromotedToActiveTaskAndNotRestore(boolean) > [1] true PASSED
Gradle Test Run :streams:integrationTest > Gradle Test Executor 179 > RestoreIntegrationTest > shouldRecycleStateFromStandbyTaskPromotedToActiveTaskAndNotRestore(boolean) > [2] false STARTED
Gradle Test Run :streams:integrationTest > Gradle Test Executor 179 > RestoreIntegrationTest > shouldRecycleStateFromStandbyTaskPromotedToActiveTaskAndNotRestore(boolean) > [2] false PASSED
Gradle Test Run :streams:integrationTest > Gradle Test Executor 179 > RestoreIntegrationTest > shouldProcessDataFromStoresWithLoggingDisabled(boolean) > [1] true STARTED
Gradle Test Run :streams:integrationTest > Gradle Test Executor 179 > RestoreIntegrationTest > shouldProcessDataFromStoresWithLoggingDisabled(boolean) > [1] true PASSED
Gradle Test Run :streams:integrationTest > Gradle Test Executor 179 > RestoreIntegrationTest > shouldProcessDataFromStoresWithLoggingDisabled(boolean) > [2] false STARTED
Gradle Test Run :streams:integrationTest > Gradle Test Executor 179 > RestoreIntegrationTest > shouldProcessDataFromStoresWithLoggingDisabled(boolean) > [2] false PASSED
Gradle Test Run :streams:integrationTest > Gradle Test Executor 179 > RestoreIntegrationTest > shouldRestoreNullRecord() STARTED
Gradle Test Run :streams:integrationTest > Gradle Test Executor 179 > RestoreIntegrationTest > shouldRestoreNullRecord() PASSED
Gradle Test Run :streams:integrationTest > Gradle Test Executor 179 > RestoreIntegrationTest > shouldRestoreStateFromSourceTopic(boolean) > [1] true STARTED
Gradle Test Run :streams:integrationTest > Gradle Test Executor 179 > RestoreIntegrationTest > shouldRestoreStateFromSourceTopic(boolean) > [1] true PASSED
Gradle Test Run :streams:integrationTest > Gradle Test Executor 179 > RestoreIntegrationTest > shouldRestoreStateFromSourceTopic(boolean) > [2] false STARTED
Gradle Test Run :streams:integrationTest > Gradle Test Executor 179 > RestoreIntegrationTest > shouldRestoreStateFromSourceTopic(boolean) > [2] false PASSED
Gradle Test Run :streams:integrationTest > Gradle Test Executor 179 > RestoreIntegrationTest > shouldSuccessfullyStartWhenLoggingDisabled(boolean) > [1] true STARTED
Gradle Test Run :streams:integrationTest > Gradle Test Executor 179 > RestoreIntegrationTest > shouldSuccessfullyStartWhenLoggingDisabled(boolean) > [1] true PASSED
Gradle Test Run :streams:integrationTest > Gradle Test Executor 179 > RestoreIntegrationTest > shouldSuccessfullyStartWhenLoggingDisabled(boolean) > [2] false STARTED
Gradle Test Run :streams:integrationTest > Gradle Test Executor 179 > RestoreIntegrationTest > shouldSuccessfullyStartWhenLoggingDisabled(boolean) > [2] false PASSED
Gradle Test Run :streams:integrationTest > Gradle Test Executor 179 > RestoreIntegrationTest > shouldRestoreStateFromChangelogTopic(boolean) > [1] true STARTED
Gradle Test Run :streams:integrationTest > Gradle Test Executor 179 > RestoreIntegrationTest > shouldRestoreStateFromChangelogTopic(boolean) > [1] true PASSED
Gradle Test Run :streams:integrationTest > Gradle Test Executor 179 > RestoreIntegrationTest > shouldRestoreStateFromChangelogTopic(boolean) > [2] false STARTED
Gradle Test Run :streams:integrationTest > Gradle Test Executor 179 > RestoreIntegrationTest > shouldRestoreStateFromChangelogTopic(boolean) > [2] false PASSED
Gradle Test Run :streams:integrationTest > Gradle Test Executor 179 > SmokeTestDriverIntegrationTest > shouldWorkWithRebalance(boolean) > [1] true STARTED
Gradle Test Run :streams:integrationTest > Gradle Test Executor 179 > SmokeTestDriverIntegrationTest > shouldWorkWithRebalance(boolean) > [1] true PASSED
Gradle Test Run :streams:integrationTest > Gradle Test Executor 179 > SmokeTestDriverIntegrationTest > shouldWorkWithRebalance(boolean) > [2] false STARTED
Gradle Test Run :streams:integrationTest > Gradle Test Executor 179 > SmokeTestDriverIntegrationTest > shouldWorkWithRebalance(boolean) > [2] false PASSED
Gradle Test Run :streams:integrationTest > Gradle Test Executor 179 > StoreQueryIntegrationTest > shouldQuerySpecificActivePartitionStores() STARTED
Gradle Test Run :streams:integrationTest > Gradle Test Executor 179 > StoreQueryIntegrationTest > shouldQuerySpecificActivePartitionStores() PASSED
Gradle Test Run :streams:integrationTest > Gradle Test Executor 179 > StoreQueryIntegrationTest > shouldFailWithIllegalArgumentExceptionWhenIQPartitionerReturnsMultiplePartitions() STARTED
Gradle Test Run :streams:integrationTest > Gradle Test Executor 179 > StoreQueryIntegrationTest > shouldFailWithIllegalArgumentExceptionWhenIQPartitionerReturnsMultiplePartitions() PASSED
Gradle Test Run :streams:integrationTest > Gradle Test Executor 179 > StoreQueryIntegrationTest > shouldQueryAllStalePartitionStores() STARTED
Gradle Test Run :streams:integrationTest > Gradle Test Executor 179 > StoreQueryIntegrationTest > shouldQueryAllStalePartitionStores() PASSED
Gradle Test Run :streams:integrationTest > Gradle Test Executor 179 > StoreQueryIntegrationTest > shouldQuerySpecificStalePartitionStoresMultiStreamThreads() STARTED
Gradle Test Run :streams:integrationTest > Gradle Test Executor 179 > StoreQueryIntegrationTest > shouldQuerySpecificStalePartitionStoresMultiStreamThreads() PASSED
Gradle Test Run :streams:integrationTest > Gradle Test Executor 179 > StoreQueryIntegrationTest > shouldQuerySpecificStalePartitionStores() STARTED
Gradle Test Run :streams:integrationTest > Gradle Test Executor 179 > StoreQueryIntegrationTest > shouldQuerySpecificStalePartitionStores() PASSED
Gradle Test Run :streams:integrationTest > Gradle Test Executor 179 > StoreQueryIntegrationTest > shouldQueryOnlyActivePartitionStoresByDefault() STARTED
Gradle Test Run :streams:integrationTest > Gradle Test Executor 179 > StoreQueryIntegrationTest > shouldQueryOnlyActivePartitionStoresByDefault() PASSED
Gradle Test Run :streams:integrationTest > Gradle Test Executor 179 > StoreQueryIntegrationTest > shouldQueryStoresAfterAddingAndRemovingStreamThread() STARTED
Gradle Test Run :streams:integrationTest > Gradle Test Executor 179 > StoreQueryIntegrationTest > shouldQueryStoresAfterAddingAndRemovingStreamThread() PASSED
Gradle Test Run :streams:integrationTest > Gradle Test Executor 179 > StoreQueryIntegrationTest > shouldQuerySpecificStalePartitionStoresMultiStreamThreadsNamedTopology() STARTED
Gradle Test Run :streams:integrationTest > Gradle Test Executor 179 > StoreQueryIntegrationTest > shouldQuerySpecificStalePartitionStoresMultiStreamThreadsNamedTopology() PASSED
streams-6: SMOKE-TEST-CLIENT-CLOSED
streams-3: SMOKE-TEST-CLIENT-CLOSED
streams-5: SMOKE-TEST-CLIENT-CLOSED
streams-4: SMOKE-TEST-CLIENT-CLOSED
streams-4: SMOKE-TEST-CLIENT-CLOSED
streams-1: SMOKE-TEST-CLIENT-CLOSED
streams-1: SMOKE-TEST-CLIENT-CLOSED
streams-2: SMOKE-TEST-CLIENT-CLOSED
streams-3: SMOKE-TEST-CLIENT-CLOSED
streams-2: SMOKE-TEST-CLIENT-CLOSED
streams-0: SMOKE-TEST-CLIENT-CLOSED
streams-0: SMOKE-TEST-CLIENT-CLOSED
FAILURE: Build completed with 2 failures.
1: Task failed with an exception.
-----------
* What went wrong:
Execution failed for task ':streams:upgrade-system-tests-10:unitTest'.
> Process 'Gradle Test Executor 3' finished with non-zero exit value 1
This problem might be caused by incorrect test process configuration.
For more on test execution, please refer to https://docs.gradle.org/8.2.1/userguide/java_testing.html#sec:test_execution in the Gradle documentation.
* Try:
> Run with --stacktrace option to get the stack trace.
> Run with --info or --debug option to get more log output.
> Get more help at https://help.gradle.org.
==============================================================================
2: Task failed with an exception.
-----------
* What went wrong:
Execution failed for task ':streams:upgrade-system-tests-33:integrationTest'.
> Process 'Gradle Test Executor 55' finished with non-zero exit value 1
This problem might be caused by incorrect test process configuration.
For more on test execution, please refer to https://docs.gradle.org/8.2.1/userguide/java_testing.html#sec:test_execution in the Gradle documentation.
* Try:
> Run with --stacktrace option to get the stack trace.
> Run with --info or --debug option to get more log output.
> Get more help at https://help.gradle.org.
==============================================================================
Deprecated Gradle features were used in this build, making it incompatible with Gradle 9.0.
You can use '--warning-mode all' to show the individual deprecation warnings and determine if they come from your own scripts or plugins.
For more on this, please refer to https://docs.gradle.org/8.2.1/userguide/command_line_interface.html#sec:command_line_warnings in the Gradle documentation.
BUILD FAILED in 2h 39m 18s
237 actionable tasks: 124 executed, 113 up-to-date
Publishing build scan...
https://ge.apache.org/s/7fxg7ytgndavg
See the profiling report at: file:///home/jenkins/jenkins-agent/workspace/Kafka_kafka_trunk/build/reports/profile/profile-2023-08-11-18-52-02.html
A fine-grained performance profile is available: use the --scan option.
[Pipeline] }
[Pipeline] // withEnv
[Pipeline] }
[Pipeline] // withEnv
[Pipeline] }
[Pipeline] // withEnv
[Pipeline] }
[Pipeline] // node
[Pipeline] }
[Pipeline] // timestamps
[Pipeline] }
[Pipeline] // timeout
[Pipeline] }
[Pipeline] // stage
[Pipeline] }
Failed in branch JDK 17 and Scala 2.13
[Pipeline] // parallel
[Pipeline] }
[Pipeline] // stage
[Pipeline] stage
[Pipeline] { (Declarative: Post Actions)
[Pipeline] script
[Pipeline] {
[Pipeline] node
Running on builds57 in /home/jenkins/jenkins-agent/workspace/Kafka_kafka_trunk
[Pipeline] {
[Pipeline] step
Jenkins build is still unstable: Kafka » Kafka Branch Builder » trunk #2091
Posted by Apache Jenkins Server <je...@builds.apache.org>.
See <https://ci-builds.apache.org/job/Kafka/job/kafka/job/trunk/2091/display/redirect>
Jenkins build is still unstable: Kafka » Kafka Branch Builder » trunk #2090
Posted by Apache Jenkins Server <je...@builds.apache.org>.
See <https://ci-builds.apache.org/job/Kafka/job/kafka/job/trunk/2090/display/redirect>
Jenkins build is still unstable: Kafka » Kafka Branch Builder » trunk #2089
Posted by Apache Jenkins Server <je...@builds.apache.org>.
See <https://ci-builds.apache.org/job/Kafka/job/kafka/job/trunk/2089/display/redirect>
Jenkins build is unstable: Kafka » Kafka Branch Builder » trunk #2088
Posted by Apache Jenkins Server <je...@builds.apache.org>.
See <https://ci-builds.apache.org/job/Kafka/job/kafka/job/trunk/2088/display/redirect>
Build failed in Jenkins: Kafka » Kafka Branch Builder » trunk #2087
Posted by Apache Jenkins Server <je...@builds.apache.org>.
See <https://ci-builds.apache.org/job/Kafka/job/kafka/job/trunk/2087/display/redirect>
Changes:
------------------------------------------
[...truncated 406314 lines...]
streams-5: SMOKE-TEST-CLIENT-CLOSED
streams-5: SMOKE-TEST-CLIENT-CLOSED
streams-1: SMOKE-TEST-CLIENT-CLOSED
streams-4: SMOKE-TEST-CLIENT-CLOSED
streams-0: SMOKE-TEST-CLIENT-CLOSED
streams-2: SMOKE-TEST-CLIENT-CLOSED
streams-0: SMOKE-TEST-CLIENT-CLOSED
streams-3: SMOKE-TEST-CLIENT-CLOSED
Deprecated Gradle features were used in this build, making it incompatible with Gradle 9.0.
You can use '--warning-mode all' to show the individual deprecation warnings and determine if they come from your own scripts or plugins.
For more on this, please refer to https://docs.gradle.org/8.2.1/userguide/command_line_interface.html#sec:command_line_warnings in the Gradle documentation.
BUILD SUCCESSFUL in 2h 39m 10s
237 actionable tasks: 124 executed, 113 up-to-date
Publishing build scan...
https://ge.apache.org/s/qjnm2bxqy3nkg
See the profiling report at: file:///home/jenkins/workspace/Kafka_kafka_trunk@2/build/reports/profile/profile-2023-08-10-21-16-20.html
A fine-grained performance profile is available: use the --scan option.
[Pipeline] junit
Recording test results
[Checks API] No suitable checks publisher found.
[Pipeline] echo
Skipping Kafka Streams archetype test for Java 20
[Pipeline] }
[Pipeline] // withEnv
[Pipeline] }
[Pipeline] // withEnv
[Pipeline] }
[Pipeline] // withEnv
[Pipeline] }
[Pipeline] // node
[Pipeline] }
[Pipeline] // timestamps
[Pipeline] }
[Pipeline] // timeout
[Pipeline] }
[Pipeline] // stage
[Pipeline] }
Gradle Test Run :streams:integrationTest > Gradle Test Executor 184 > SmokeTestDriverIntegrationTest > shouldWorkWithRebalance(boolean) > [2] false PASSED
Gradle Test Run :streams:integrationTest > Gradle Test Executor 184 > StoreQueryIntegrationTest > shouldQuerySpecificActivePartitionStores() STARTED
Gradle Test Run :streams:integrationTest > Gradle Test Executor 184 > StoreQueryIntegrationTest > shouldQuerySpecificActivePartitionStores() PASSED
Gradle Test Run :streams:integrationTest > Gradle Test Executor 184 > StoreQueryIntegrationTest > shouldFailWithIllegalArgumentExceptionWhenIQPartitionerReturnsMultiplePartitions() STARTED
Gradle Test Run :streams:integrationTest > Gradle Test Executor 184 > StoreQueryIntegrationTest > shouldFailWithIllegalArgumentExceptionWhenIQPartitionerReturnsMultiplePartitions() PASSED
Gradle Test Run :streams:integrationTest > Gradle Test Executor 184 > StoreQueryIntegrationTest > shouldQueryAllStalePartitionStores() STARTED
Gradle Test Run :streams:integrationTest > Gradle Test Executor 184 > StoreQueryIntegrationTest > shouldQueryAllStalePartitionStores() PASSED
Gradle Test Run :streams:integrationTest > Gradle Test Executor 184 > StoreQueryIntegrationTest > shouldQuerySpecificStalePartitionStoresMultiStreamThreads() STARTED
Gradle Test Run :streams:integrationTest > Gradle Test Executor 184 > StoreQueryIntegrationTest > shouldQuerySpecificStalePartitionStoresMultiStreamThreads() PASSED
Gradle Test Run :streams:integrationTest > Gradle Test Executor 184 > StoreQueryIntegrationTest > shouldQuerySpecificStalePartitionStores() STARTED
Gradle Test Run :streams:integrationTest > Gradle Test Executor 184 > StoreQueryIntegrationTest > shouldQuerySpecificStalePartitionStores() PASSED
Gradle Test Run :streams:integrationTest > Gradle Test Executor 184 > StoreQueryIntegrationTest > shouldQueryOnlyActivePartitionStoresByDefault() STARTED
Gradle Test Run :streams:integrationTest > Gradle Test Executor 182 > SmokeTestDriverIntegrationTest > shouldWorkWithRebalance(boolean) > [2] false PASSED
Gradle Test Run :streams:integrationTest > Gradle Test Executor 184 > StoreQueryIntegrationTest > shouldQueryOnlyActivePartitionStoresByDefault() PASSED
Gradle Test Run :streams:integrationTest > Gradle Test Executor 184 > StoreQueryIntegrationTest > shouldQueryStoresAfterAddingAndRemovingStreamThread() STARTED
Gradle Test Run :streams:integrationTest > Gradle Test Executor 182 > StoreQueryIntegrationTest > shouldQuerySpecificActivePartitionStores() STARTED
Gradle Test Run :streams:integrationTest > Gradle Test Executor 182 > StoreQueryIntegrationTest > shouldQuerySpecificActivePartitionStores() PASSED
Gradle Test Run :streams:integrationTest > Gradle Test Executor 182 > StoreQueryIntegrationTest > shouldFailWithIllegalArgumentExceptionWhenIQPartitionerReturnsMultiplePartitions() STARTED
Gradle Test Run :streams:integrationTest > Gradle Test Executor 184 > StoreQueryIntegrationTest > shouldQueryStoresAfterAddingAndRemovingStreamThread() PASSED
Gradle Test Run :streams:integrationTest > Gradle Test Executor 184 > StoreQueryIntegrationTest > shouldQuerySpecificStalePartitionStoresMultiStreamThreadsNamedTopology() STARTED
Gradle Test Run :streams:integrationTest > Gradle Test Executor 182 > StoreQueryIntegrationTest > shouldFailWithIllegalArgumentExceptionWhenIQPartitionerReturnsMultiplePartitions() PASSED
Gradle Test Run :streams:integrationTest > Gradle Test Executor 182 > StoreQueryIntegrationTest > shouldQueryAllStalePartitionStores() STARTED
Gradle Test Run :streams:integrationTest > Gradle Test Executor 182 > StoreQueryIntegrationTest > shouldQueryAllStalePartitionStores() PASSED
Gradle Test Run :streams:integrationTest > Gradle Test Executor 182 > StoreQueryIntegrationTest > shouldQuerySpecificStalePartitionStoresMultiStreamThreads() STARTED
Gradle Test Run :streams:integrationTest > Gradle Test Executor 184 > StoreQueryIntegrationTest > shouldQuerySpecificStalePartitionStoresMultiStreamThreadsNamedTopology() PASSED
streams-5: SMOKE-TEST-CLIENT-CLOSED
streams-7: SMOKE-TEST-CLIENT-CLOSED
streams-0: SMOKE-TEST-CLIENT-CLOSED
streams-4: SMOKE-TEST-CLIENT-CLOSED
streams-1: SMOKE-TEST-CLIENT-CLOSED
streams-6: SMOKE-TEST-CLIENT-CLOSED
streams-0: SMOKE-TEST-CLIENT-CLOSED
streams-3: SMOKE-TEST-CLIENT-CLOSED
streams-4: SMOKE-TEST-CLIENT-CLOSED
streams-2: SMOKE-TEST-CLIENT-CLOSED
streams-1: SMOKE-TEST-CLIENT-CLOSED
streams-2: SMOKE-TEST-CLIENT-CLOSED
streams-8: SMOKE-TEST-CLIENT-CLOSED
streams-3: SMOKE-TEST-CLIENT-CLOSED
Gradle Test Run :streams:integrationTest > Gradle Test Executor 182 > StoreQueryIntegrationTest > shouldQuerySpecificStalePartitionStoresMultiStreamThreads() PASSED
Gradle Test Run :streams:integrationTest > Gradle Test Executor 182 > StoreQueryIntegrationTest > shouldQuerySpecificStalePartitionStores() STARTED
Gradle Test Run :streams:integrationTest > Gradle Test Executor 182 > StoreQueryIntegrationTest > shouldQuerySpecificStalePartitionStores() PASSED
Gradle Test Run :streams:integrationTest > Gradle Test Executor 182 > StoreQueryIntegrationTest > shouldQueryOnlyActivePartitionStoresByDefault() STARTED
Gradle Test Run :streams:integrationTest > Gradle Test Executor 182 > StoreQueryIntegrationTest > shouldQueryOnlyActivePartitionStoresByDefault() PASSED
Gradle Test Run :streams:integrationTest > Gradle Test Executor 182 > StoreQueryIntegrationTest > shouldQueryStoresAfterAddingAndRemovingStreamThread() STARTED
Gradle Test Run :streams:integrationTest > Gradle Test Executor 185 > EosIntegrationTest > [at_least_once] > shouldWriteLatestOffsetsToCheckpointOnShutdown[at_least_once] STARTED
Gradle Test Run :streams:integrationTest > Gradle Test Executor 182 > StoreQueryIntegrationTest > shouldQueryStoresAfterAddingAndRemovingStreamThread() PASSED
Gradle Test Run :streams:integrationTest > Gradle Test Executor 182 > StoreQueryIntegrationTest > shouldQuerySpecificStalePartitionStoresMultiStreamThreadsNamedTopology() STARTED
Gradle Test Run :streams:integrationTest > Gradle Test Executor 182 > StoreQueryIntegrationTest > shouldQuerySpecificStalePartitionStoresMultiStreamThreadsNamedTopology() PASSED
streams-6: SMOKE-TEST-CLIENT-CLOSED
streams-4: SMOKE-TEST-CLIENT-CLOSED
streams-4: SMOKE-TEST-CLIENT-CLOSED
streams-3: SMOKE-TEST-CLIENT-CLOSED
streams-1: SMOKE-TEST-CLIENT-CLOSED
streams-6: SMOKE-TEST-CLIENT-CLOSED
streams-5: SMOKE-TEST-CLIENT-CLOSED
streams-5: SMOKE-TEST-CLIENT-CLOSED
streams-2: SMOKE-TEST-CLIENT-CLOSED
streams-3: SMOKE-TEST-CLIENT-CLOSED
streams-0: SMOKE-TEST-CLIENT-CLOSED
streams-7: SMOKE-TEST-CLIENT-CLOSED
streams-8: SMOKE-TEST-CLIENT-CLOSED
streams-1: SMOKE-TEST-CLIENT-CLOSED
streams-2: SMOKE-TEST-CLIENT-CLOSED
streams-0: SMOKE-TEST-CLIENT-CLOSED
Gradle Test Run :streams:integrationTest > Gradle Test Executor 185 > EosIntegrationTest > [at_least_once] > shouldWriteLatestOffsetsToCheckpointOnShutdown[at_least_once] PASSED
Gradle Test Run :streams:integrationTest > Gradle Test Executor 185 > EosIntegrationTest > [exactly_once] > shouldWriteLatestOffsetsToCheckpointOnShutdown[exactly_once] STARTED
FAILURE: Build failed with an exception.
* What went wrong:
Execution failed for task ':clients:integrationTest'.
> Process 'Gradle Test Executor 176' finished with non-zero exit value 1
This problem might be caused by incorrect test process configuration.
For more on test execution, please refer to https://docs.gradle.org/8.2.1/userguide/java_testing.html#sec:test_execution in the Gradle documentation.
* Try:
> Run with --stacktrace option to get the stack trace.
> Run with --info or --debug option to get more log output.
> Get more help at https://help.gradle.org.
Deprecated Gradle features were used in this build, making it incompatible with Gradle 9.0.
You can use '--warning-mode all' to show the individual deprecation warnings and determine if they come from your own scripts or plugins.
For more on this, please refer to https://docs.gradle.org/8.2.1/userguide/command_line_interface.html#sec:command_line_warnings in the Gradle documentation.
BUILD FAILED in 2h 44m 36s
237 actionable tasks: 124 executed, 113 up-to-date
Publishing build scan...
https://ge.apache.org/s/wmsbf5vbnnw32
See the profiling report at: file:///home/jenkins/jenkins-agent/workspace/Kafka_kafka_trunk/build/reports/profile/profile-2023-08-10-21-12-57.html
A fine-grained performance profile is available: use the --scan option.
[Pipeline] }
[Pipeline] // withEnv
[Pipeline] }
[Pipeline] // withEnv
[Pipeline] }
[Pipeline] // withEnv
[Pipeline] }
[Pipeline] // node
[Pipeline] }
[Pipeline] // timestamps
[Pipeline] }
[Pipeline] // timeout
[Pipeline] }
[Pipeline] // stage
[Pipeline] }
Failed in branch JDK 17 and Scala 2.13
Gradle Test Run :streams:integrationTest > Gradle Test Executor 185 > EosIntegrationTest > [exactly_once] > shouldWriteLatestOffsetsToCheckpointOnShutdown[exactly_once] PASSED
Gradle Test Run :streams:integrationTest > Gradle Test Executor 185 > EosIntegrationTest > [exactly_once_v2] > shouldWriteLatestOffsetsToCheckpointOnShutdown[exactly_once_v2] STARTED
Gradle Test Run :streams:integrationTest > Gradle Test Executor 185 > EosIntegrationTest > [exactly_once_v2] > shouldWriteLatestOffsetsToCheckpointOnShutdown[exactly_once_v2] PASSED
840 tests completed, 1 failed
There were failing tests. See the report at: file:///home/jenkins/workspace/Kafka_kafka_trunk/streams/build/reports/tests/integrationTest/index.html
Deprecated Gradle features were used in this build, making it incompatible with Gradle 9.0.
You can use '--warning-mode all' to show the individual deprecation warnings and determine if they come from your own scripts or plugins.
For more on this, please refer to https://docs.gradle.org/8.2.1/userguide/command_line_interface.html#sec:command_line_warnings in the Gradle documentation.
BUILD SUCCESSFUL in 2h 41m 20s
237 actionable tasks: 124 executed, 113 up-to-date
Publishing build scan...
https://ge.apache.org/s/labxzqeeps3im
See the profiling report at: file:///home/jenkins/workspace/Kafka_kafka_trunk/build/reports/profile/profile-2023-08-10-21-16-34.html
A fine-grained performance profile is available: use the --scan option.
[Pipeline] junit
Recording test results
[Checks API] No suitable checks publisher found.
[Pipeline] echo
Skipping Kafka Streams archetype test for Java 11
[Pipeline] }
[Pipeline] // withEnv
[Pipeline] }
[Pipeline] // withEnv
[Pipeline] }
[Pipeline] // withEnv
[Pipeline] }
[Pipeline] // node
[Pipeline] }
[Pipeline] // timestamps
[Pipeline] }
[Pipeline] // timeout
[Pipeline] }
[Pipeline] // stage
[Pipeline] }
[Pipeline] // parallel
[Pipeline] }
[Pipeline] // stage
[Pipeline] stage
[Pipeline] { (Declarative: Post Actions)
[Pipeline] script
[Pipeline] {
[Pipeline] node
Running on builds57 in /home/jenkins/jenkins-agent/workspace/Kafka_kafka_trunk
[Pipeline] {
[Pipeline] step
Build failed in Jenkins: Kafka » Kafka Branch Builder » trunk #2086
Posted by Apache Jenkins Server <je...@builds.apache.org>.
See <https://ci-builds.apache.org/job/Kafka/job/kafka/job/trunk/2086/display/redirect>
Changes:
------------------------------------------
[...truncated 403180 lines...]
streams-3: SMOKE-TEST-CLIENT-CLOSED
streams-0: SMOKE-TEST-CLIENT-CLOSED
FAILURE: Build failed with an exception.
* What went wrong:
Execution failed for task ':streams:upgrade-system-tests-0110:integrationTest'.
> Process 'Gradle Test Executor 63' finished with non-zero exit value 1
This problem might be caused by incorrect test process configuration.
For more on test execution, please refer to https://docs.gradle.org/8.2.1/userguide/java_testing.html#sec:test_execution in the Gradle documentation.
* Try:
> Run with --stacktrace option to get the stack trace.
> Run with --info or --debug option to get more log output.
> Get more help at https://help.gradle.org.
Deprecated Gradle features were used in this build, making it incompatible with Gradle 9.0.
You can use '--warning-mode all' to show the individual deprecation warnings and determine if they come from your own scripts or plugins.
For more on this, please refer to https://docs.gradle.org/8.2.1/userguide/command_line_interface.html#sec:command_line_warnings in the Gradle documentation.
BUILD FAILED in 2h 55m 50s
237 actionable tasks: 124 executed, 113 up-to-date
Publishing build scan...
Publishing failed.
The response from https://ge.apache.org/scans/publish/gradle/3.13.4/token was not from Gradle Enterprise.
The specified server address may be incorrect, or your network environment may be interfering.
Please report this problem to your Gradle Enterprise administrator via https://ge.apache.org/help and include the following via copy/paste:
----------
Gradle version: 8.2.1
Plugin version: 3.13.4
Request URL: https://ge.apache.org/scans/publish/gradle/3.13.4/token
Request ID: 407c0dcd-3324-4619-b742-e4bae102d0ca
Response status code: 502
Response content type: text/html
----------
See the profiling report at: file:///home/jenkins/jenkins-agent/workspace/Kafka_kafka_trunk/build/reports/profile/profile-2023-08-10-18-02-37.html
A fine-grained performance profile is available: use the --scan option.
Gradle Test Run :streams:integrationTest > Gradle Test Executor 184 > SmokeTestDriverIntegrationTest > shouldWorkWithRebalance(boolean) > [1] true PASSED
Gradle Test Run :streams:integrationTest > Gradle Test Executor 184 > SmokeTestDriverIntegrationTest > shouldWorkWithRebalance(boolean) > [2] false STARTED
[Pipeline] }
[Pipeline] // withEnv
[Pipeline] }
[Pipeline] // withEnv
[Pipeline] }
[Pipeline] // withEnv
[Pipeline] }
[Pipeline] // node
[Pipeline] }
[Pipeline] // timestamps
[Pipeline] }
[Pipeline] // timeout
[Pipeline] }
[Pipeline] // stage
[Pipeline] }
Failed in branch JDK 17 and Scala 2.13
Gradle Test Run :streams:integrationTest > Gradle Test Executor 183 > SmokeTestDriverIntegrationTest > shouldWorkWithRebalance(boolean) > [1] true PASSED
Gradle Test Run :streams:integrationTest > Gradle Test Executor 183 > SmokeTestDriverIntegrationTest > shouldWorkWithRebalance(boolean) > [2] false STARTED
Gradle Test Run :streams:integrationTest > Gradle Test Executor 184 > SmokeTestDriverIntegrationTest > shouldWorkWithRebalance(boolean) > [2] false PASSED
Gradle Test Run :streams:integrationTest > Gradle Test Executor 184 > StoreQueryIntegrationTest > shouldQuerySpecificActivePartitionStores() STARTED
Gradle Test Run :streams:integrationTest > Gradle Test Executor 184 > StoreQueryIntegrationTest > shouldQuerySpecificActivePartitionStores() PASSED
Gradle Test Run :streams:integrationTest > Gradle Test Executor 184 > StoreQueryIntegrationTest > shouldFailWithIllegalArgumentExceptionWhenIQPartitionerReturnsMultiplePartitions() STARTED
Gradle Test Run :streams:integrationTest > Gradle Test Executor 184 > StoreQueryIntegrationTest > shouldFailWithIllegalArgumentExceptionWhenIQPartitionerReturnsMultiplePartitions() PASSED
Gradle Test Run :streams:integrationTest > Gradle Test Executor 184 > StoreQueryIntegrationTest > shouldQueryAllStalePartitionStores() STARTED
Gradle Test Run :streams:integrationTest > Gradle Test Executor 184 > StoreQueryIntegrationTest > shouldQueryAllStalePartitionStores() PASSED
Gradle Test Run :streams:integrationTest > Gradle Test Executor 184 > StoreQueryIntegrationTest > shouldQuerySpecificStalePartitionStoresMultiStreamThreads() STARTED
Gradle Test Run :streams:integrationTest > Gradle Test Executor 183 > SmokeTestDriverIntegrationTest > shouldWorkWithRebalance(boolean) > [2] false PASSED
Gradle Test Run :streams:integrationTest > Gradle Test Executor 183 > StoreQueryIntegrationTest > shouldQuerySpecificActivePartitionStores() STARTED
Gradle Test Run :streams:integrationTest > Gradle Test Executor 183 > StoreQueryIntegrationTest > shouldQuerySpecificActivePartitionStores() PASSED
Gradle Test Run :streams:integrationTest > Gradle Test Executor 183 > StoreQueryIntegrationTest > shouldFailWithIllegalArgumentExceptionWhenIQPartitionerReturnsMultiplePartitions() STARTED
Gradle Test Run :streams:integrationTest > Gradle Test Executor 184 > StoreQueryIntegrationTest > shouldQuerySpecificStalePartitionStoresMultiStreamThreads() PASSED
Gradle Test Run :streams:integrationTest > Gradle Test Executor 184 > StoreQueryIntegrationTest > shouldQuerySpecificStalePartitionStores() STARTED
Gradle Test Run :streams:integrationTest > Gradle Test Executor 183 > StoreQueryIntegrationTest > shouldFailWithIllegalArgumentExceptionWhenIQPartitionerReturnsMultiplePartitions() PASSED
Gradle Test Run :streams:integrationTest > Gradle Test Executor 183 > StoreQueryIntegrationTest > shouldQueryAllStalePartitionStores() STARTED
Gradle Test Run :streams:integrationTest > Gradle Test Executor 184 > StoreQueryIntegrationTest > shouldQuerySpecificStalePartitionStores() PASSED
Gradle Test Run :streams:integrationTest > Gradle Test Executor 184 > StoreQueryIntegrationTest > shouldQueryOnlyActivePartitionStoresByDefault() STARTED
Gradle Test Run :streams:integrationTest > Gradle Test Executor 183 > StoreQueryIntegrationTest > shouldQueryAllStalePartitionStores() PASSED
Gradle Test Run :streams:integrationTest > Gradle Test Executor 183 > StoreQueryIntegrationTest > shouldQuerySpecificStalePartitionStoresMultiStreamThreads() STARTED
Gradle Test Run :streams:integrationTest > Gradle Test Executor 184 > StoreQueryIntegrationTest > shouldQueryOnlyActivePartitionStoresByDefault() PASSED
Gradle Test Run :streams:integrationTest > Gradle Test Executor 184 > StoreQueryIntegrationTest > shouldQueryStoresAfterAddingAndRemovingStreamThread() STARTED
Gradle Test Run :streams:integrationTest > Gradle Test Executor 183 > StoreQueryIntegrationTest > shouldQuerySpecificStalePartitionStoresMultiStreamThreads() PASSED
Gradle Test Run :streams:integrationTest > Gradle Test Executor 183 > StoreQueryIntegrationTest > shouldQuerySpecificStalePartitionStores() STARTED
Gradle Test Run :streams:integrationTest > Gradle Test Executor 183 > StoreQueryIntegrationTest > shouldQuerySpecificStalePartitionStores() PASSED
Gradle Test Run :streams:integrationTest > Gradle Test Executor 183 > StoreQueryIntegrationTest > shouldQueryOnlyActivePartitionStoresByDefault() STARTED
Gradle Test Run :streams:integrationTest > Gradle Test Executor 184 > StoreQueryIntegrationTest > shouldQueryStoresAfterAddingAndRemovingStreamThread() PASSED
Gradle Test Run :streams:integrationTest > Gradle Test Executor 184 > StoreQueryIntegrationTest > shouldQuerySpecificStalePartitionStoresMultiStreamThreadsNamedTopology() STARTED
Gradle Test Run :streams:integrationTest > Gradle Test Executor 183 > StoreQueryIntegrationTest > shouldQueryOnlyActivePartitionStoresByDefault() PASSED
Gradle Test Run :streams:integrationTest > Gradle Test Executor 183 > StoreQueryIntegrationTest > shouldQueryStoresAfterAddingAndRemovingStreamThread() STARTED
Gradle Test Run :streams:integrationTest > Gradle Test Executor 184 > StoreQueryIntegrationTest > shouldQuerySpecificStalePartitionStoresMultiStreamThreadsNamedTopology() PASSED
streams-0: SMOKE-TEST-CLIENT-CLOSED
streams-5: SMOKE-TEST-CLIENT-CLOSED
streams-6: SMOKE-TEST-CLIENT-CLOSED
streams-3: SMOKE-TEST-CLIENT-CLOSED
streams-1: SMOKE-TEST-CLIENT-CLOSED
streams-4: SMOKE-TEST-CLIENT-CLOSED
streams-1: SMOKE-TEST-CLIENT-CLOSED
streams-4: SMOKE-TEST-CLIENT-CLOSED
streams-0: SMOKE-TEST-CLIENT-CLOSED
streams-5: SMOKE-TEST-CLIENT-CLOSED
streams-3: SMOKE-TEST-CLIENT-CLOSED
streams-6: SMOKE-TEST-CLIENT-CLOSED
streams-2: SMOKE-TEST-CLIENT-CLOSED
streams-7: SMOKE-TEST-CLIENT-CLOSED
streams-2: SMOKE-TEST-CLIENT-CLOSED
Gradle Test Run :streams:integrationTest > Gradle Test Executor 183 > StoreQueryIntegrationTest > shouldQueryStoresAfterAddingAndRemovingStreamThread() PASSED
Gradle Test Run :streams:integrationTest > Gradle Test Executor 183 > StoreQueryIntegrationTest > shouldQuerySpecificStalePartitionStoresMultiStreamThreadsNamedTopology() STARTED
Gradle Test Run :streams:integrationTest > Gradle Test Executor 183 > StoreQueryIntegrationTest > shouldQuerySpecificStalePartitionStoresMultiStreamThreadsNamedTopology() PASSED
Deprecated Gradle features were used in this build, making it incompatible with Gradle 9.0.
You can use '--warning-mode all' to show the individual deprecation warnings and determine if they come from your own scripts or plugins.
For more on this, please refer to https://docs.gradle.org/8.2.1/userguide/command_line_interface.html#sec:command_line_warnings in the Gradle documentation.
BUILD SUCCESSFUL in 2h 54m 9s
237 actionable tasks: 124 executed, 113 up-to-date
Publishing build scan...
streams-1: SMOKE-TEST-CLIENT-CLOSED
streams-3: SMOKE-TEST-CLIENT-CLOSED
streams-2: SMOKE-TEST-CLIENT-CLOSED
streams-1: SMOKE-TEST-CLIENT-CLOSED
streams-5: SMOKE-TEST-CLIENT-CLOSED
streams-4: SMOKE-TEST-CLIENT-CLOSED
streams-3: SMOKE-TEST-CLIENT-CLOSED
streams-0: SMOKE-TEST-CLIENT-CLOSED
streams-2: SMOKE-TEST-CLIENT-CLOSED
streams-4: SMOKE-TEST-CLIENT-CLOSED
streams-0: SMOKE-TEST-CLIENT-CLOSED
streams-6: SMOKE-TEST-CLIENT-CLOSED
streams-5: SMOKE-TEST-CLIENT-CLOSED
https://ge.apache.org/s/oi7qqp6vtd3by
See the profiling report at: file:///home/jenkins/workspace/Kafka_kafka_trunk/build/reports/profile/profile-2023-08-10-18-06-17.html
A fine-grained performance profile is available: use the --scan option.
[Pipeline] junit
Recording test results
Deprecated Gradle features were used in this build, making it incompatible with Gradle 9.0.
You can use '--warning-mode all' to show the individual deprecation warnings and determine if they come from your own scripts or plugins.
For more on this, please refer to https://docs.gradle.org/8.2.1/userguide/command_line_interface.html#sec:command_line_warnings in the Gradle documentation.
BUILD SUCCESSFUL in 2h 54m 5s
237 actionable tasks: 124 executed, 113 up-to-date
Publishing build scan...
https://ge.apache.org/s/mvbsqdhcwc5au
See the profiling report at: file:///home/jenkins/workspace/Kafka_kafka_trunk@2/build/reports/profile/profile-2023-08-10-18-06-29.html
A fine-grained performance profile is available: use the --scan option.
[Pipeline] junit
Recording test results
[Checks API] No suitable checks publisher found.
[Pipeline] echo
Skipping Kafka Streams archetype test for Java 11
[Pipeline] }
[Pipeline] // withEnv
[Pipeline] }
[Pipeline] // withEnv
[Pipeline] }
[Pipeline] // withEnv
[Pipeline] }
[Pipeline] // node
[Pipeline] }
[Pipeline] // timestamps
[Pipeline] }
[Pipeline] // timeout
[Pipeline] }
[Pipeline] // stage
[Pipeline] }
[Checks API] No suitable checks publisher found.
[Pipeline] echo
Skipping Kafka Streams archetype test for Java 20
[Pipeline] }
[Pipeline] // withEnv
[Pipeline] }
[Pipeline] // withEnv
[Pipeline] }
[Pipeline] // withEnv
[Pipeline] }
[Pipeline] // node
[Pipeline] }
[Pipeline] // timestamps
[Pipeline] }
[Pipeline] // timeout
[Pipeline] }
[Pipeline] // stage
[Pipeline] }
[Pipeline] // parallel
[Pipeline] }
[Pipeline] // stage
[Pipeline] stage
[Pipeline] { (Declarative: Post Actions)
[Pipeline] script
[Pipeline] {
[Pipeline] node
Running on builds35 in /home/jenkins/workspace/Kafka_kafka_trunk
[Pipeline] {
[Pipeline] step
Build failed in Jenkins: Kafka » Kafka Branch Builder » trunk #2085
Posted by Apache Jenkins Server <je...@builds.apache.org>.
See <https://ci-builds.apache.org/job/Kafka/job/kafka/job/trunk/2085/display/redirect>
Changes:
------------------------------------------
[...truncated 400994 lines...]
Gradle Test Run :streams:integrationTest > Gradle Test Executor 181 > TableTableJoinIntegrationTest > [caching enabled = false] > testOuterInner[caching enabled = false] PASSED
Gradle Test Run :streams:integrationTest > Gradle Test Executor 181 > TableTableJoinIntegrationTest > [caching enabled = false] > testOuterOuter[caching enabled = false] STARTED
Gradle Test Run :streams:integrationTest > Gradle Test Executor 181 > TableTableJoinIntegrationTest > [caching enabled = false] > testOuterOuter[caching enabled = false] PASSED
Gradle Test Run :streams:integrationTest > Gradle Test Executor 181 > TableTableJoinIntegrationTest > [caching enabled = false] > testInnerWithRightVersionedOnly[caching enabled = false] STARTED
Gradle Test Run :streams:integrationTest > Gradle Test Executor 181 > TableTableJoinIntegrationTest > [caching enabled = false] > testInnerWithRightVersionedOnly[caching enabled = false] PASSED
Gradle Test Run :streams:integrationTest > Gradle Test Executor 181 > TableTableJoinIntegrationTest > [caching enabled = false] > testLeftWithLeftVersionedOnly[caching enabled = false] STARTED
Gradle Test Run :streams:integrationTest > Gradle Test Executor 181 > TableTableJoinIntegrationTest > [caching enabled = false] > testLeftWithLeftVersionedOnly[caching enabled = false] PASSED
Gradle Test Run :streams:integrationTest > Gradle Test Executor 181 > TableTableJoinIntegrationTest > [caching enabled = false] > testInnerWithLeftVersionedOnly[caching enabled = false] STARTED
Gradle Test Run :streams:integrationTest > Gradle Test Executor 181 > TableTableJoinIntegrationTest > [caching enabled = false] > testInnerWithLeftVersionedOnly[caching enabled = false] PASSED
Gradle Test Run :streams:integrationTest > Gradle Test Executor 181 > TaskAssignorIntegrationTest > shouldProperlyConfigureTheAssignor STARTED
Gradle Test Run :streams:integrationTest > Gradle Test Executor 181 > TaskAssignorIntegrationTest > shouldProperlyConfigureTheAssignor PASSED
Gradle Test Run :streams:integrationTest > Gradle Test Executor 181 > TaskMetadataIntegrationTest > shouldReportCorrectEndOffsetInformation STARTED
Gradle Test Run :streams:integrationTest > Gradle Test Executor 181 > TaskMetadataIntegrationTest > shouldReportCorrectEndOffsetInformation PASSED
Gradle Test Run :streams:integrationTest > Gradle Test Executor 181 > TaskMetadataIntegrationTest > shouldReportCorrectCommittedOffsetInformation STARTED
Gradle Test Run :streams:integrationTest > Gradle Test Executor 181 > TaskMetadataIntegrationTest > shouldReportCorrectCommittedOffsetInformation PASSED
Gradle Test Run :streams:integrationTest > Gradle Test Executor 181 > EmitOnChangeIntegrationTest > shouldEmitSameRecordAfterFailover() STARTED
Gradle Test Run :streams:integrationTest > Gradle Test Executor 181 > EmitOnChangeIntegrationTest > shouldEmitSameRecordAfterFailover() PASSED
Gradle Test Run :streams:integrationTest > Gradle Test Executor 181 > HighAvailabilityTaskAssignorIntegrationTest > shouldScaleOutWithWarmupTasksAndPersistentStores(boolean, TestInfo) > [1] true STARTED
Gradle Test Run :streams:integrationTest > Gradle Test Executor 181 > HighAvailabilityTaskAssignorIntegrationTest > shouldScaleOutWithWarmupTasksAndPersistentStores(boolean, TestInfo) > [1] true PASSED
Gradle Test Run :streams:integrationTest > Gradle Test Executor 181 > HighAvailabilityTaskAssignorIntegrationTest > shouldScaleOutWithWarmupTasksAndPersistentStores(boolean, TestInfo) > [2] false STARTED
Gradle Test Run :streams:integrationTest > Gradle Test Executor 181 > HighAvailabilityTaskAssignorIntegrationTest > shouldScaleOutWithWarmupTasksAndPersistentStores(boolean, TestInfo) > [2] false PASSED
Gradle Test Run :streams:integrationTest > Gradle Test Executor 181 > HighAvailabilityTaskAssignorIntegrationTest > shouldScaleOutWithWarmupTasksAndInMemoryStores(boolean, TestInfo) > [1] true STARTED
Gradle Test Run :streams:integrationTest > Gradle Test Executor 181 > HighAvailabilityTaskAssignorIntegrationTest > shouldScaleOutWithWarmupTasksAndInMemoryStores(boolean, TestInfo) > [1] true PASSED
Gradle Test Run :streams:integrationTest > Gradle Test Executor 181 > HighAvailabilityTaskAssignorIntegrationTest > shouldScaleOutWithWarmupTasksAndInMemoryStores(boolean, TestInfo) > [2] false STARTED
Gradle Test Run :streams:integrationTest > Gradle Test Executor 181 > HighAvailabilityTaskAssignorIntegrationTest > shouldScaleOutWithWarmupTasksAndInMemoryStores(boolean, TestInfo) > [2] false PASSED
Gradle Test Run :streams:integrationTest > Gradle Test Executor 181 > KStreamAggregationDedupIntegrationTest > shouldReduce(TestInfo) STARTED
Gradle Test Run :streams:integrationTest > Gradle Test Executor 181 > KStreamAggregationDedupIntegrationTest > shouldReduce(TestInfo) PASSED
Gradle Test Run :streams:integrationTest > Gradle Test Executor 181 > KStreamAggregationDedupIntegrationTest > shouldGroupByKey(TestInfo) STARTED
Gradle Test Run :streams:integrationTest > Gradle Test Executor 181 > KStreamAggregationDedupIntegrationTest > shouldGroupByKey(TestInfo) PASSED
Gradle Test Run :streams:integrationTest > Gradle Test Executor 181 > KStreamAggregationDedupIntegrationTest > shouldReduceWindowed(TestInfo) STARTED
Gradle Test Run :streams:integrationTest > Gradle Test Executor 181 > KStreamAggregationDedupIntegrationTest > shouldReduceWindowed(TestInfo) PASSED
Gradle Test Run :streams:integrationTest > Gradle Test Executor 181 > KStreamKStreamIntegrationTest > shouldOuterJoin() STARTED
Gradle Test Run :streams:integrationTest > Gradle Test Executor 181 > KStreamKStreamIntegrationTest > shouldOuterJoin() PASSED
Gradle Test Run :streams:integrationTest > Gradle Test Executor 181 > KTableKTableForeignKeyInnerJoinMultiIntegrationTest > shouldInnerJoinMultiPartitionQueryable() STARTED
Gradle Test Run :streams:integrationTest > Gradle Test Executor 181 > KTableKTableForeignKeyInnerJoinMultiIntegrationTest > shouldInnerJoinMultiPartitionQueryable() PASSED
Gradle Test Run :streams:integrationTest > Gradle Test Executor 181 > KTableSourceTopicRestartIntegrationTest > shouldRestoreAndProgressWhenTopicNotWrittenToDuringRestoration() STARTED
Gradle Test Run :streams:integrationTest > Gradle Test Executor 181 > KTableSourceTopicRestartIntegrationTest > shouldRestoreAndProgressWhenTopicNotWrittenToDuringRestoration() PASSED
Gradle Test Run :streams:integrationTest > Gradle Test Executor 181 > KTableSourceTopicRestartIntegrationTest > shouldRestoreAndProgressWhenTopicWrittenToDuringRestorationWithEosAlphaEnabled() STARTED
Gradle Test Run :streams:integrationTest > Gradle Test Executor 181 > KTableSourceTopicRestartIntegrationTest > shouldRestoreAndProgressWhenTopicWrittenToDuringRestorationWithEosAlphaEnabled() PASSED
Gradle Test Run :streams:integrationTest > Gradle Test Executor 181 > KTableSourceTopicRestartIntegrationTest > shouldRestoreAndProgressWhenTopicWrittenToDuringRestorationWithEosDisabled() STARTED
Gradle Test Run :streams:integrationTest > Gradle Test Executor 181 > KTableSourceTopicRestartIntegrationTest > shouldRestoreAndProgressWhenTopicWrittenToDuringRestorationWithEosDisabled() PASSED
Gradle Test Run :streams:integrationTest > Gradle Test Executor 181 > KTableSourceTopicRestartIntegrationTest > shouldRestoreAndProgressWhenTopicWrittenToDuringRestorationWithEosV2Enabled() STARTED
Gradle Test Run :streams:integrationTest > Gradle Test Executor 181 > KTableSourceTopicRestartIntegrationTest > shouldRestoreAndProgressWhenTopicWrittenToDuringRestorationWithEosV2Enabled() PASSED
Gradle Test Run :streams:integrationTest > Gradle Test Executor 181 > LagFetchIntegrationTest > shouldFetchLagsDuringRebalancingWithOptimization() STARTED
Gradle Test Run :streams:integrationTest > Gradle Test Executor 181 > LagFetchIntegrationTest > shouldFetchLagsDuringRebalancingWithOptimization() PASSED
Gradle Test Run :streams:integrationTest > Gradle Test Executor 181 > LagFetchIntegrationTest > shouldFetchLagsDuringRestoration() STARTED
Gradle Test Run :streams:integrationTest > Gradle Test Executor 181 > LagFetchIntegrationTest > shouldFetchLagsDuringRestoration() PASSED
Gradle Test Run :streams:integrationTest > Gradle Test Executor 181 > LagFetchIntegrationTest > shouldFetchLagsDuringRebalancingWithNoOptimization() STARTED
Gradle Test Run :streams:integrationTest > Gradle Test Executor 181 > LagFetchIntegrationTest > shouldFetchLagsDuringRebalancingWithNoOptimization() PASSED
Gradle Test Run :streams:integrationTest > Gradle Test Executor 181 > OptimizedKTableIntegrationTest > shouldApplyUpdatesToStandbyStore(TestInfo) STARTED
Gradle Test Run :streams:integrationTest > Gradle Test Executor 181 > OptimizedKTableIntegrationTest > shouldApplyUpdatesToStandbyStore(TestInfo) PASSED
Gradle Test Run :streams:integrationTest > Gradle Test Executor 181 > RestoreIntegrationTest > shouldRecycleStateFromStandbyTaskPromotedToActiveTaskAndNotRestore(boolean) > [1] true STARTED
Gradle Test Run :streams:integrationTest > Gradle Test Executor 181 > RestoreIntegrationTest > shouldRecycleStateFromStandbyTaskPromotedToActiveTaskAndNotRestore(boolean) > [1] true PASSED
Gradle Test Run :streams:integrationTest > Gradle Test Executor 181 > RestoreIntegrationTest > shouldRecycleStateFromStandbyTaskPromotedToActiveTaskAndNotRestore(boolean) > [2] false STARTED
Gradle Test Run :streams:integrationTest > Gradle Test Executor 181 > RestoreIntegrationTest > shouldRecycleStateFromStandbyTaskPromotedToActiveTaskAndNotRestore(boolean) > [2] false PASSED
Gradle Test Run :streams:integrationTest > Gradle Test Executor 181 > RestoreIntegrationTest > shouldProcessDataFromStoresWithLoggingDisabled(boolean) > [1] true STARTED
Gradle Test Run :streams:integrationTest > Gradle Test Executor 181 > RestoreIntegrationTest > shouldProcessDataFromStoresWithLoggingDisabled(boolean) > [1] true PASSED
Gradle Test Run :streams:integrationTest > Gradle Test Executor 181 > RestoreIntegrationTest > shouldProcessDataFromStoresWithLoggingDisabled(boolean) > [2] false STARTED
Gradle Test Run :streams:integrationTest > Gradle Test Executor 181 > RestoreIntegrationTest > shouldProcessDataFromStoresWithLoggingDisabled(boolean) > [2] false PASSED
Gradle Test Run :streams:integrationTest > Gradle Test Executor 181 > RestoreIntegrationTest > shouldRestoreNullRecord() STARTED
Gradle Test Run :streams:integrationTest > Gradle Test Executor 181 > RestoreIntegrationTest > shouldRestoreNullRecord() PASSED
Gradle Test Run :streams:integrationTest > Gradle Test Executor 181 > RestoreIntegrationTest > shouldRestoreStateFromSourceTopic(boolean) > [1] true STARTED
Gradle Test Run :streams:integrationTest > Gradle Test Executor 181 > RestoreIntegrationTest > shouldRestoreStateFromSourceTopic(boolean) > [1] true PASSED
Gradle Test Run :streams:integrationTest > Gradle Test Executor 181 > RestoreIntegrationTest > shouldRestoreStateFromSourceTopic(boolean) > [2] false STARTED
Gradle Test Run :streams:integrationTest > Gradle Test Executor 181 > RestoreIntegrationTest > shouldRestoreStateFromSourceTopic(boolean) > [2] false PASSED
Gradle Test Run :streams:integrationTest > Gradle Test Executor 181 > RestoreIntegrationTest > shouldSuccessfullyStartWhenLoggingDisabled(boolean) > [1] true STARTED
Gradle Test Run :streams:integrationTest > Gradle Test Executor 181 > RestoreIntegrationTest > shouldSuccessfullyStartWhenLoggingDisabled(boolean) > [1] true PASSED
Gradle Test Run :streams:integrationTest > Gradle Test Executor 181 > RestoreIntegrationTest > shouldSuccessfullyStartWhenLoggingDisabled(boolean) > [2] false STARTED
Gradle Test Run :streams:integrationTest > Gradle Test Executor 181 > RestoreIntegrationTest > shouldSuccessfullyStartWhenLoggingDisabled(boolean) > [2] false PASSED
Gradle Test Run :streams:integrationTest > Gradle Test Executor 181 > RestoreIntegrationTest > shouldRestoreStateFromChangelogTopic(boolean) > [1] true STARTED
Gradle Test Run :streams:integrationTest > Gradle Test Executor 181 > RestoreIntegrationTest > shouldRestoreStateFromChangelogTopic(boolean) > [1] true PASSED
Gradle Test Run :streams:integrationTest > Gradle Test Executor 181 > RestoreIntegrationTest > shouldRestoreStateFromChangelogTopic(boolean) > [2] false STARTED
Gradle Test Run :streams:integrationTest > Gradle Test Executor 181 > RestoreIntegrationTest > shouldRestoreStateFromChangelogTopic(boolean) > [2] false PASSED
Gradle Test Run :streams:integrationTest > Gradle Test Executor 181 > SmokeTestDriverIntegrationTest > shouldWorkWithRebalance(boolean) > [1] true STARTED
Gradle Test Run :streams:integrationTest > Gradle Test Executor 181 > SmokeTestDriverIntegrationTest > shouldWorkWithRebalance(boolean) > [1] true PASSED
Gradle Test Run :streams:integrationTest > Gradle Test Executor 181 > SmokeTestDriverIntegrationTest > shouldWorkWithRebalance(boolean) > [2] false STARTED
Gradle Test Run :streams:integrationTest > Gradle Test Executor 181 > SmokeTestDriverIntegrationTest > shouldWorkWithRebalance(boolean) > [2] false PASSED
Gradle Test Run :streams:integrationTest > Gradle Test Executor 181 > StoreQueryIntegrationTest > shouldQuerySpecificActivePartitionStores() STARTED
Gradle Test Run :streams:integrationTest > Gradle Test Executor 181 > StoreQueryIntegrationTest > shouldQuerySpecificActivePartitionStores() PASSED
Gradle Test Run :streams:integrationTest > Gradle Test Executor 181 > StoreQueryIntegrationTest > shouldFailWithIllegalArgumentExceptionWhenIQPartitionerReturnsMultiplePartitions() STARTED
Gradle Test Run :streams:integrationTest > Gradle Test Executor 181 > StoreQueryIntegrationTest > shouldFailWithIllegalArgumentExceptionWhenIQPartitionerReturnsMultiplePartitions() PASSED
Gradle Test Run :streams:integrationTest > Gradle Test Executor 181 > StoreQueryIntegrationTest > shouldQueryAllStalePartitionStores() STARTED
Gradle Test Run :streams:integrationTest > Gradle Test Executor 181 > StoreQueryIntegrationTest > shouldQueryAllStalePartitionStores() PASSED
Gradle Test Run :streams:integrationTest > Gradle Test Executor 181 > StoreQueryIntegrationTest > shouldQuerySpecificStalePartitionStoresMultiStreamThreads() STARTED
Gradle Test Run :streams:integrationTest > Gradle Test Executor 181 > StoreQueryIntegrationTest > shouldQuerySpecificStalePartitionStoresMultiStreamThreads() PASSED
Gradle Test Run :streams:integrationTest > Gradle Test Executor 181 > StoreQueryIntegrationTest > shouldQuerySpecificStalePartitionStores() STARTED
Gradle Test Run :streams:integrationTest > Gradle Test Executor 181 > StoreQueryIntegrationTest > shouldQuerySpecificStalePartitionStores() PASSED
Gradle Test Run :streams:integrationTest > Gradle Test Executor 181 > StoreQueryIntegrationTest > shouldQueryOnlyActivePartitionStoresByDefault() STARTED
Gradle Test Run :streams:integrationTest > Gradle Test Executor 181 > StoreQueryIntegrationTest > shouldQueryOnlyActivePartitionStoresByDefault() PASSED
Gradle Test Run :streams:integrationTest > Gradle Test Executor 181 > StoreQueryIntegrationTest > shouldQueryStoresAfterAddingAndRemovingStreamThread() STARTED
Gradle Test Run :streams:integrationTest > Gradle Test Executor 181 > StoreQueryIntegrationTest > shouldQueryStoresAfterAddingAndRemovingStreamThread() PASSED
Gradle Test Run :streams:integrationTest > Gradle Test Executor 181 > StoreQueryIntegrationTest > shouldQuerySpecificStalePartitionStoresMultiStreamThreadsNamedTopology() STARTED
Gradle Test Run :streams:integrationTest > Gradle Test Executor 181 > StoreQueryIntegrationTest > shouldQuerySpecificStalePartitionStoresMultiStreamThreadsNamedTopology() PASSED
streams-6: SMOKE-TEST-CLIENT-CLOSED
streams-0: SMOKE-TEST-CLIENT-CLOSED
streams-5: SMOKE-TEST-CLIENT-CLOSED
streams-1: SMOKE-TEST-CLIENT-CLOSED
streams-5: SMOKE-TEST-CLIENT-CLOSED
streams-0: SMOKE-TEST-CLIENT-CLOSED
streams-2: SMOKE-TEST-CLIENT-CLOSED
streams-4: SMOKE-TEST-CLIENT-CLOSED
streams-2: SMOKE-TEST-CLIENT-CLOSED
streams-8: SMOKE-TEST-CLIENT-CLOSED
streams-1: SMOKE-TEST-CLIENT-CLOSED
streams-3: SMOKE-TEST-CLIENT-CLOSED
streams-6: SMOKE-TEST-CLIENT-CLOSED
streams-7: SMOKE-TEST-CLIENT-CLOSED
streams-4: SMOKE-TEST-CLIENT-CLOSED
streams-3: SMOKE-TEST-CLIENT-CLOSED
Deprecated Gradle features were used in this build, making it incompatible with Gradle 9.0.
You can use '--warning-mode all' to show the individual deprecation warnings and determine if they come from your own scripts or plugins.
For more on this, please refer to https://docs.gradle.org/8.2.1/userguide/command_line_interface.html#sec:command_line_warnings in the Gradle documentation.
BUILD SUCCESSFUL in 3h 27m 31s
237 actionable tasks: 124 executed, 113 up-to-date
Publishing build scan...
https://ge.apache.org/s/6xxzp5fh3sbfo
See the profiling report at: file:///home/jenkins/workspace/Kafka_kafka_trunk/build/reports/profile/profile-2023-08-10-09-56-58.html
A fine-grained performance profile is available: use the --scan option.
[Pipeline] junit
Recording test results
[Checks API] No suitable checks publisher found.
[Pipeline] echo
Skipping Kafka Streams archetype test for Java 20
[Pipeline] }
[Pipeline] // withEnv
[Pipeline] }
[Pipeline] // withEnv
[Pipeline] }
[Pipeline] // withEnv
[Pipeline] }
[Pipeline] // node
[Pipeline] }
[Pipeline] // timestamps
[Pipeline] }
[Pipeline] // timeout
[Pipeline] }
[Pipeline] // stage
[Pipeline] }
[Pipeline] // parallel
[Pipeline] }
[Pipeline] // stage
[Pipeline] stage
[Pipeline] { (Declarative: Post Actions)
[Pipeline] script
[Pipeline] {
[Pipeline] node
Running on builds57 in /home/jenkins/jenkins-agent/workspace/Kafka_kafka_trunk
[Pipeline] {
[Pipeline] step
Jenkins build is still unstable: Kafka » Kafka Branch Builder » trunk #2084
Posted by Apache Jenkins Server <je...@builds.apache.org>.
See <https://ci-builds.apache.org/job/Kafka/job/kafka/job/trunk/2084/display/redirect>
Jenkins build is still unstable: Kafka » Kafka Branch Builder » trunk #2083
Posted by Apache Jenkins Server <je...@builds.apache.org>.
See <https://ci-builds.apache.org/job/Kafka/job/kafka/job/trunk/2083/display/redirect>
Jenkins build is still unstable: Kafka » Kafka Branch Builder » trunk #2082
Posted by Apache Jenkins Server <je...@builds.apache.org>.
See <https://ci-builds.apache.org/job/Kafka/job/kafka/job/trunk/2082/display/redirect>
Jenkins build is unstable: Kafka » Kafka Branch Builder » trunk #2081
Posted by Apache Jenkins Server <je...@builds.apache.org>.
See <https://ci-builds.apache.org/job/Kafka/job/kafka/job/trunk/2081/display/redirect>
Build failed in Jenkins: Kafka » Kafka Branch Builder » trunk #2080
Posted by Apache Jenkins Server <je...@builds.apache.org>.
See <https://ci-builds.apache.org/job/Kafka/job/kafka/job/trunk/2080/display/redirect>
Changes:
------------------------------------------
[...truncated 384979 lines...]
Gradle Test Run :streams:integrationTest > Gradle Test Executor 179 > TaskMetadataIntegrationTest > shouldReportCorrectEndOffsetInformation STARTED
Gradle Test Run :streams:integrationTest > Gradle Test Executor 179 > TaskMetadataIntegrationTest > shouldReportCorrectEndOffsetInformation PASSED
Gradle Test Run :streams:integrationTest > Gradle Test Executor 179 > TaskMetadataIntegrationTest > shouldReportCorrectCommittedOffsetInformation STARTED
Gradle Test Run :streams:integrationTest > Gradle Test Executor 179 > TaskMetadataIntegrationTest > shouldReportCorrectCommittedOffsetInformation PASSED
Gradle Test Run :streams:integrationTest > Gradle Test Executor 179 > EmitOnChangeIntegrationTest > shouldEmitSameRecordAfterFailover() STARTED
Gradle Test Run :streams:integrationTest > Gradle Test Executor 179 > EmitOnChangeIntegrationTest > shouldEmitSameRecordAfterFailover() PASSED
Gradle Test Run :streams:integrationTest > Gradle Test Executor 179 > HighAvailabilityTaskAssignorIntegrationTest > shouldScaleOutWithWarmupTasksAndPersistentStores(TestInfo) STARTED
Gradle Test Run :streams:integrationTest > Gradle Test Executor 179 > HighAvailabilityTaskAssignorIntegrationTest > shouldScaleOutWithWarmupTasksAndPersistentStores(TestInfo) PASSED
Gradle Test Run :streams:integrationTest > Gradle Test Executor 179 > HighAvailabilityTaskAssignorIntegrationTest > shouldScaleOutWithWarmupTasksAndInMemoryStores(TestInfo) STARTED
Gradle Test Run :streams:integrationTest > Gradle Test Executor 179 > HighAvailabilityTaskAssignorIntegrationTest > shouldScaleOutWithWarmupTasksAndInMemoryStores(TestInfo) PASSED
Gradle Test Run :streams:integrationTest > Gradle Test Executor 179 > KStreamAggregationDedupIntegrationTest > shouldReduce(TestInfo) STARTED
Gradle Test Run :streams:integrationTest > Gradle Test Executor 179 > KStreamAggregationDedupIntegrationTest > shouldReduce(TestInfo) PASSED
Gradle Test Run :streams:integrationTest > Gradle Test Executor 179 > KStreamAggregationDedupIntegrationTest > shouldGroupByKey(TestInfo) STARTED
Gradle Test Run :streams:integrationTest > Gradle Test Executor 179 > KStreamAggregationDedupIntegrationTest > shouldGroupByKey(TestInfo) PASSED
Gradle Test Run :streams:integrationTest > Gradle Test Executor 179 > KStreamAggregationDedupIntegrationTest > shouldReduceWindowed(TestInfo) STARTED
Gradle Test Run :streams:integrationTest > Gradle Test Executor 179 > KStreamAggregationDedupIntegrationTest > shouldReduceWindowed(TestInfo) PASSED
Gradle Test Run :streams:integrationTest > Gradle Test Executor 179 > KStreamKStreamIntegrationTest > shouldOuterJoin() STARTED
Gradle Test Run :streams:integrationTest > Gradle Test Executor 179 > KStreamKStreamIntegrationTest > shouldOuterJoin() PASSED
Gradle Test Run :streams:integrationTest > Gradle Test Executor 179 > KTableKTableForeignKeyInnerJoinMultiIntegrationTest > shouldInnerJoinMultiPartitionQueryable() STARTED
Gradle Test Run :streams:integrationTest > Gradle Test Executor 179 > KTableKTableForeignKeyInnerJoinMultiIntegrationTest > shouldInnerJoinMultiPartitionQueryable() PASSED
Gradle Test Run :streams:integrationTest > Gradle Test Executor 179 > KTableSourceTopicRestartIntegrationTest > shouldRestoreAndProgressWhenTopicNotWrittenToDuringRestoration() STARTED
Gradle Test Run :streams:integrationTest > Gradle Test Executor 179 > KTableSourceTopicRestartIntegrationTest > shouldRestoreAndProgressWhenTopicNotWrittenToDuringRestoration() PASSED
Gradle Test Run :streams:integrationTest > Gradle Test Executor 179 > KTableSourceTopicRestartIntegrationTest > shouldRestoreAndProgressWhenTopicWrittenToDuringRestorationWithEosAlphaEnabled() STARTED
Gradle Test Run :streams:integrationTest > Gradle Test Executor 179 > KTableSourceTopicRestartIntegrationTest > shouldRestoreAndProgressWhenTopicWrittenToDuringRestorationWithEosAlphaEnabled() PASSED
Gradle Test Run :streams:integrationTest > Gradle Test Executor 179 > KTableSourceTopicRestartIntegrationTest > shouldRestoreAndProgressWhenTopicWrittenToDuringRestorationWithEosDisabled() STARTED
Gradle Test Run :streams:integrationTest > Gradle Test Executor 179 > KTableSourceTopicRestartIntegrationTest > shouldRestoreAndProgressWhenTopicWrittenToDuringRestorationWithEosDisabled() PASSED
Gradle Test Run :streams:integrationTest > Gradle Test Executor 179 > KTableSourceTopicRestartIntegrationTest > shouldRestoreAndProgressWhenTopicWrittenToDuringRestorationWithEosV2Enabled() STARTED
Gradle Test Run :streams:integrationTest > Gradle Test Executor 179 > KTableSourceTopicRestartIntegrationTest > shouldRestoreAndProgressWhenTopicWrittenToDuringRestorationWithEosV2Enabled() PASSED
Gradle Test Run :streams:integrationTest > Gradle Test Executor 179 > LagFetchIntegrationTest > shouldFetchLagsDuringRebalancingWithOptimization() STARTED
Gradle Test Run :streams:integrationTest > Gradle Test Executor 179 > LagFetchIntegrationTest > shouldFetchLagsDuringRebalancingWithOptimization() PASSED
Gradle Test Run :streams:integrationTest > Gradle Test Executor 179 > LagFetchIntegrationTest > shouldFetchLagsDuringRestoration() STARTED
Gradle Test Run :streams:integrationTest > Gradle Test Executor 179 > LagFetchIntegrationTest > shouldFetchLagsDuringRestoration() PASSED
Gradle Test Run :streams:integrationTest > Gradle Test Executor 179 > LagFetchIntegrationTest > shouldFetchLagsDuringRebalancingWithNoOptimization() STARTED
Gradle Test Run :streams:integrationTest > Gradle Test Executor 179 > LagFetchIntegrationTest > shouldFetchLagsDuringRebalancingWithNoOptimization() PASSED
Gradle Test Run :streams:integrationTest > Gradle Test Executor 179 > OptimizedKTableIntegrationTest > shouldApplyUpdatesToStandbyStore(TestInfo) STARTED
Gradle Test Run :streams:integrationTest > Gradle Test Executor 179 > OptimizedKTableIntegrationTest > shouldApplyUpdatesToStandbyStore(TestInfo) PASSED
Gradle Test Run :streams:integrationTest > Gradle Test Executor 179 > RestoreIntegrationTest > shouldRecycleStateFromStandbyTaskPromotedToActiveTaskAndNotRestore(boolean) > [1] true STARTED
Gradle Test Run :streams:integrationTest > Gradle Test Executor 179 > RestoreIntegrationTest > shouldRecycleStateFromStandbyTaskPromotedToActiveTaskAndNotRestore(boolean) > [1] true PASSED
Gradle Test Run :streams:integrationTest > Gradle Test Executor 179 > RestoreIntegrationTest > shouldRecycleStateFromStandbyTaskPromotedToActiveTaskAndNotRestore(boolean) > [2] false STARTED
Gradle Test Run :streams:integrationTest > Gradle Test Executor 179 > RestoreIntegrationTest > shouldRecycleStateFromStandbyTaskPromotedToActiveTaskAndNotRestore(boolean) > [2] false PASSED
Gradle Test Run :streams:integrationTest > Gradle Test Executor 179 > RestoreIntegrationTest > shouldProcessDataFromStoresWithLoggingDisabled(boolean) > [1] true STARTED
Gradle Test Run :streams:integrationTest > Gradle Test Executor 179 > RestoreIntegrationTest > shouldProcessDataFromStoresWithLoggingDisabled(boolean) > [1] true PASSED
Gradle Test Run :streams:integrationTest > Gradle Test Executor 179 > RestoreIntegrationTest > shouldProcessDataFromStoresWithLoggingDisabled(boolean) > [2] false STARTED
Gradle Test Run :streams:integrationTest > Gradle Test Executor 179 > RestoreIntegrationTest > shouldProcessDataFromStoresWithLoggingDisabled(boolean) > [2] false PASSED
Gradle Test Run :streams:integrationTest > Gradle Test Executor 179 > RestoreIntegrationTest > shouldRestoreNullRecord() STARTED
Gradle Test Run :streams:integrationTest > Gradle Test Executor 179 > RestoreIntegrationTest > shouldRestoreNullRecord() PASSED
Gradle Test Run :streams:integrationTest > Gradle Test Executor 179 > RestoreIntegrationTest > shouldRestoreStateFromSourceTopic(boolean) > [1] true STARTED
Gradle Test Run :streams:integrationTest > Gradle Test Executor 179 > RestoreIntegrationTest > shouldRestoreStateFromSourceTopic(boolean) > [1] true PASSED
Gradle Test Run :streams:integrationTest > Gradle Test Executor 179 > RestoreIntegrationTest > shouldRestoreStateFromSourceTopic(boolean) > [2] false STARTED
Gradle Test Run :streams:integrationTest > Gradle Test Executor 179 > RestoreIntegrationTest > shouldRestoreStateFromSourceTopic(boolean) > [2] false PASSED
Gradle Test Run :streams:integrationTest > Gradle Test Executor 179 > RestoreIntegrationTest > shouldSuccessfullyStartWhenLoggingDisabled(boolean) > [1] true STARTED
Gradle Test Run :streams:integrationTest > Gradle Test Executor 179 > RestoreIntegrationTest > shouldSuccessfullyStartWhenLoggingDisabled(boolean) > [1] true PASSED
Gradle Test Run :streams:integrationTest > Gradle Test Executor 179 > RestoreIntegrationTest > shouldSuccessfullyStartWhenLoggingDisabled(boolean) > [2] false STARTED
Gradle Test Run :streams:integrationTest > Gradle Test Executor 179 > RestoreIntegrationTest > shouldSuccessfullyStartWhenLoggingDisabled(boolean) > [2] false PASSED
Gradle Test Run :streams:integrationTest > Gradle Test Executor 179 > RestoreIntegrationTest > shouldRestoreStateFromChangelogTopic(boolean) > [1] true STARTED
Gradle Test Run :streams:integrationTest > Gradle Test Executor 179 > RestoreIntegrationTest > shouldRestoreStateFromChangelogTopic(boolean) > [1] true PASSED
Gradle Test Run :streams:integrationTest > Gradle Test Executor 179 > RestoreIntegrationTest > shouldRestoreStateFromChangelogTopic(boolean) > [2] false STARTED
Gradle Test Run :streams:integrationTest > Gradle Test Executor 179 > RestoreIntegrationTest > shouldRestoreStateFromChangelogTopic(boolean) > [2] false PASSED
Gradle Test Run :streams:integrationTest > Gradle Test Executor 179 > SmokeTestDriverIntegrationTest > shouldWorkWithRebalance(boolean) > [1] true STARTED
Gradle Test Run :streams:integrationTest > Gradle Test Executor 179 > SmokeTestDriverIntegrationTest > shouldWorkWithRebalance(boolean) > [1] true PASSED
Gradle Test Run :streams:integrationTest > Gradle Test Executor 179 > SmokeTestDriverIntegrationTest > shouldWorkWithRebalance(boolean) > [2] false STARTED
Gradle Test Run :streams:integrationTest > Gradle Test Executor 179 > SmokeTestDriverIntegrationTest > shouldWorkWithRebalance(boolean) > [2] false PASSED
Gradle Test Run :streams:integrationTest > Gradle Test Executor 179 > StoreQueryIntegrationTest > shouldQuerySpecificActivePartitionStores() STARTED
Gradle Test Run :streams:integrationTest > Gradle Test Executor 179 > StoreQueryIntegrationTest > shouldQuerySpecificActivePartitionStores() PASSED
Gradle Test Run :streams:integrationTest > Gradle Test Executor 179 > StoreQueryIntegrationTest > shouldFailWithIllegalArgumentExceptionWhenIQPartitionerReturnsMultiplePartitions() STARTED
Gradle Test Run :streams:integrationTest > Gradle Test Executor 179 > StoreQueryIntegrationTest > shouldFailWithIllegalArgumentExceptionWhenIQPartitionerReturnsMultiplePartitions() PASSED
Gradle Test Run :streams:integrationTest > Gradle Test Executor 179 > StoreQueryIntegrationTest > shouldQueryAllStalePartitionStores() STARTED
Gradle Test Run :streams:integrationTest > Gradle Test Executor 179 > StoreQueryIntegrationTest > shouldQueryAllStalePartitionStores() PASSED
Gradle Test Run :streams:integrationTest > Gradle Test Executor 179 > StoreQueryIntegrationTest > shouldQuerySpecificStalePartitionStoresMultiStreamThreads() STARTED
Gradle Test Run :streams:integrationTest > Gradle Test Executor 179 > StoreQueryIntegrationTest > shouldQuerySpecificStalePartitionStoresMultiStreamThreads() PASSED
Gradle Test Run :streams:integrationTest > Gradle Test Executor 179 > StoreQueryIntegrationTest > shouldQuerySpecificStalePartitionStores() STARTED
Gradle Test Run :streams:integrationTest > Gradle Test Executor 179 > StoreQueryIntegrationTest > shouldQuerySpecificStalePartitionStores() PASSED
Gradle Test Run :streams:integrationTest > Gradle Test Executor 179 > StoreQueryIntegrationTest > shouldQueryOnlyActivePartitionStoresByDefault() STARTED
Gradle Test Run :streams:integrationTest > Gradle Test Executor 179 > StoreQueryIntegrationTest > shouldQueryOnlyActivePartitionStoresByDefault() PASSED
Gradle Test Run :streams:integrationTest > Gradle Test Executor 179 > StoreQueryIntegrationTest > shouldQueryStoresAfterAddingAndRemovingStreamThread() STARTED
Gradle Test Run :streams:integrationTest > Gradle Test Executor 179 > StoreQueryIntegrationTest > shouldQueryStoresAfterAddingAndRemovingStreamThread() PASSED
Gradle Test Run :streams:integrationTest > Gradle Test Executor 179 > StoreQueryIntegrationTest > shouldQuerySpecificStalePartitionStoresMultiStreamThreadsNamedTopology() STARTED
Gradle Test Run :streams:integrationTest > Gradle Test Executor 179 > StoreQueryIntegrationTest > shouldQuerySpecificStalePartitionStoresMultiStreamThreadsNamedTopology() PASSED
streams-0: SMOKE-TEST-CLIENT-CLOSED
streams-3: SMOKE-TEST-CLIENT-CLOSED
streams-2: SMOKE-TEST-CLIENT-CLOSED
streams-5: SMOKE-TEST-CLIENT-CLOSED
streams-4: SMOKE-TEST-CLIENT-CLOSED
streams-0: SMOKE-TEST-CLIENT-CLOSED
streams-2: SMOKE-TEST-CLIENT-CLOSED
streams-3: SMOKE-TEST-CLIENT-CLOSED
streams-1: SMOKE-TEST-CLIENT-CLOSED
streams-1: SMOKE-TEST-CLIENT-CLOSED
streams-4: SMOKE-TEST-CLIENT-CLOSED
FAILURE: Build failed with an exception.
* What went wrong:
Execution failed for task ':streams:upgrade-system-tests-11:unitTest'.
> Process 'Gradle Test Executor 27' finished with non-zero exit value 1
This problem might be caused by incorrect test process configuration.
For more on test execution, please refer to https://docs.gradle.org/8.2.1/userguide/java_testing.html#sec:test_execution in the Gradle documentation.
* Try:
> Run with --stacktrace option to get the stack trace.
> Run with --info or --debug option to get more log output.
> Get more help at https://help.gradle.org.
Deprecated Gradle features were used in this build, making it incompatible with Gradle 9.0.
You can use '--warning-mode all' to show the individual deprecation warnings and determine if they come from your own scripts or plugins.
For more on this, please refer to https://docs.gradle.org/8.2.1/userguide/command_line_interface.html#sec:command_line_warnings in the Gradle documentation.
BUILD FAILED in 2h 50m 38s
237 actionable tasks: 124 executed, 113 up-to-date
Publishing build scan...
https://ge.apache.org/s/jer3dacpdhhdi
See the profiling report at: file:///home/jenkins/jenkins-agent/workspace/Kafka_kafka_trunk/build/reports/profile/profile-2023-08-09-11-36-05.html
A fine-grained performance profile is available: use the --scan option.
[Pipeline] }
[Pipeline] // withEnv
[Pipeline] }
[Pipeline] // withEnv
[Pipeline] }
[Pipeline] // withEnv
[Pipeline] }
[Pipeline] // node
[Pipeline] }
[Pipeline] // timestamps
[Pipeline] }
[Pipeline] // timeout
[Pipeline] }
[Pipeline] // stage
[Pipeline] }
Failed in branch JDK 17 and Scala 2.13
Cancelling nested steps due to timeout
Sending interrupt signal to process
> Task :core:unitTest
Gradle Test Run :core:unitTest > Gradle Test Executor 126 > ProducerIdsIntegrationTest > testUniqueProducerIds(ClusterInstance) > [1] Type=ZK, Name=testUniqueProducerIds, MetadataVersion=2.8-IV1, Security=PLAINTEXT SKIPPED
The message received from the daemon indicates that the daemon has disappeared.
Build request sent: Build{id=0e219a37-40ea-454f-bbc7-35ed4721ae85, currentDir=/home/jenkins/workspace/Kafka_kafka_trunk}
Attempting to read last messages from the daemon log...
script returned exit code 143
[Pipeline] }
[Pipeline] // withEnv
[Pipeline] }
[Pipeline] // withEnv
[Pipeline] }
[Pipeline] // withEnv
[Pipeline] }
[Pipeline] // node
[Pipeline] }
[Pipeline] // timestamps
[Pipeline] }
[Pipeline] // timeout
[Pipeline] }
[Pipeline] // stage
[Pipeline] }
Failed in branch JDK 20 and Scala 2.13
[Pipeline] // parallel
[Pipeline] }
[Pipeline] // stage
[Pipeline] stage
[Pipeline] { (Declarative: Post Actions)
[Pipeline] script
[Pipeline] {
[Pipeline] node
Running on builds57 in /home/jenkins/jenkins-agent/workspace/Kafka_kafka_trunk
[Pipeline] {
[Pipeline] step
Jenkins build is still unstable: Kafka » Kafka Branch Builder » trunk #2079
Posted by Apache Jenkins Server <je...@builds.apache.org>.
See <https://ci-builds.apache.org/job/Kafka/job/kafka/job/trunk/2079/display/redirect>
Jenkins build is still unstable: Kafka » Kafka Branch Builder » trunk #2078
Posted by Apache Jenkins Server <je...@builds.apache.org>.
See <https://ci-builds.apache.org/job/Kafka/job/kafka/job/trunk/2078/display/redirect>
Jenkins build is still unstable: Kafka » Kafka Branch Builder » trunk #2077
Posted by Apache Jenkins Server <je...@builds.apache.org>.
See <https://ci-builds.apache.org/job/Kafka/job/kafka/job/trunk/2077/display/redirect>
Jenkins build is unstable: Kafka » Kafka Branch Builder » trunk #2076
Posted by Apache Jenkins Server <je...@builds.apache.org>.
See <https://ci-builds.apache.org/job/Kafka/job/kafka/job/trunk/2076/display/redirect>