You are viewing a plain text version of this content. The canonical link for it is here.
Posted to builds@solr.apache.org by Apache Jenkins Server <je...@builds.apache.org> on 2024/09/05 08:47:12 UTC
[JENKINS] Solr » Solr-check-9.7 - Build # 28 - Unstable!
Build: https://ci-builds.apache.org/job/Solr/job/Solr-check-9.7/28/
3 tests failed.
FAILED: org.apache.solr.core.TestSolrConfigHandler.testSetPropertyEnableAndDisableCache
Error Message:
java.lang.AssertionError
Stack Trace:
java.lang.AssertionError
at __randomizedtesting.SeedInfo.seed([844C4EAE555D4548:A538A9302B09DC66]:0)
at org.junit.Assert.fail(Assert.java:87)
at org.junit.Assert.assertTrue(Assert.java:42)
at org.junit.Assert.assertNotNull(Assert.java:713)
at org.junit.Assert.assertNotNull(Assert.java:723)
at org.apache.solr.core.TestSolrConfigHandler.testSetPropertyEnableAndDisableCache(TestSolrConfigHandler.java:1052)
at java.base/jdk.internal.reflect.NativeMethodAccessorImpl.invoke0(Native Method)
at java.base/jdk.internal.reflect.NativeMethodAccessorImpl.invoke(NativeMethodAccessorImpl.java:62)
at java.base/jdk.internal.reflect.DelegatingMethodAccessorImpl.invoke(DelegatingMethodAccessorImpl.java:43)
at java.base/java.lang.reflect.Method.invoke(Method.java:566)
at com.carrotsearch.randomizedtesting.RandomizedRunner.invoke(RandomizedRunner.java:1758)
at com.carrotsearch.randomizedtesting.RandomizedRunner$8.evaluate(RandomizedRunner.java:946)
at com.carrotsearch.randomizedtesting.RandomizedRunner$9.evaluate(RandomizedRunner.java:982)
at com.carrotsearch.randomizedtesting.RandomizedRunner$10.evaluate(RandomizedRunner.java:996)
at com.carrotsearch.randomizedtesting.rules.SystemPropertiesRestoreRule$1.evaluate(SystemPropertiesRestoreRule.java:80)
at org.junit.rules.RunRules.evaluate(RunRules.java:20)
at org.apache.lucene.tests.util.TestRuleSetupTeardownChained$1.evaluate(TestRuleSetupTeardownChained.java:48)
at org.apache.lucene.tests.util.AbstractBeforeAfterRule$1.evaluate(AbstractBeforeAfterRule.java:43)
at org.apache.lucene.tests.util.TestRuleThreadAndTestName$1.evaluate(TestRuleThreadAndTestName.java:45)
at org.apache.lucene.tests.util.TestRuleIgnoreAfterMaxFailures$1.evaluate(TestRuleIgnoreAfterMaxFailures.java:60)
at org.apache.lucene.tests.util.TestRuleMarkFailure$1.evaluate(TestRuleMarkFailure.java:44)
at org.junit.rules.RunRules.evaluate(RunRules.java:20)
at com.carrotsearch.randomizedtesting.rules.StatementAdapter.evaluate(StatementAdapter.java:36)
at com.carrotsearch.randomizedtesting.ThreadLeakControl$StatementRunner.run(ThreadLeakControl.java:390)
at com.carrotsearch.randomizedtesting.ThreadLeakControl.forkTimeoutingTask(ThreadLeakControl.java:843)
at com.carrotsearch.randomizedtesting.ThreadLeakControl$3.evaluate(ThreadLeakControl.java:490)
at com.carrotsearch.randomizedtesting.RandomizedRunner.runSingleTest(RandomizedRunner.java:955)
at com.carrotsearch.randomizedtesting.RandomizedRunner$5.evaluate(RandomizedRunner.java:840)
at com.carrotsearch.randomizedtesting.RandomizedRunner$6.evaluate(RandomizedRunner.java:891)
at com.carrotsearch.randomizedtesting.RandomizedRunner$7.evaluate(RandomizedRunner.java:902)
at org.junit.rules.ExternalResource$1.evaluate(ExternalResource.java:54)
at com.carrotsearch.randomizedtesting.rules.StatementAdapter.evaluate(StatementAdapter.java:36)
at com.carrotsearch.randomizedtesting.rules.StatementAdapter.evaluate(StatementAdapter.java:36)
at org.apache.lucene.tests.util.AbstractBeforeAfterRule$1.evaluate(AbstractBeforeAfterRule.java:43)
at org.apache.lucene.tests.util.AbstractBeforeAfterRule$1.evaluate(AbstractBeforeAfterRule.java:43)
at com.carrotsearch.randomizedtesting.rules.SystemPropertiesRestoreRule$1.evaluate(SystemPropertiesRestoreRule.java:80)
at org.junit.rules.RunRules.evaluate(RunRules.java:20)
at org.apache.lucene.tests.util.AbstractBeforeAfterRule$1.evaluate(AbstractBeforeAfterRule.java:43)
at com.carrotsearch.randomizedtesting.rules.StatementAdapter.evaluate(StatementAdapter.java:36)
at org.apache.lucene.tests.util.TestRuleStoreClassName$1.evaluate(TestRuleStoreClassName.java:38)
at com.carrotsearch.randomizedtesting.rules.NoShadowingOrOverridesOnMethodsRule$1.evaluate(NoShadowingOrOverridesOnMethodsRule.java:40)
at com.carrotsearch.randomizedtesting.rules.NoShadowingOrOverridesOnMethodsRule$1.evaluate(NoShadowingOrOverridesOnMethodsRule.java:40)
at com.carrotsearch.randomizedtesting.rules.StatementAdapter.evaluate(StatementAdapter.java:36)
at com.carrotsearch.randomizedtesting.rules.StatementAdapter.evaluate(StatementAdapter.java:36)
at org.apache.lucene.tests.util.TestRuleAssertionsRequired$1.evaluate(TestRuleAssertionsRequired.java:53)
at org.apache.lucene.tests.util.AbstractBeforeAfterRule$1.evaluate(AbstractBeforeAfterRule.java:43)
at org.apache.lucene.tests.util.TestRuleMarkFailure$1.evaluate(TestRuleMarkFailure.java:44)
at org.apache.lucene.tests.util.TestRuleIgnoreAfterMaxFailures$1.evaluate(TestRuleIgnoreAfterMaxFailures.java:60)
at org.apache.lucene.tests.util.TestRuleIgnoreTestSuites$1.evaluate(TestRuleIgnoreTestSuites.java:47)
at org.junit.rules.RunRules.evaluate(RunRules.java:20)
at com.carrotsearch.randomizedtesting.rules.StatementAdapter.evaluate(StatementAdapter.java:36)
at com.carrotsearch.randomizedtesting.ThreadLeakControl$StatementRunner.run(ThreadLeakControl.java:390)
at com.carrotsearch.randomizedtesting.ThreadLeakControl.lambda$forkTimeoutingTask$0(ThreadLeakControl.java:850)
at java.base/java.lang.Thread.run(Thread.java:829)
FAILED: org.apache.solr.client.solrj.TestLBHttp2SolrClient.testTwoServers
Error Message:
org.apache.solr.client.solrj.SolrServerException: Timeout occurred while waiting response from server at: https://127.0.0.1:35435/solr/collection1/select
Stack Trace:
org.apache.solr.client.solrj.SolrServerException: Timeout occurred while waiting response from server at: https://127.0.0.1:35435/solr/collection1/select
at __randomizedtesting.SeedInfo.seed([844C4EAE555D4548:24A6E0238E166B68]:0)
at app//org.apache.solr.client.solrj.impl.Http2SolrClient.request(Http2SolrClient.java:533)
at app//org.apache.solr.client.solrj.impl.LBSolrClient.request(LBSolrClient.java:790)
at app//org.apache.solr.client.solrj.impl.LBSolrClient.request(LBSolrClient.java:732)
at app//org.apache.solr.client.solrj.SolrRequest.process(SolrRequest.java:255)
at app//org.apache.solr.client.solrj.SolrClient.query(SolrClient.java:927)
at app//org.apache.solr.client.solrj.SolrClient.query(SolrClient.java:940)
at app//org.apache.solr.client.solrj.TestLBHttp2SolrClient.testTwoServers(TestLBHttp2SolrClient.java:202)
at java.base@11.0.16.1/jdk.internal.reflect.NativeMethodAccessorImpl.invoke0(Native Method)
at java.base@11.0.16.1/jdk.internal.reflect.NativeMethodAccessorImpl.invoke(NativeMethodAccessorImpl.java:62)
at java.base@11.0.16.1/jdk.internal.reflect.DelegatingMethodAccessorImpl.invoke(DelegatingMethodAccessorImpl.java:43)
at java.base@11.0.16.1/java.lang.reflect.Method.invoke(Method.java:566)
at app//com.carrotsearch.randomizedtesting.RandomizedRunner.invoke(RandomizedRunner.java:1758)
at app//com.carrotsearch.randomizedtesting.RandomizedRunner$8.evaluate(RandomizedRunner.java:946)
at app//com.carrotsearch.randomizedtesting.RandomizedRunner$9.evaluate(RandomizedRunner.java:982)
at app//com.carrotsearch.randomizedtesting.RandomizedRunner$10.evaluate(RandomizedRunner.java:996)
at app//com.carrotsearch.randomizedtesting.rules.SystemPropertiesRestoreRule$1.evaluate(SystemPropertiesRestoreRule.java:80)
at app//org.junit.rules.RunRules.evaluate(RunRules.java:20)
at app//org.apache.lucene.tests.util.TestRuleSetupTeardownChained$1.evaluate(TestRuleSetupTeardownChained.java:48)
at app//org.apache.lucene.tests.util.AbstractBeforeAfterRule$1.evaluate(AbstractBeforeAfterRule.java:43)
at app//org.apache.lucene.tests.util.TestRuleThreadAndTestName$1.evaluate(TestRuleThreadAndTestName.java:45)
at app//org.apache.lucene.tests.util.TestRuleIgnoreAfterMaxFailures$1.evaluate(TestRuleIgnoreAfterMaxFailures.java:60)
at app//org.apache.lucene.tests.util.TestRuleMarkFailure$1.evaluate(TestRuleMarkFailure.java:44)
at app//org.junit.rules.RunRules.evaluate(RunRules.java:20)
at app//com.carrotsearch.randomizedtesting.rules.StatementAdapter.evaluate(StatementAdapter.java:36)
at app//com.carrotsearch.randomizedtesting.ThreadLeakControl$StatementRunner.run(ThreadLeakControl.java:390)
at app//com.carrotsearch.randomizedtesting.ThreadLeakControl.forkTimeoutingTask(ThreadLeakControl.java:843)
at app//com.carrotsearch.randomizedtesting.ThreadLeakControl$3.evaluate(ThreadLeakControl.java:490)
at app//com.carrotsearch.randomizedtesting.RandomizedRunner.runSingleTest(RandomizedRunner.java:955)
at app//com.carrotsearch.randomizedtesting.RandomizedRunner$5.evaluate(RandomizedRunner.java:840)
at app//com.carrotsearch.randomizedtesting.RandomizedRunner$6.evaluate(RandomizedRunner.java:891)
at app//com.carrotsearch.randomizedtesting.RandomizedRunner$7.evaluate(RandomizedRunner.java:902)
at app//com.carrotsearch.randomizedtesting.rules.StatementAdapter.evaluate(StatementAdapter.java:36)
at app//com.carrotsearch.randomizedtesting.rules.StatementAdapter.evaluate(StatementAdapter.java:36)
at app//org.apache.lucene.tests.util.AbstractBeforeAfterRule$1.evaluate(AbstractBeforeAfterRule.java:43)
at app//org.apache.lucene.tests.util.AbstractBeforeAfterRule$1.evaluate(AbstractBeforeAfterRule.java:43)
at app//com.carrotsearch.randomizedtesting.rules.SystemPropertiesRestoreRule$1.evaluate(SystemPropertiesRestoreRule.java:80)
at app//org.junit.rules.RunRules.evaluate(RunRules.java:20)
at app//org.apache.lucene.tests.util.AbstractBeforeAfterRule$1.evaluate(AbstractBeforeAfterRule.java:43)
at app//com.carrotsearch.randomizedtesting.rules.StatementAdapter.evaluate(StatementAdapter.java:36)
at app//org.apache.lucene.tests.util.TestRuleStoreClassName$1.evaluate(TestRuleStoreClassName.java:38)
at app//com.carrotsearch.randomizedtesting.rules.NoShadowingOrOverridesOnMethodsRule$1.evaluate(NoShadowingOrOverridesOnMethodsRule.java:40)
at app//com.carrotsearch.randomizedtesting.rules.NoShadowingOrOverridesOnMethodsRule$1.evaluate(NoShadowingOrOverridesOnMethodsRule.java:40)
at app//com.carrotsearch.randomizedtesting.rules.StatementAdapter.evaluate(StatementAdapter.java:36)
at app//com.carrotsearch.randomizedtesting.rules.StatementAdapter.evaluate(StatementAdapter.java:36)
at app//org.apache.lucene.tests.util.TestRuleAssertionsRequired$1.evaluate(TestRuleAssertionsRequired.java:53)
at app//org.apache.lucene.tests.util.AbstractBeforeAfterRule$1.evaluate(AbstractBeforeAfterRule.java:43)
at app//org.apache.lucene.tests.util.TestRuleMarkFailure$1.evaluate(TestRuleMarkFailure.java:44)
at app//org.apache.lucene.tests.util.TestRuleIgnoreAfterMaxFailures$1.evaluate(TestRuleIgnoreAfterMaxFailures.java:60)
at app//org.apache.lucene.tests.util.TestRuleIgnoreTestSuites$1.evaluate(TestRuleIgnoreTestSuites.java:47)
at app//org.junit.rules.RunRules.evaluate(RunRules.java:20)
at app//com.carrotsearch.randomizedtesting.rules.StatementAdapter.evaluate(StatementAdapter.java:36)
at app//com.carrotsearch.randomizedtesting.ThreadLeakControl$StatementRunner.run(ThreadLeakControl.java:390)
at app//com.carrotsearch.randomizedtesting.ThreadLeakControl.lambda$forkTimeoutingTask$0(ThreadLeakControl.java:850)
at java.base@11.0.16.1/java.lang.Thread.run(Thread.java:829)
Caused by: java.util.concurrent.TimeoutException
at org.eclipse.jetty.client.util.InputStreamResponseListener.get(InputStreamResponseListener.java:214)
at org.apache.solr.client.solrj.impl.Http2SolrClient.request(Http2SolrClient.java:524)
... 53 more
FAILED: org.apache.solr.client.solrj.TestLBHttp2SolrClient.testSimple
Error Message:
java.lang.AssertionError: expected:<3> but was:<2>
Stack Trace:
java.lang.AssertionError: expected:<3> but was:<2>
at __randomizedtesting.SeedInfo.seed([844C4EAE555D4548:BCFF6A5072AE9199]:0)
at org.junit.Assert.fail(Assert.java:89)
at org.junit.Assert.failNotEquals(Assert.java:835)
at org.junit.Assert.assertEquals(Assert.java:647)
at org.junit.Assert.assertEquals(Assert.java:633)
at org.apache.solr.client.solrj.TestLBHttp2SolrClient.testSimple(TestLBHttp2SolrClient.java:166)
at java.base/jdk.internal.reflect.NativeMethodAccessorImpl.invoke0(Native Method)
at java.base/jdk.internal.reflect.NativeMethodAccessorImpl.invoke(NativeMethodAccessorImpl.java:62)
at java.base/jdk.internal.reflect.DelegatingMethodAccessorImpl.invoke(DelegatingMethodAccessorImpl.java:43)
at java.base/java.lang.reflect.Method.invoke(Method.java:566)
at com.carrotsearch.randomizedtesting.RandomizedRunner.invoke(RandomizedRunner.java:1758)
at com.carrotsearch.randomizedtesting.RandomizedRunner$8.evaluate(RandomizedRunner.java:946)
at com.carrotsearch.randomizedtesting.RandomizedRunner$9.evaluate(RandomizedRunner.java:982)
at com.carrotsearch.randomizedtesting.RandomizedRunner$10.evaluate(RandomizedRunner.java:996)
at com.carrotsearch.randomizedtesting.rules.SystemPropertiesRestoreRule$1.evaluate(SystemPropertiesRestoreRule.java:80)
at org.junit.rules.RunRules.evaluate(RunRules.java:20)
at org.apache.lucene.tests.util.TestRuleSetupTeardownChained$1.evaluate(TestRuleSetupTeardownChained.java:48)
at org.apache.lucene.tests.util.AbstractBeforeAfterRule$1.evaluate(AbstractBeforeAfterRule.java:43)
at org.apache.lucene.tests.util.TestRuleThreadAndTestName$1.evaluate(TestRuleThreadAndTestName.java:45)
at org.apache.lucene.tests.util.TestRuleIgnoreAfterMaxFailures$1.evaluate(TestRuleIgnoreAfterMaxFailures.java:60)
at org.apache.lucene.tests.util.TestRuleMarkFailure$1.evaluate(TestRuleMarkFailure.java:44)
at org.junit.rules.RunRules.evaluate(RunRules.java:20)
at com.carrotsearch.randomizedtesting.rules.StatementAdapter.evaluate(StatementAdapter.java:36)
at com.carrotsearch.randomizedtesting.ThreadLeakControl$StatementRunner.run(ThreadLeakControl.java:390)
at com.carrotsearch.randomizedtesting.ThreadLeakControl.forkTimeoutingTask(ThreadLeakControl.java:843)
at com.carrotsearch.randomizedtesting.ThreadLeakControl$3.evaluate(ThreadLeakControl.java:490)
at com.carrotsearch.randomizedtesting.RandomizedRunner.runSingleTest(RandomizedRunner.java:955)
at com.carrotsearch.randomizedtesting.RandomizedRunner$5.evaluate(RandomizedRunner.java:840)
at com.carrotsearch.randomizedtesting.RandomizedRunner$6.evaluate(RandomizedRunner.java:891)
at com.carrotsearch.randomizedtesting.RandomizedRunner$7.evaluate(RandomizedRunner.java:902)
at com.carrotsearch.randomizedtesting.rules.StatementAdapter.evaluate(StatementAdapter.java:36)
at com.carrotsearch.randomizedtesting.rules.StatementAdapter.evaluate(StatementAdapter.java:36)
at org.apache.lucene.tests.util.AbstractBeforeAfterRule$1.evaluate(AbstractBeforeAfterRule.java:43)
at org.apache.lucene.tests.util.AbstractBeforeAfterRule$1.evaluate(AbstractBeforeAfterRule.java:43)
at com.carrotsearch.randomizedtesting.rules.SystemPropertiesRestoreRule$1.evaluate(SystemPropertiesRestoreRule.java:80)
at org.junit.rules.RunRules.evaluate(RunRules.java:20)
at org.apache.lucene.tests.util.AbstractBeforeAfterRule$1.evaluate(AbstractBeforeAfterRule.java:43)
at com.carrotsearch.randomizedtesting.rules.StatementAdapter.evaluate(StatementAdapter.java:36)
at org.apache.lucene.tests.util.TestRuleStoreClassName$1.evaluate(TestRuleStoreClassName.java:38)
at com.carrotsearch.randomizedtesting.rules.NoShadowingOrOverridesOnMethodsRule$1.evaluate(NoShadowingOrOverridesOnMethodsRule.java:40)
at com.carrotsearch.randomizedtesting.rules.NoShadowingOrOverridesOnMethodsRule$1.evaluate(NoShadowingOrOverridesOnMethodsRule.java:40)
at com.carrotsearch.randomizedtesting.rules.StatementAdapter.evaluate(StatementAdapter.java:36)
at com.carrotsearch.randomizedtesting.rules.StatementAdapter.evaluate(StatementAdapter.java:36)
at org.apache.lucene.tests.util.TestRuleAssertionsRequired$1.evaluate(TestRuleAssertionsRequired.java:53)
at org.apache.lucene.tests.util.AbstractBeforeAfterRule$1.evaluate(AbstractBeforeAfterRule.java:43)
at org.apache.lucene.tests.util.TestRuleMarkFailure$1.evaluate(TestRuleMarkFailure.java:44)
at org.apache.lucene.tests.util.TestRuleIgnoreAfterMaxFailures$1.evaluate(TestRuleIgnoreAfterMaxFailures.java:60)
at org.apache.lucene.tests.util.TestRuleIgnoreTestSuites$1.evaluate(TestRuleIgnoreTestSuites.java:47)
at org.junit.rules.RunRules.evaluate(RunRules.java:20)
at com.carrotsearch.randomizedtesting.rules.StatementAdapter.evaluate(StatementAdapter.java:36)
at com.carrotsearch.randomizedtesting.ThreadLeakControl$StatementRunner.run(ThreadLeakControl.java:390)
at com.carrotsearch.randomizedtesting.ThreadLeakControl.lambda$forkTimeoutingTask$0(ThreadLeakControl.java:850)
at java.base/java.lang.Thread.run(Thread.java:829)
Build Log:
[...truncated 1600 lines...]
2> 969627 ERROR (qtp370138607-18720-null-15694) [n: c: s: r: x:collection1 t:null-15694] o.a.s.h.SolrConfigHandler ERROR:[{
2> "errorMessages":["Unknown operation 'not-a-real-command' "],
2> "not-a-real-command":{
2> "param1":"value1",
2> "param2":"value2"}}]
2> 969629 INFO (qtp370138607-18720-null-15694) [n: c: s: r: x:collection1 t:null-15694] o.a.s.c.S.Request webapp=/solr path=/config params={} status=400 QTime=2
2> 969630 INFO (TEST-TestSolrConfigHandler.testFailures-seed#[844C4EAE555D4548]) [n: c: s: r: x: t:] o.a.s.c.TestSolrConfigHandler going to send config command. path /config , payload: { set-property: { update.autoCreateFields: false } }
2> 969630 ERROR (qtp370138607-18721-null-15695) [n: c: s: r: x:collection1 t:null-15695] o.a.s.h.SolrConfigHandler ERROR:[{
2> "set-property":{"update.autoCreateFields":false},
2> "errorMessages":["'update.autoCreateFields' is not an editable property"]}]
2> 969630 INFO (qtp370138607-18721-null-15695) [n: c: s: r: x:collection1 t:null-15695] o.a.s.c.S.Request webapp=/solr path=/config params={} status=400 QTime=0
2> 969631 INFO (TEST-TestSolrConfigHandler.testFailures-seed#[844C4EAE555D4548]) [n: c: s: r: x: t:] o.a.s.c.TestSolrConfigHandler going to send config command. path /config , payload: { set-property: { updateHandler.autoCommit.maxDocs: false } }
2> 969632 ERROR (qtp370138607-18722-null-15696) [n: c: s: r: x:collection1 t:null-15696] o.a.s.h.SolrConfigHandler ERROR:[{
2> "set-property":{"updateHandler.autoCommit.maxDocs":false},
2> "errorMessages":["Property updateHandler.autoCommit.maxDocs must be of Integer type "]}]
2> 969632 INFO (qtp370138607-18722-null-15696) [n: c: s: r: x:collection1 t:null-15696] o.a.s.c.S.Request webapp=/solr path=/config params={} status=400 QTime=0
2> 969632 INFO (TEST-TestSolrConfigHandler.testFailures-seed#[844C4EAE555D4548]) [n: c: s: r: x: t:] o.a.s.c.TestSolrConfigHandler going to send config command. path /config , payload: { unset-property: not-an-editable-property }
2> 969633 ERROR (qtp370138607-18723-null-15697) [n: c: s: r: x:collection1 t:null-15697] o.a.s.h.SolrConfigHandler ERROR:[{
2> "errorMessages":["'[not-an-editable-property]' is not an editable property"],
2> "unset-property":"not-an-editable-property"}]
2> 969633 INFO (qtp370138607-18723-null-15697) [n: c: s: r: x:collection1 t:null-15697] o.a.s.c.S.Request webapp=/solr path=/config params={} status=400 QTime=0
2> 969633 INFO (TEST-TestSolrConfigHandler.testFailures-seed#[844C4EAE555D4548]) [n: c: s: r: x: t:] o.a.s.c.TestSolrConfigHandler going to send config command. path /config , payload: { add-requesthandler: { param1: value1 } }
2> 969634 ERROR (qtp370138607-18724-null-15698) [n: c: s: r: x:collection1 t:null-15698] o.a.s.h.SolrConfigHandler ERROR:[{
2> "add-requesthandler":{"param1":"value1"},
2> "errorMessages":[
2> "'name' is a required field",
2> "'class' is a required field"]}]
2> 969634 INFO (qtp370138607-18724-null-15698) [n: c: s: r: x:collection1 t:null-15698] o.a.s.c.S.Request webapp=/solr path=/config params={} status=400 QTime=0
2> 969634 INFO (TEST-TestSolrConfigHandler.testFailures-seed#[844C4EAE555D4548]) [n: c: s: r: x: t:] o.a.s.c.TestSolrConfigHandler going to send config command. path /config , payload: { update-requesthandler: { param1: value1 } }
2> 969635 ERROR (qtp370138607-18719-null-15699) [n: c: s: r: x:collection1 t:null-15699] o.a.s.h.SolrConfigHandler ERROR:[{
2> "update-requesthandler":{"param1":"value1"},
2> "errorMessages":[
2> "'name' is a required field",
2> "'class' is a required field"]}]
2> 969635 INFO (qtp370138607-18719-null-15699) [n: c: s: r: x:collection1 t:null-15699] o.a.s.c.S.Request webapp=/solr path=/config params={} status=400 QTime=0
2> 969636 INFO (TEST-TestSolrConfigHandler.testFailures-seed#[844C4EAE555D4548]) [n: c: s: r: x: t:] o.a.s.c.TestSolrConfigHandler going to send config command. path /config , payload: { delete-requesthandler: not-a-real-component-name }
2> 969636 ERROR (qtp370138607-18720-null-15700) [n: c: s: r: x:collection1 t:null-15700] o.a.s.h.SolrConfigHandler ERROR:[{
2> "errorMessages":["NO such requestHandler 'not-a-real-component-name' "],
2> "delete-requesthandler":"not-a-real-component-name"}]
2> 969636 INFO (qtp370138607-18720-null-15700) [n: c: s: r: x:collection1 t:null-15700] o.a.s.c.S.Request webapp=/solr path=/config params={} status=400 QTime=0
2> 969637 INFO (TEST-TestSolrConfigHandler.testFailures-seed#[844C4EAE555D4548]) [n: c: s: r: x: t:] o.a.s.c.TestSolrConfigHandler going to send config command. path /config , payload: { add-searchcomponent: { param1: value1 } }
2> 969637 ERROR (qtp370138607-18721-null-15701) [n: c: s: r: x:collection1 t:null-15701] o.a.s.h.SolrConfigHandler ERROR:[{
2> "errorMessages":[
2> "'name' is a required field",
2> "'class' is a required field"],
2> "add-searchcomponent":{"param1":"value1"}}]
2> 969638 INFO (qtp370138607-18721-null-15701) [n: c: s: r: x:collection1 t:null-15701] o.a.s.c.S.Request webapp=/solr path=/config params={} status=400 QTime=0
2> 969638 INFO (TEST-TestSolrConfigHandler.testFailures-seed#[844C4EAE555D4548]) [n: c: s: r: x: t:] o.a.s.c.TestSolrConfigHandler going to send config command. path /config , payload: { update-searchcomponent: { param1: value1 } }
2> 969639 ERROR (qtp370138607-18722-null-15702) [n: c: s: r: x:collection1 t:null-15702] o.a.s.h.SolrConfigHandler ERROR:[{
2> "errorMessages":[
2> "'name' is a required field",
2> "'class' is a required field"],
2> "update-searchcomponent":{"param1":"value1"}}]
2> 969639 INFO (qtp370138607-18722-null-15702) [n: c: s: r: x:collection1 t:null-15702] o.a.s.c.S.Request webapp=/solr path=/config params={} status=400 QTime=0
2> 969639 INFO (TEST-TestSolrConfigHandler.testFailures-seed#[844C4EAE555D4548]) [n: c: s: r: x: t:] o.a.s.c.TestSolrConfigHandler going to send config command. path /config , payload: { delete-searchcomponent: not-a-real-component-name }
2> 969640 ERROR (qtp370138607-18723-null-15703) [n: c: s: r: x:collection1 t:null-15703] o.a.s.h.SolrConfigHandler ERROR:[{
2> "delete-searchcomponent":"not-a-real-component-name",
2> "errorMessages":["NO such searchComponent 'not-a-real-component-name' "]}]
2> 969640 INFO (qtp370138607-18723-null-15703) [n: c: s: r: x:collection1 t:null-15703] o.a.s.c.S.Request webapp=/solr path=/config params={} status=400 QTime=0
2> 969640 INFO (TEST-TestSolrConfigHandler.testFailures-seed#[844C4EAE555D4548]) [n: c: s: r: x: t:] o.a.s.c.TestSolrConfigHandler going to send config command. path /config , payload: { add-initparams: { param1: value1 } }
2> 969641 ERROR (qtp370138607-18724-null-15704) [n: c: s: r: x:collection1 t:null-15704] o.a.s.h.SolrConfigHandler ERROR:[{
2> "errorMessages":["'name' is a required field"],
2> "add-initparams":{"param1":"value1"}}]
2> 969641 INFO (qtp370138607-18724-null-15704) [n: c: s: r: x:collection1 t:null-15704] o.a.s.c.S.Request webapp=/solr path=/config params={} status=400 QTime=0
2> 969641 INFO (TEST-TestSolrConfigHandler.testFailures-seed#[844C4EAE555D4548]) [n: c: s: r: x: t:] o.a.s.c.TestSolrConfigHandler going to send config command. path /config , payload: { update-initparams: { param1: value1 } }
2> 969642 ERROR (qtp370138607-18719-null-15705) [n: c: s: r: x:collection1 t:null-15705] o.a.s.h.SolrConfigHandler ERROR:[{
2> "errorMessages":["'name' is a required field"],
2> "update-initparams":{"param1":"value1"}}]
2> 969642 INFO (qtp370138607-18719-null-15705) [n: c: s: r: x:collection1 t:null-15705] o.a.s.c.S.Request webapp=/solr path=/config params={} status=400 QTime=0
2> 969642 INFO (TEST-TestSolrConfigHandler.testFailures-seed#[844C4EAE555D4548]) [n: c: s: r: x: t:] o.a.s.c.TestSolrConfigHandler going to send config command. path /config , payload: { delete-initparams: not-a-real-component-name }
2> 969643 ERROR (qtp370138607-18720-null-15706) [n: c: s: r: x:collection1 t:null-15706] o.a.s.h.SolrConfigHandler ERROR:[{
2> "delete-initparams":"not-a-real-component-name",
2> "errorMessages":["NO such initParams 'not-a-real-component-name' "]}]
2> 969643 INFO (qtp370138607-18720-null-15706) [n: c: s: r: x:collection1 t:null-15706] o.a.s.c.S.Request webapp=/solr path=/config params={} status=400 QTime=0
2> 969643 INFO (TEST-TestSolrConfigHandler.testFailures-seed#[844C4EAE555D4548]) [n: c: s: r: x: t:] o.a.s.c.TestSolrConfigHandler going to send config command. path /config , payload: { add-queryresponsewriter: { param1: value1 } }
2> 969644 ERROR (qtp370138607-18721-null-15707) [n: c: s: r: x:collection1 t:null-15707] o.a.s.h.SolrConfigHandler ERROR:[{
2> "add-queryresponsewriter":{"param1":"value1"},
2> "errorMessages":[
2> "'name' is a required field",
2> "'class' is a required field"]}]
2> 969644 INFO (qtp370138607-18721-null-15707) [n: c: s: r: x:collection1 t:null-15707] o.a.s.c.S.Request webapp=/solr path=/config params={} status=400 QTime=0
2> 969644 INFO (TEST-TestSolrConfigHandler.testFailures-seed#[844C4EAE555D4548]) [n: c: s: r: x: t:] o.a.s.c.TestSolrConfigHandler going to send config command. path /config , payload: { update-queryresponsewriter: { param1: value1 } }
2> 969645 ERROR (qtp370138607-18722-null-15708) [n: c: s: r: x:collection1 t:null-15708] o.a.s.h.SolrConfigHandler ERROR:[{
2> "update-queryresponsewriter":{"param1":"value1"},
2> "errorMessages":[
2> "'name' is a required field",
2> "'class' is a required field"]}]
2> 969645 INFO (qtp370138607-18722-null-15708) [n: c: s: r: x:collection1 t:null-15708] o.a.s.c.S.Request webapp=/solr path=/config params={} status=400 QTime=0
2> 969646 INFO (TEST-TestSolrConfigHandler.testFailures-seed#[844C4EAE555D4548]) [n: c: s: r: x: t:] o.a.s.c.TestSolrConfigHandler going to send config command. path /config , payload: { delete-queryresponsewriter: not-a-real-component-name }
2> 969646 ERROR (qtp370138607-18723-null-15709) [n: c: s: r: x:collection1 t:null-15709] o.a.s.h.SolrConfigHandler ERROR:[{
2> "errorMessages":["NO such queryResponseWriter 'not-a-real-component-name' "],
2> "delete-queryresponsewriter":"not-a-real-component-name"}]
2> 969646 INFO (qtp370138607-18723-null-15709) [n: c: s: r: x:collection1 t:null-15709] o.a.s.c.S.Request webapp=/solr path=/config params={} status=400 QTime=0
2> 969647 INFO (TEST-TestSolrConfigHandler.testFailures-seed#[844C4EAE555D4548]) [n: c: s: r: x: t:] o.a.s.c.TestSolrConfigHandler going to send config command. path /config , payload: { add-queryparser: { param1: value1 } }
2> 969647 ERROR (qtp370138607-18724-null-15710) [n: c: s: r: x:collection1 t:null-15710] o.a.s.h.SolrConfigHandler ERROR:[{
2> "add-queryparser":{"param1":"value1"},
2> "errorMessages":[
2> "'name' is a required field",
2> "'class' is a required field"]}]
2> 969647 INFO (qtp370138607-18724-null-15710) [n: c: s: r: x:collection1 t:null-15710] o.a.s.c.S.Request webapp=/solr path=/config params={} status=400 QTime=0
2> 969648 INFO (TEST-TestSolrConfigHandler.testFailures-seed#[844C4EAE555D4548]) [n: c: s: r: x: t:] o.a.s.c.TestSolrConfigHandler going to send config command. path /config , payload: { update-queryparser: { param1: value1 } }
2> 969648 ERROR (qtp370138607-18719-null-15711) [n: c: s: r: x:collection1 t:null-15711] o.a.s.h.SolrConfigHandler ERROR:[{
2> "update-queryparser":{"param1":"value1"},
2> "errorMessages":[
2> "'name' is a required field",
2> "'class' is a required field"]}]
2> 969648 INFO (qtp370138607-18719-null-15711) [n: c: s: r: x:collection1 t:null-15711] o.a.s.c.S.Request webapp=/solr path=/config params={} status=400 QTime=0
2> 969649 INFO (TEST-TestSolrConfigHandler.testFailures-seed#[844C4EAE555D4548]) [n: c: s: r: x: t:] o.a.s.c.TestSolrConfigHandler going to send config command. path /config , payload: { delete-queryparser: not-a-real-component-name }
2> 969673 ERROR (qtp370138607-18720-null-15712) [n: c: s: r: x:collection1 t:null-15712] o.a.s.h.SolrConfigHandler ERROR:[{
2> "errorMessages":["NO such queryParser 'not-a-real-component-name' "],
2> "delete-queryparser":"not-a-real-component-name"}]
2> 969673 INFO (qtp370138607-18720-null-15712) [n: c: s: r: x:collection1 t:null-15712] o.a.s.c.S.Request webapp=/solr path=/config params={} status=400 QTime=23
2> 969673 INFO (TEST-TestSolrConfigHandler.testFailures-seed#[844C4EAE555D4548]) [n: c: s: r: x: t:] o.a.s.c.TestSolrConfigHandler going to send config command. path /config , payload: { add-valuesourceparser: { param1: value1 } }
2> 969674 ERROR (qtp370138607-18721-null-15713) [n: c: s: r: x:collection1 t:null-15713] o.a.s.h.SolrConfigHandler ERROR:[{
2> "add-valuesourceparser":{"param1":"value1"},
2> "errorMessages":[
2> "'name' is a required field",
2> "'class' is a required field"]}]
2> 969674 INFO (qtp370138607-18721-null-15713) [n: c: s: r: x:collection1 t:null-15713] o.a.s.c.S.Request webapp=/solr path=/config params={} status=400 QTime=0
2> 969674 INFO (TEST-TestSolrConfigHandler.testFailures-seed#[844C4EAE555D4548]) [n: c: s: r: x: t:] o.a.s.c.TestSolrConfigHandler going to send config command. path /config , payload: { update-valuesourceparser: { param1: value1 } }
2> 969675 ERROR (qtp370138607-18722-null-15714) [n: c: s: r: x:collection1 t:null-15714] o.a.s.h.SolrConfigHandler ERROR:[{
2> "update-valuesourceparser":{"param1":"value1"},
2> "errorMessages":[
2> "'name' is a required field",
2> "'class' is a required field"]}]
2> 969675 INFO (qtp370138607-18722-null-15714) [n: c: s: r: x:collection1 t:null-15714] o.a.s.c.S.Request webapp=/solr path=/config params={} status=400 QTime=0
2> 969675 INFO (TEST-TestSolrConfigHandler.testFailures-seed#[844C4EAE555D4548]) [n: c: s: r: x: t:] o.a.s.c.TestSolrConfigHandler going to send config command. path /config , payload: { delete-valuesourceparser: not-a-real-component-name }
2> 969676 ERROR (qtp370138607-18723-null-15715) [n: c: s: r: x:collection1 t:null-15715] o.a.s.h.SolrConfigHandler ERROR:[{
2> "errorMessages":["NO such valueSourceParser 'not-a-real-component-name' "],
2> "delete-valuesourceparser":"not-a-real-component-name"}]
2> 969676 INFO (qtp370138607-18723-null-15715) [n: c: s: r: x:collection1 t:null-15715] o.a.s.c.S.Request webapp=/solr path=/config params={} status=400 QTime=0
2> 969676 INFO (TEST-TestSolrConfigHandler.testFailures-seed#[844C4EAE555D4548]) [n: c: s: r: x: t:] o.a.s.c.TestSolrConfigHandler going to send config command. path /config , payload: { add-transformer: { param1: value1 } }
2> 969677 ERROR (qtp370138607-18724-null-15716) [n: c: s: r: x:collection1 t:null-15716] o.a.s.h.SolrConfigHandler ERROR:[{
2> "errorMessages":[
2> "'name' is a required field",
2> "'class' is a required field"],
2> "add-transformer":{"param1":"value1"}}]
2> 969677 INFO (qtp370138607-18724-null-15716) [n: c: s: r: x:collection1 t:null-15716] o.a.s.c.S.Request webapp=/solr path=/config params={} status=400 QTime=0
2> 969677 INFO (TEST-TestSolrConfigHandler.testFailures-seed#[844C4EAE555D4548]) [n: c: s: r: x: t:] o.a.s.c.TestSolrConfigHandler going to send config command. path /config , payload: { update-transformer: { param1: value1 } }
2> 969678 ERROR (qtp370138607-18719-null-15717) [n: c: s: r: x:collection1 t:null-15717] o.a.s.h.SolrConfigHandler ERROR:[{
2> "errorMessages":[
2> "'name' is a required field",
2> "'class' is a required field"],
2> "update-transformer":{"param1":"value1"}}]
2> 969678 INFO (qtp370138607-18719-null-15717) [n: c: s: r: x:collection1 t:null-15717] o.a.s.c.S.Request webapp=/solr path=/config params={} status=400 QTime=0
2> 969678 INFO (TEST-TestSolrConfigHandler.testFailures-seed#[844C4EAE555D4548]) [n: c: s: r: x: t:] o.a.s.c.TestSolrConfigHandler going to send config command. path /config , payload: { delete-transformer: not-a-real-component-name }
2> 969679 ERROR (qtp370138607-18720-null-15718) [n: c: s: r: x:collection1 t:null-15718] o.a.s.h.SolrConfigHandler ERROR:[{
2> "delete-transformer":"not-a-real-component-name",
2> "errorMessages":["NO such transformer 'not-a-real-component-name' "]}]
2> 969679 INFO (qtp370138607-18720-null-15718) [n: c: s: r: x:collection1 t:null-15718] o.a.s.c.S.Request webapp=/solr path=/config params={} status=400 QTime=0
2> 969679 INFO (TEST-TestSolrConfigHandler.testFailures-seed#[844C4EAE555D4548]) [n: c: s: r: x: t:] o.a.s.c.TestSolrConfigHandler going to send config command. path /config , payload: { add-updateprocessor: { param1: value1 } }
2> 969680 ERROR (qtp370138607-18721-null-15719) [n: c: s: r: x:collection1 t:null-15719] o.a.s.h.SolrConfigHandler ERROR:[{
2> "errorMessages":[
2> "'name' is a required field",
2> "'class' is a required field"],
2> "add-updateprocessor":{"param1":"value1"}}]
2> 969680 INFO (qtp370138607-18721-null-15719) [n: c: s: r: x:collection1 t:null-15719] o.a.s.c.S.Request webapp=/solr path=/config params={} status=400 QTime=0
2> 969681 INFO (TEST-TestSolrConfigHandler.testFailures-seed#[844C4EAE555D4548]) [n: c: s: r: x: t:] o.a.s.c.TestSolrConfigHandler going to send config command. path /config , payload: { update-updateprocessor: { param1: value1 } }
2> 969681 ERROR (qtp370138607-18722-null-15720) [n: c: s: r: x:collection1 t:null-15720] o.a.s.h.SolrConfigHandler ERROR:[{
2> "errorMessages":[
2> "'name' is a required field",
2> "'class' is a required field"],
2> "update-updateprocessor":{"param1":"value1"}}]
2> 969681 INFO (qtp370138607-18722-null-15720) [n: c: s: r: x:collection1 t:null-15720] o.a.s.c.S.Request webapp=/solr path=/config params={} status=400 QTime=0
2> 969682 INFO (TEST-TestSolrConfigHandler.testFailures-seed#[844C4EAE555D4548]) [n: c: s: r: x: t:] o.a.s.c.TestSolrConfigHandler going to send config command. path /config , payload: { delete-updateprocessor: not-a-real-component-name }
2> 969682 ERROR (qtp370138607-18723-null-15721) [n: c: s: r: x:collection1 t:null-15721] o.a.s.h.SolrConfigHandler ERROR:[{
2> "delete-updateprocessor":"not-a-real-component-name",
2> "errorMessages":["NO such updateProcessor 'not-a-real-component-name' "]}]
2> 969682 INFO (qtp370138607-18723-null-15721) [n: c: s: r: x:collection1 t:null-15721] o.a.s.c.S.Request webapp=/solr path=/config params={} status=400 QTime=0
2> 969683 INFO (TEST-TestSolrConfigHandler.testFailures-seed#[844C4EAE555D4548]) [n: c: s: r: x: t:] o.a.s.c.TestSolrConfigHandler going to send config command. path /config , payload: { add-queryconverter: { param1: value1 } }
2> 969683 ERROR (qtp370138607-18724-null-15722) [n: c: s: r: x:collection1 t:null-15722] o.a.s.h.SolrConfigHandler ERROR:[{
2> "add-queryconverter":{"param1":"value1"},
2> "errorMessages":[
2> "'name' is a required field",
2> "'class' is a required field"]}]
2> 969683 INFO (qtp370138607-18724-null-15722) [n: c: s: r: x:collection1 t:null-15722] o.a.s.c.S.Request webapp=/solr path=/config params={} status=400 QTime=0
2> 969684 INFO (TEST-TestSolrConfigHandler.testFailures-seed#[844C4EAE555D4548]) [n: c: s: r: x: t:] o.a.s.c.TestSolrConfigHandler going to send config command. path /config , payload: { update-queryconverter: { param1: value1 } }
2> 969684 ERROR (qtp370138607-18719-null-15723) [n: c: s: r: x:collection1 t:null-15723] o.a.s.h.SolrConfigHandler ERROR:[{
2> "update-queryconverter":{"param1":"value1"},
2> "errorMessages":[
2> "'name' is a required field",
2> "'class' is a required field"]}]
2> 969684 INFO (qtp370138607-18719-null-15723) [n: c: s: r: x:collection1 t:null-15723] o.a.s.c.S.Request webapp=/solr path=/config params={} status=400 QTime=0
2> 969685 INFO (TEST-TestSolrConfigHandler.testFailures-seed#[844C4EAE555D4548]) [n: c: s: r: x: t:] o.a.s.c.TestSolrConfigHandler going to send config command. path /config , payload: { delete-queryconverter: not-a-real-component-name }
2> 969685 ERROR (qtp370138607-18720-null-15724) [n: c: s: r: x:collection1 t:null-15724] o.a.s.h.SolrConfigHandler ERROR:[{
2> "errorMessages":["NO such queryConverter 'not-a-real-component-name' "],
2> "delete-queryconverter":"not-a-real-component-name"}]
2> 969685 INFO (qtp370138607-18720-null-15724) [n: c: s: r: x:collection1 t:null-15724] o.a.s.c.S.Request webapp=/solr path=/config params={} status=400 QTime=0
2> 969686 INFO (TEST-TestSolrConfigHandler.testFailures-seed#[844C4EAE555D4548]) [n: c: s: r: x: t:] o.a.s.c.TestSolrConfigHandler going to send config command. path /config , payload: { add-listener: { param1: value1 } }
2> 969686 ERROR (qtp370138607-18721-null-15725) [n: c: s: r: x:collection1 t:null-15725] o.a.s.h.SolrConfigHandler ERROR:[{
2> "add-listener":{"param1":"value1"},
2> "errorMessages":[
2> "'name' is a required field",
2> "'class' is a required field"]}]
2> 969686 INFO (qtp370138607-18721-null-15725) [n: c: s: r: x:collection1 t:null-15725] o.a.s.c.S.Request webapp=/solr path=/config params={} status=400 QTime=0
2> 969687 INFO (TEST-TestSolrConfigHandler.testFailures-seed#[844C4EAE555D4548]) [n: c: s: r: x: t:] o.a.s.c.TestSolrConfigHandler going to send config command. path /config , payload: { update-listener: { param1: value1 } }
2> 969687 ERROR (qtp370138607-18722-null-15726) [n: c: s: r: x:collection1 t:null-15726] o.a.s.h.SolrConfigHandler ERROR:[{
2> "update-listener":{"param1":"value1"},
2> "errorMessages":[
2> "'name' is a required field",
2> "'class' is a required field"]}]
2> 969687 INFO (qtp370138607-18722-null-15726) [n: c: s: r: x:collection1 t:null-15726] o.a.s.c.S.Request webapp=/solr path=/config params={} status=400 QTime=0
2> 969688 INFO (TEST-TestSolrConfigHandler.testFailures-seed#[844C4EAE555D4548]) [n: c: s: r: x: t:] o.a.s.c.TestSolrConfigHandler going to send config command. path /config , payload: { delete-listener: not-a-real-component-name }
2> 969688 ERROR (qtp370138607-18723-null-15727) [n: c: s: r: x:collection1 t:null-15727] o.a.s.h.SolrConfigHandler ERROR:[{
2> "errorMessages":["NO such listener 'not-a-real-component-name' "],
2> "delete-listener":"not-a-real-component-name"}]
2> 969688 INFO (qtp370138607-18723-null-15727) [n: c: s: r: x:collection1 t:null-15727] o.a.s.c.S.Request webapp=/solr path=/config params={} status=400 QTime=0
2> 969689 INFO (TEST-TestSolrConfigHandler.testFailures-seed#[844C4EAE555D4548]) [n: c: s: r: x: t:] o.e.j.s.Server Stopped Server@5c263267{STOPPING}[10.0.22,sto=0]
2> 969689 INFO (TEST-TestSolrConfigHandler.testFailures-seed#[844C4EAE555D4548]) [n: c: s: r: x: t:] o.e.j.s.AbstractConnector Stopped ServerConnector@1d7f379d{HTTP/1.1, (http/1.1, h2c)}{127.0.0.1:0}
2> 969691 INFO (TEST-TestSolrConfigHandler.testFailures-seed#[844C4EAE555D4548]) [n: c: s: r: x: t:] o.a.s.c.CoreContainer Shutting down CoreContainer instance=460220334
2> 969695 INFO (coreCloseExecutor-14702-thread-1) [n: c: s: r: x:collection1 t:] o.a.s.c.SolrCore CLOSING SolrCore org.apache.solr.core.SolrCore@7041e5d collection1
2> 969695 INFO (coreCloseExecutor-14702-thread-1) [n: c: s: r: x:collection1 t:] o.a.s.m.SolrMetricManager Closing metric reporters for registry=solr.core.collection1 tag=SolrCore@7041e5d
2> 969704 INFO (coreCloseExecutor-14702-thread-1) [n: c: s: r: x:collection1 t:] o.a.s.u.DirectUpdateHandler2 Committing on IndexWriter.close() ... SKIPPED (unnecessary).
2> 969707 INFO (TEST-TestSolrConfigHandler.testFailures-seed#[844C4EAE555D4548]) [n: c: s: r: x: t:] o.a.s.m.SolrMetricManager Closing metric reporters for registry=solr.node tag=null
2> 969715 INFO (TEST-TestSolrConfigHandler.testFailures-seed#[844C4EAE555D4548]) [n: c: s: r: x: t:] o.a.s.m.SolrMetricManager Closing metric reporters for registry=solr.jvm tag=null
2> 969720 INFO (TEST-TestSolrConfigHandler.testFailures-seed#[844C4EAE555D4548]) [n: c: s: r: x: t:] o.a.s.m.SolrMetricManager Closing metric reporters for registry=solr.jetty tag=null
2> 969722 INFO (TEST-TestSolrConfigHandler.testFailures-seed#[844C4EAE555D4548]) [n: c: s: r: x: t:] o.e.j.s.h.ContextHandler Stopped o.e.j.s.ServletContextHandler@1d8d534a{/solr,file:///home/jenkins/jenkins-slave/workspace/Solr/Solr-check-9.7/solr/core/build/tmp/tests-cwd/,STOPPED}
2> 969723 INFO (TEST-TestSolrConfigHandler.testFailures-seed#[844C4EAE555D4548]) [n: c: s: r: x: t:] o.a.s.SolrTestCaseJ4 ###Ending testFailures
2> 969728 INFO (TEST-TestSolrConfigHandler.testReqHandlerAPIs-seed#[844C4EAE555D4548]) [n: c: s: r: x: t:] o.a.s.SolrTestCaseJ4 ###Starting testReqHandlerAPIs
2> 969915 INFO (TEST-TestSolrConfigHandler.testReqHandlerAPIs-seed#[844C4EAE555D4548]) [n: c: s: r: x: t:] o.a.s.SolrTestCaseJ4 Writing core.properties file to /home/jenkins/jenkins-slave/workspace/Solr/Solr-check-9.7/solr/core/build/tmp/tests-tmp/org.apache.solr.core.TestSolrConfigHandler_844C4EAE555D4548-001/tempDir-015/cores/core
2> 969916 INFO (TEST-TestSolrConfigHandler.testReqHandlerAPIs-seed#[844C4EAE555D4548]) [n: c: s: r: x: t:] o.a.s.e.JettySolrRunner Start Jetty (configured port=0, binding port=0)
2> 969916 INFO (TEST-TestSolrConfigHandler.testReqHandlerAPIs-seed#[844C4EAE555D4548]) [n: c: s: r: x: t:] o.a.s.e.JettySolrRunner Trying to start Jetty on port 0 try number 2 ...
2> 969916 INFO (TEST-TestSolrConfigHandler.testReqHandlerAPIs-seed#[844C4EAE555D4548]) [n: c: s: r: x: t:] o.e.j.s.Server jetty-10.0.22; built: 2024-06-27T16:03:51.502Z; git: 5c8471e852d377fd726ad9b1692c35ffc5febb09; jvm 11.0.16.1+1
2> 969919 INFO (TEST-TestSolrConfigHandler.testReqHandlerAPIs-seed#[844C4EAE555D4548]) [n: c: s: r: x: t:] o.e.j.s.s.DefaultSessionIdManager Session workerName=node0
2> 969923 INFO (TEST-TestSolrConfigHandler.testReqHandlerAPIs-seed#[844C4EAE555D4548]) [n: c: s: r: x: t:] o.a.s.e.JettySolrRunner Jetty properties: {hostContext=/solr, configSetBaseDir=/home/jenkins/jenkins-slave/workspace/Solr/Solr-check-9.7/solr/core/build/tmp/tests-tmp/org.apache.solr.core.TestSolrConfigHandler_844C4EAE555D4548-001/tempDir-013, hostPort=34599, coreRootDirectory=/home/jenkins/jenkins-slave/workspace/Solr/Solr-check-9.7/solr/core/build/tmp/tests-tmp/org.apache.solr.core.TestSolrConfigHandler_844C4EAE555D4548-001/tempDir-015/cores}
2> 969923 ERROR (TEST-TestSolrConfigHandler.testReqHandlerAPIs-seed#[844C4EAE555D4548]) [n: c: s: r: x: t:] o.a.s.u.StartupLoggingUtils Missing Java Option solr.log.dir. Logging may be missing or incomplete.
2> 969924 INFO (TEST-TestSolrConfigHandler.testReqHandlerAPIs-seed#[844C4EAE555D4548]) [n: c: s: r: x: t:] o.a.s.s.CoreContainerProvider Using logger factory org.apache.logging.slf4j.Log4jLoggerFactory
2> 969924 INFO (TEST-TestSolrConfigHandler.testReqHandlerAPIs-seed#[844C4EAE555D4548]) [n: c: s: r: x: t:] o.a.s.s.CoreContainerProvider ___ _ Welcome to Apache Solr™ version 9.7.0
2> 969924 INFO (TEST-TestSolrConfigHandler.testReqHandlerAPIs-seed#[844C4EAE555D4548]) [n: c: s: r: x: t:] o.a.s.s.CoreContainerProvider / __| ___| |_ _ Starting in standalone mode on port null
2> 969924 INFO (TEST-TestSolrConfigHandler.testReqHandlerAPIs-seed#[844C4EAE555D4548]) [n: c: s: r: x: t:] o.a.s.s.CoreContainerProvider \__ \/ _ \ | '_| Install dir: /home/jenkins/jenkins-slave/workspace/Solr/Solr-check-9.7/solr
2> 969924 INFO (TEST-TestSolrConfigHandler.testReqHandlerAPIs-seed#[844C4EAE555D4548]) [n: c: s: r: x: t:] o.a.s.s.CoreContainerProvider |___/\___/_|_| Start time: 2024-09-05T08:02:28.156116Z
2> 969924 INFO (TEST-TestSolrConfigHandler.testReqHandlerAPIs-seed#[844C4EAE555D4548]) [n: c: s: r: x: t:] o.a.s.s.CoreContainerProvider Solr Home: /home/jenkins/jenkins-slave/workspace/Solr/Solr-check-9.7/solr/core/build/tmp/tests-tmp/org.apache.solr.core.TestSolrConfigHandler_844C4EAE555D4548-001/tempDir-013 (source: servlet config: solr.solr.home)
2> 969924 INFO (TEST-TestSolrConfigHandler.testReqHandlerAPIs-seed#[844C4EAE555D4548]) [n: c: s: r: x: t:] o.a.s.c.SolrXmlConfig Loading solr.xml from /home/jenkins/jenkins-slave/workspace/Solr/Solr-check-9.7/solr/core/build/tmp/tests-tmp/org.apache.solr.core.TestSolrConfigHandler_844C4EAE555D4548-001/tempDir-013/solr.xml
2> 970451 WARN (TEST-TestSolrConfigHandler.testReqHandlerAPIs-seed#[844C4EAE555D4548]) [n: c: s: r: x: t:] o.a.s.c.CoreContainer Not all security plugins configured! authentication=disabled authorization=disabled. Solr is only as secure as you make it. Consider configuring authentication/authorization before exposing Solr to users internal or external. See https://s.apache.org/solrsecurity for more info
2> 970473 INFO (TEST-TestSolrConfigHandler.testReqHandlerAPIs-seed#[844C4EAE555D4548]) [n: c: s: r: x: t:] o.a.s.c.CorePropertiesLocator Found 1 core definitions underneath /home/jenkins/jenkins-slave/workspace/Solr/Solr-check-9.7/solr/core/build/tmp/tests-tmp/org.apache.solr.core.TestSolrConfigHandler_844C4EAE555D4548-001/tempDir-015/cores
2> 970473 INFO (TEST-TestSolrConfigHandler.testReqHandlerAPIs-seed#[844C4EAE555D4548]) [n: c: s: r: x: t:] o.a.s.c.CorePropertiesLocator Cores are: [collection1]
2> 970477 INFO (coreLoadExecutor-14715-thread-1) [n: c: s: r: x:collection1 t:] o.a.s.c.SolrResourceLoader Added 2 libs to classloader, from paths: [/home/jenkins/jenkins-slave/workspace/Solr/Solr-check-9.7/solr/core/build/tmp/tests-tmp/org.apache.solr.core.TestSolrConfigHandler_844C4EAE555D4548-001/tempDir-013/collection1/lib, /home/jenkins/jenkins-slave/workspace/Solr/Solr-check-9.7/solr/core/build/tmp/tests-tmp/org.apache.solr.core.TestSolrConfigHandler_844C4EAE555D4548-001/tempDir-013/collection1/lib/classes]
2> 970492 INFO (coreLoadExecutor-14715-thread-1) [n: c: s: r: x:collection1 t:] o.a.s.c.SolrConfig Using Lucene MatchVersion: 9.11.1
2> 970493 INFO (coreLoadExecutor-14715-thread-1) [n: c: s: r: x:collection1 t:] o.a.s.s.ManagedIndexSchemaFactory The schema is configured as managed, but managed schema resource managed-schema.xml not found - loading non-managed schema schema-rest.xml instead
2> 970495 INFO (coreLoadExecutor-14715-thread-1) [n: c: s: r: x:collection1 t:] o.a.s.s.IndexSchema Schema name=test-rest
2> 970497 WARN (coreLoadExecutor-14715-thread-1) [n: c: s: r: x:collection1 t:] o.a.s.s.IndexSchema Field title is not multivalued and destination for multiple copyFields (3)
2> 970510 INFO (coreLoadExecutor-14715-thread-1) [n: c: s: r: x:collection1 t:] o.a.s.r.RestManager Registered ManagedResource impl org.apache.solr.rest.schema.analysis.ManagedWordSetResource for path /schema/analysis/stopwords/german
2> 970511 INFO (coreLoadExecutor-14715-thread-1) [n: c: s: r: x:collection1 t:] o.a.s.r.RestManager Registered ManagedResource impl org.apache.solr.rest.schema.analysis.ManagedSynonymFilterFactory$SynonymManager for path /schema/analysis/synonyms/german
2> 970515 INFO (coreLoadExecutor-14715-thread-1) [n: c: s: r: x:collection1 t:] o.a.s.r.RestManager Registered ManagedResource impl org.apache.solr.rest.schema.analysis.ManagedWordSetResource for path /schema/analysis/stopwords/english
2> 970515 INFO (coreLoadExecutor-14715-thread-1) [n: c: s: r: x:collection1 t:] o.a.s.r.RestManager Registered ManagedResource impl org.apache.solr.rest.schema.analysis.ManagedSynonymGraphFilterFactory$SynonymManager for path /schema/analysis/synonyms/englishgraph
2> 970515 INFO (coreLoadExecutor-14715-thread-1) [n: c: s: r: x:collection1 t:] o.a.s.r.RestManager Added observer of type org.apache.solr.rest.schema.analysis.ManagedStopFilterFactory to existing ManagedResource /schema/analysis/stopwords/english
2> 970515 INFO (coreLoadExecutor-14715-thread-1) [n: c: s: r: x:collection1 t:] o.a.s.r.RestManager Added observer of type org.apache.solr.rest.schema.analysis.ManagedSynonymGraphFilterFactory to existing ManagedResource /schema/analysis/synonyms/englishgraph
2> 970518 INFO (coreLoadExecutor-14715-thread-1) [n: c: s: r: x:collection1 t:] o.a.s.r.RestManager Added observer of type org.apache.solr.rest.schema.analysis.ManagedStopFilterFactory to existing ManagedResource /schema/analysis/stopwords/german
2> 970518 INFO (coreLoadExecutor-14715-thread-1) [n: c: s: r: x:collection1 t:] o.a.s.r.RestManager Registered ManagedResource impl org.apache.solr.rest.schema.analysis.ManagedSynonymGraphFilterFactory$SynonymManager for path /schema/analysis/synonyms/germangraph
2> 970518 INFO (coreLoadExecutor-14715-thread-1) [n: c: s: r: x:collection1 t:] o.a.s.r.RestManager Added observer of type org.apache.solr.rest.schema.analysis.ManagedStopFilterFactory to existing ManagedResource /schema/analysis/stopwords/german
2> 970518 INFO (coreLoadExecutor-14715-thread-1) [n: c: s: r: x:collection1 t:] o.a.s.r.RestManager Added observer of type org.apache.solr.rest.schema.analysis.ManagedSynonymGraphFilterFactory to existing ManagedResource /schema/analysis/synonyms/germangraph
2> 970526 INFO (coreLoadExecutor-14715-thread-1) [n: c: s: r: x:collection1 t:] o.a.s.r.RestManager Added observer of type org.apache.solr.rest.schema.analysis.ManagedStopFilterFactory to existing ManagedResource /schema/analysis/stopwords/english
2> 970526 INFO (coreLoadExecutor-14715-thread-1) [n: c: s: r: x:collection1 t:] o.a.s.r.RestManager Registered ManagedResource impl org.apache.solr.rest.schema.analysis.ManagedSynonymFilterFactory$SynonymManager for path /schema/analysis/synonyms/english
2> 970526 INFO (coreLoadExecutor-14715-thread-1) [n: c: s: r: x:collection1 t:] o.a.s.s.IndexSchema Loaded schema test-rest/1.7 with uniqueid field id
2> 970533 INFO (TEST-TestSolrConfigHandler.testReqHandlerAPIs-seed#[844C4EAE555D4548]) [n: c: s: r: x: t:] o.a.s.j.SolrRequestAuthorizer Creating a new SolrRequestAuthorizer
2> 970534 INFO (coreLoadExecutor-14715-thread-1) [n: c: s: r: x:collection1 t:] o.a.s.r.RestManager Added observer of type org.apache.solr.rest.schema.analysis.ManagedStopFilterFactory to existing ManagedResource /schema/analysis/stopwords/english
2> 970535 INFO (coreLoadExecutor-14715-thread-1) [n: c: s: r: x:collection1 t:] o.a.s.r.RestManager Added observer of type org.apache.solr.rest.schema.analysis.ManagedSynonymFilterFactory to existing ManagedResource /schema/analysis/synonyms/english
2> 970535 INFO (coreLoadExecutor-14715-thread-1) [n: c: s: r: x:collection1 t:] o.a.s.r.RestManager Added observer of type org.apache.solr.rest.schema.analysis.ManagedStopFilterFactory to existing ManagedResource /schema/analysis/stopwords/german
2> 970535 INFO (coreLoadExecutor-14715-thread-1) [n: c: s: r: x:collection1 t:] o.a.s.r.RestManager Added observer of type org.apache.solr.rest.schema.analysis.ManagedSynonymFilterFactory to existing ManagedResource /schema/analysis/synonyms/german
2> 970535 INFO (coreLoadExecutor-14715-thread-1) [n: c: s: r: x:collection1 t:] o.a.s.r.RestManager Added observer of type org.apache.solr.rest.schema.analysis.ManagedStopFilterFactory to existing ManagedResource /schema/analysis/stopwords/english
2> 970535 INFO (coreLoadExecutor-14715-thread-1) [n: c: s: r: x:collection1 t:] o.a.s.r.RestManager Added observer of type org.apache.solr.rest.schema.analysis.ManagedSynonymGraphFilterFactory to existing ManagedResource /schema/analysis/synonyms/englishgraph
2> 970535 INFO (coreLoadExecutor-14715-thread-1) [n: c: s: r: x:collection1 t:] o.a.s.r.RestManager Added observer of type org.apache.solr.rest.schema.analysis.ManagedStopFilterFactory to existing ManagedResource /schema/analysis/stopwords/english
2> 970535 INFO (coreLoadExecutor-14715-thread-1) [n: c: s: r: x:collection1 t:] o.a.s.r.RestManager Added observer of type org.apache.solr.rest.schema.analysis.ManagedSynonymGraphFilterFactory to existing ManagedResource /schema/analysis/synonyms/englishgraph
2> 970535 INFO (coreLoadExecutor-14715-thread-1) [n: c: s: r: x:collection1 t:] o.a.s.r.RestManager Added observer of type org.apache.solr.rest.schema.analysis.ManagedStopFilterFactory to existing ManagedResource /schema/analysis/stopwords/german
2> 970535 INFO (coreLoadExecutor-14715-thread-1) [n: c: s: r: x:collection1 t:] o.a.s.r.RestManager Added observer of type org.apache.solr.rest.schema.analysis.ManagedSynonymGraphFilterFactory to existing ManagedResource /schema/analysis/synonyms/germangraph
2> 970535 INFO (coreLoadExecutor-14715-thread-1) [n: c: s: r: x:collection1 t:] o.a.s.r.RestManager Added observer of type org.apache.solr.rest.schema.analysis.ManagedStopFilterFactory to existing ManagedResource /schema/analysis/stopwords/german
2> 970535 INFO (coreLoadExecutor-14715-thread-1) [n: c: s: r: x:collection1 t:] o.a.s.r.RestManager Added observer of type org.apache.solr.rest.schema.analysis.ManagedSynonymGraphFilterFactory to existing ManagedResource /schema/analysis/synonyms/germangraph
2> 970537 INFO (coreLoadExecutor-14715-thread-1) [n: c: s: r: x:collection1 t:] o.a.s.s.ManagedIndexSchema Upgraded to managed schema at /home/jenkins/jenkins-slave/workspace/Solr/Solr-check-9.7/solr/core/build/tmp/tests-tmp/org.apache.solr.core.TestSolrConfigHandler_844C4EAE555D4548-001/tempDir-013/collection1/conf/managed-schema.xml
2> 970551 INFO (coreLoadExecutor-14715-thread-1) [n: c: s: r: x:collection1 t:] o.a.s.s.ManagedIndexSchemaFactory After upgrading to managed schema, renamed the non-managed schema /home/jenkins/jenkins-slave/workspace/Solr/Solr-check-9.7/solr/core/build/tmp/tests-tmp/org.apache.solr.core.TestSolrConfigHandler_844C4EAE555D4548-001/tempDir-013/collection1/conf/schema-rest.xml to /home/jenkins/jenkins-slave/workspace/Solr/Solr-check-9.7/solr/core/build/tmp/tests-tmp/org.apache.solr.core.TestSolrConfigHandler_844C4EAE555D4548-001/tempDir-013/collection1/conf/schema-rest.xml.bak
2> 970551 INFO (coreLoadExecutor-14715-thread-1) [n: c: s: r: x:collection1 t:] o.a.s.c.CoreContainer Creating SolrCore 'collection1' using configuration from configset /home/jenkins/jenkins-slave/workspace/Solr/Solr-check-9.7/solr/core/build/tmp/tests-tmp/org.apache.solr.core.TestSolrConfigHandler_844C4EAE555D4548-001/tempDir-013/collection1, trusted=true
2> 970551 INFO (coreLoadExecutor-14715-thread-1) [n: c: s: r: x:collection1 t:] o.a.s.c.SolrCore Opening new SolrCore at [/home/jenkins/jenkins-slave/workspace/Solr/Solr-check-9.7/solr/core/build/tmp/tests-tmp/org.apache.solr.core.TestSolrConfigHandler_844C4EAE555D4548-001/tempDir-015/cores/core], dataDir=[/home/jenkins/jenkins-slave/workspace/Solr/Solr-check-9.7/solr/core/build/tmp/tests-tmp/org.apache.solr.core.TestSolrConfigHandler_844C4EAE555D4548-001/tempDir-015/cores/core/data/]
2> 970552 INFO (TEST-TestSolrConfigHandler.testReqHandlerAPIs-seed#[844C4EAE555D4548]) [n: c: s: r: x: t:] o.e.j.s.h.ContextHandler Started o.e.j.s.ServletContextHandler@3bf307d7{/solr,file:///home/jenkins/jenkins-slave/workspace/Solr/Solr-check-9.7/solr/core/build/tmp/tests-cwd/,AVAILABLE}
2> 970552 INFO (TEST-TestSolrConfigHandler.testReqHandlerAPIs-seed#[844C4EAE555D4548]) [n: c: s: r: x: t:] o.e.j.s.AbstractConnector Started ServerConnector@6985d821{HTTP/1.1, (http/1.1, h2c)}{127.0.0.1:34599}
2> 970552 INFO (TEST-TestSolrConfigHandler.testReqHandlerAPIs-seed#[844C4EAE555D4548]) [n: c: s: r: x: t:] o.e.j.s.Server Started Server@309d00ee{STARTING}[10.0.22,sto=0] @970589ms
2> 970554 INFO (coreLoadExecutor-14715-thread-1) [n: c: s: r: x:collection1 t:] o.a.s.u.RandomMergePolicy RandomMergePolicy wrapping class org.apache.lucene.index.TieredMergePolicy: [TieredMergePolicy: maxMergeAtOnce=28, maxMergedSegmentMB=15.322406768798828, floorSegmentMB=0.7166070938110352, forceMergeDeletesPctAllowed=27.023885304380354, segmentsPerTier=30.0, maxCFSSegmentSizeMB=8.796093022208E12, noCFSRatio=0.0, deletesPctAllowed=22.641794116697632
2> 970584 WARN (coreLoadExecutor-14715-thread-1) [n: c: s: r: x:collection1 t:] o.a.s.c.RequestHandlers INVALID paramSet a in requestHandler {type = requestHandler,name = /dump,class = DumpRequestHandler,attributes = {initParams=a, name=/dump, registerPath=/solr,/v2, class=DumpRequestHandler},args = {defaults={a=A, b=B}}}
2> 970617 INFO (coreLoadExecutor-14715-thread-1) [n: c: s: r: x:collection1 t:] o.a.s.j.SolrRequestAuthorizer Creating a new SolrRequestAuthorizer
2> 970625 INFO (coreLoadExecutor-14715-thread-1) [n: c: s: r: x:collection1 t:] o.a.s.u.CommitTracker Hard AutoCommit: disabled
2> 970625 INFO (coreLoadExecutor-14715-thread-1) [n: c: s: r: x:collection1 t:] o.a.s.u.CommitTracker Soft AutoCommit: disabled
2> 970626 INFO (coreLoadExecutor-14715-thread-1) [n: c: s: r: x:collection1 t:] o.a.s.u.RandomMergePolicy RandomMergePolicy wrapping class org.apache.lucene.index.TieredMergePolicy: [TieredMergePolicy: maxMergeAtOnce=34, maxMergedSegmentMB=64.88883781433105, floorSegmentMB=0.5020742416381836, forceMergeDeletesPctAllowed=15.642460556380723, segmentsPerTier=13.0, maxCFSSegmentSizeMB=8.796093022208E12, noCFSRatio=0.0, deletesPctAllowed=21.149479459234783
2> 970627 INFO (coreLoadExecutor-14715-thread-1) [n: c: s: r: x:collection1 t:] o.a.s.r.ManagedResourceStorage File-based storage initialized to use dir: /home/jenkins/jenkins-slave/workspace/Solr/Solr-check-9.7/solr/core/build/tmp/tests-tmp/org.apache.solr.core.TestSolrConfigHandler_844C4EAE555D4548-001/tempDir-013/collection1/conf
2> 970627 WARN (coreLoadExecutor-14715-thread-1) [n: c: s: r: x:collection1 t:] o.a.s.r.ManagedResource No stored data found for /schema/analysis/stopwords/english
2> 970627 INFO (coreLoadExecutor-14715-thread-1) [n: c: s: r: x:collection1 t:] o.a.s.r.ManagedResourceStorage Saved JSON object to path _schema_analysis_stopwords_english.json using file:dir=/home/jenkins/jenkins-slave/workspace/Solr/Solr-check-9.7/solr/core/build/tmp/tests-tmp/org.apache.solr.core.TestSolrConfigHandler_844C4EAE555D4548-001/tempDir-013/collection1/conf
2> 970627 INFO (coreLoadExecutor-14715-thread-1) [n: c: s: r: x:collection1 t:] o.a.s.r.s.a.ManagedWordSetResource Loaded 0 words for /schema/analysis/stopwords/english
2> 970628 INFO (coreLoadExecutor-14715-thread-1) [n: c: s: r: x:collection1 t:] o.a.s.r.ManagedResource Notified 3 observers of /schema/analysis/stopwords/english
2> 970628 WARN (coreLoadExecutor-14715-thread-1) [n: c: s: r: x:collection1 t:] o.a.s.r.ManagedResource No stored data found for /schema/analysis/stopwords/german
2> 970628 INFO (coreLoadExecutor-14715-thread-1) [n: c: s: r: x:collection1 t:] o.a.s.r.ManagedResourceStorage Saved JSON object to path _schema_analysis_stopwords_german.json using file:dir=/home/jenkins/jenkins-slave/workspace/Solr/Solr-check-9.7/solr/core/build/tmp/tests-tmp/org.apache.solr.core.TestSolrConfigHandler_844C4EAE555D4548-001/tempDir-013/collection1/conf
2> 970628 INFO (coreLoadExecutor-14715-thread-1) [n: c: s: r: x:collection1 t:] o.a.s.r.s.a.ManagedWordSetResource Loaded 0 words for /schema/analysis/stopwords/german
2> 970628 INFO (coreLoadExecutor-14715-thread-1) [n: c: s: r: x:collection1 t:] o.a.s.r.ManagedResource Notified 3 observers of /schema/analysis/stopwords/german
2> 970628 WARN (coreLoadExecutor-14715-thread-1) [n: c: s: r: x:collection1 t:] o.a.s.r.ManagedResource No stored data found for /schema/analysis/synonyms/english
2> 970628 INFO (coreLoadExecutor-14715-thread-1) [n: c: s: r: x:collection1 t:] o.a.s.r.s.a.ManagedSynonymFilterFactory Loaded 0 synonym mappings for /schema/analysis/synonyms/english
2> 970628 INFO (coreLoadExecutor-14715-thread-1) [n: c: s: r: x:collection1 t:] o.a.s.r.ManagedResource Notified 1 observers of /schema/analysis/synonyms/english
2> 970629 WARN (coreLoadExecutor-14715-thread-1) [n: c: s: r: x:collection1 t:] o.a.s.r.ManagedResource No stored data found for /schema/analysis/synonyms/englishgraph
2> 970629 INFO (coreLoadExecutor-14715-thread-1) [n: c: s: r: x:collection1 t:] o.a.s.r.s.a.ManagedSynonymGraphFilterFactory Loaded 0 synonym mappings for /schema/analysis/synonyms/englishgraph
2> 970629 INFO (coreLoadExecutor-14715-thread-1) [n: c: s: r: x:collection1 t:] o.a.s.r.ManagedResource Notified 2 observers of /schema/analysis/synonyms/englishgraph
2> 970629 WARN (coreLoadExecutor-14715-thread-1) [n: c: s: r: x:collection1 t:] o.a.s.r.ManagedResource No stored data found for /schema/analysis/synonyms/german
2> 970629 INFO (coreLoadExecutor-14715-thread-1) [n: c: s: r: x:collection1 t:] o.a.s.r.s.a.ManagedSynonymFilterFactory Loaded 0 synonym mappings for /schema/analysis/synonyms/german
2> 970629 INFO (coreLoadExecutor-14715-thread-1) [n: c: s: r: x:collection1 t:] o.a.s.r.ManagedResource Notified 1 observers of /schema/analysis/synonyms/german
2> 970629 WARN (coreLoadExecutor-14715-thread-1) [n: c: s: r: x:collection1 t:] o.a.s.r.ManagedResource No stored data found for /schema/analysis/synonyms/germangraph
2> 970629 INFO (coreLoadExecutor-14715-thread-1) [n: c: s: r: x:collection1 t:] o.a.s.r.s.a.ManagedSynonymGraphFilterFactory Loaded 0 synonym mappings for /schema/analysis/synonyms/germangraph
2> 970629 INFO (coreLoadExecutor-14715-thread-1) [n: c: s: r: x:collection1 t:] o.a.s.r.ManagedResource Notified 2 observers of /schema/analysis/synonyms/germangraph
2> 970630 INFO (coreLoadExecutor-14715-thread-1) [n: c: s: r: x:collection1 t:] o.a.s.h.ReplicationHandler Commits will be reserved for 10000 ms
2> 970630 INFO (TEST-TestSolrConfigHandler.testReqHandlerAPIs-seed#[844C4EAE555D4548]) [n: c: s: r: x: t:] o.a.s.u.SolrJettyTestRule Jetty Assigned Port#34599
2> 970631 INFO (searcherExecutor-14717-thread-1-processing-collection1) [n: c: s: r: x:collection1 t:] o.a.s.c.SolrCore Registered new searcher autowarm time: 0 ms
2> 970635 INFO (TEST-TestSolrConfigHandler.testReqHandlerAPIs-seed#[844C4EAE555D4548]) [n: c: s: r: x: t:] o.a.s.c.TestSolrConfigHandler going to send config command. path /config , payload: {
2> 'create-requesthandler' : { 'name' : '/x', 'class': 'org.apache.solr.handler.DumpRequestHandler' , 'startup' : 'lazy'}
2> }
2> 970637 INFO (qtp885513647-18747-null-15728) [n: c: s: r: x:collection1 t:null-15728] o.a.s.c.SolrResourceLoader Written conf file configoverlay.json
2> 970651 INFO (qtp885513647-18747-null-15728) [n: c: s: r: x:collection1 t:null-15728] o.a.s.c.SolrResourceLoader Added 2 libs to classloader, from paths: [/home/jenkins/jenkins-slave/workspace/Solr/Solr-check-9.7/solr/core/build/tmp/tests-tmp/org.apache.solr.core.TestSolrConfigHandler_844C4EAE555D4548-001/tempDir-013/collection1/lib, /home/jenkins/jenkins-slave/workspace/Solr/Solr-check-9.7/solr/core/build/tmp/tests-tmp/org.apache.solr.core.TestSolrConfigHandler_844C4EAE555D4548-001/tempDir-013/collection1/lib/classes]
2> 970666 INFO (qtp885513647-18747-null-15728) [n: c: s: r: x:collection1 t:null-15728] o.a.s.c.SolrConfig Using Lucene MatchVersion: 9.11.1
2> 970671 INFO (qtp885513647-18747-null-15728) [n: c: s: r: x:collection1 t:null-15728] o.a.s.s.IndexSchema Schema name=test-rest
2> 970675 WARN (qtp885513647-18747-null-15728) [n: c: s: r: x:collection1 t:null-15728] o.a.s.s.IndexSchema Field title is not multivalued and destination for multiple copyFields (3)
2> 970677 INFO (qtp885513647-18747-null-15728) [n: c: s: r: x:collection1 t:null-15728] o.a.s.r.RestManager Registered ManagedResource impl org.apache.solr.rest.schema.analysis.ManagedWordSetResource for path /schema/analysis/stopwords/german
2> 970677 INFO (qtp885513647-18747-null-15728) [n: c: s: r: x:collection1 t:null-15728] o.a.s.r.RestManager Registered ManagedResource impl org.apache.solr.rest.schema.analysis.ManagedSynonymFilterFactory$SynonymManager for path /schema/analysis/synonyms/german
2> 970680 INFO (qtp885513647-18747-null-15728) [n: c: s: r: x:collection1 t:null-15728] o.a.s.r.RestManager Registered ManagedResource impl org.apache.solr.rest.schema.analysis.ManagedWordSetResource for path /schema/analysis/stopwords/english
2> 970680 INFO (qtp885513647-18747-null-15728) [n: c: s: r: x:collection1 t:null-15728] o.a.s.r.RestManager Registered ManagedResource impl org.apache.solr.rest.schema.analysis.ManagedSynonymGraphFilterFactory$SynonymManager for path /schema/analysis/synonyms/englishgraph
2> 970680 INFO (qtp885513647-18747-null-15728) [n: c: s: r: x:collection1 t:null-15728] o.a.s.r.RestManager Added observer of type org.apache.solr.rest.schema.analysis.ManagedStopFilterFactory to existing ManagedResource /schema/analysis/stopwords/english
2> 970680 INFO (qtp885513647-18747-null-15728) [n: c: s: r: x:collection1 t:null-15728] o.a.s.r.RestManager Added observer of type org.apache.solr.rest.schema.analysis.ManagedSynonymGraphFilterFactory to existing ManagedResource /schema/analysis/synonyms/englishgraph
2> 970680 INFO (qtp885513647-18747-null-15728) [n: c: s: r: x:collection1 t:null-15728] o.a.s.r.RestManager Added observer of type org.apache.solr.rest.schema.analysis.ManagedStopFilterFactory to existing ManagedResource /schema/analysis/stopwords/german
2> 970681 INFO (qtp885513647-18747-null-15728) [n: c: s: r: x:collection1 t:null-15728] o.a.s.r.RestManager Registered ManagedResource impl org.apache.solr.rest.schema.analysis.ManagedSynonymGraphFilterFactory$SynonymManager for path /schema/analysis/synonyms/germangraph
2> 970681 INFO (qtp885513647-18747-null-15728) [n: c: s: r: x:collection1 t:null-15728] o.a.s.r.RestManager Added observer of type org.apache.solr.rest.schema.analysis.ManagedStopFilterFactory to existing ManagedResource /schema/analysis/stopwords/german
2> 970681 INFO (qtp885513647-18747-null-15728) [n: c: s: r: x:collection1 t:null-15728] o.a.s.r.RestManager Added observer of type org.apache.solr.rest.schema.analysis.ManagedSynonymGraphFilterFactory to existing ManagedResource /schema/analysis/synonyms/germangraph
2> 970687 INFO (qtp885513647-18747-null-15728) [n: c: s: r: x:collection1 t:null-15728] o.a.s.r.RestManager Added observer of type org.apache.solr.rest.schema.analysis.ManagedStopFilterFactory to existing ManagedResource /schema/analysis/stopwords/english
2> 970687 INFO (qtp885513647-18747-null-15728) [n: c: s: r: x:collection1 t:null-15728] o.a.s.r.RestManager Registered ManagedResource impl org.apache.solr.rest.schema.analysis.ManagedSynonymFilterFactory$SynonymManager for path /schema/analysis/synonyms/english
2> 970687 INFO (qtp885513647-18747-null-15728) [n: c: s: r: x:collection1 t:null-15728] o.a.s.s.IndexSchema Loaded schema test-rest/1.7 with uniqueid field id
2> 970689 INFO (qtp885513647-18747-null-15728) [n: c: s: r: x:collection1 t:null-15728] o.a.s.r.RestManager Added observer of type org.apache.solr.rest.schema.analysis.ManagedStopFilterFactory to existing ManagedResource /schema/analysis/stopwords/german
2> 970689 INFO (qtp885513647-18747-null-15728) [n: c: s: r: x:collection1 t:null-15728] o.a.s.r.RestManager Added observer of type org.apache.solr.rest.schema.analysis.ManagedSynonymFilterFactory to existing ManagedResource /schema/analysis/synonyms/german
2> 970689 INFO (qtp885513647-18747-null-15728) [n: c: s: r: x:collection1 t:null-15728] o.a.s.r.RestManager Added observer of type org.apache.solr.rest.schema.analysis.ManagedStopFilterFactory to existing ManagedResource /schema/analysis/stopwords/english
2> 970689 INFO (qtp885513647-18747-null-15728) [n: c: s: r: x:collection1 t:null-15728] o.a.s.r.RestManager Added observer of type org.apache.solr.rest.schema.analysis.ManagedSynonymFilterFactory to existing ManagedResource /schema/analysis/synonyms/english
2> 970689 INFO (qtp885513647-18747-null-15728) [n: c: s: r: x:collection1 t:null-15728] o.a.s.r.RestManager Added observer of type org.apache.solr.rest.schema.analysis.ManagedStopFilterFactory to existing ManagedResource /schema/analysis/stopwords/german
2> 970689 INFO (qtp885513647-18747-null-15728) [n: c: s: r: x:collection1 t:null-15728] o.a.s.r.RestManager Added observer of type org.apache.solr.rest.schema.analysis.ManagedSynonymGraphFilterFactory to existing ManagedResource /schema/analysis/synonyms/germangraph
2> 970689 INFO (qtp885513647-18747-null-15728) [n: c: s: r: x:collection1 t:null-15728] o.a.s.r.RestManager Added observer of type org.apache.solr.rest.schema.analysis.ManagedStopFilterFactory to existing ManagedResource /schema/analysis/stopwords/german
2> 970689 INFO (qtp885513647-18747-null-15728) [n: c: s: r: x:collection1 t:null-15728] o.a.s.r.RestManager Added observer of type org.apache.solr.rest.schema.analysis.ManagedSynonymGraphFilterFactory to existing ManagedResource /schema/analysis/synonyms/germangraph
2> 970690 INFO (qtp885513647-18747-null-15728) [n: c: s: r: x:collection1 t:null-15728] o.a.s.r.RestManager Added observer of type org.apache.solr.rest.schema.analysis.ManagedStopFilterFactory to existing ManagedResource /schema/analysis/stopwords/english
2> 970690 INFO (qtp885513647-18747-null-15728) [n: c: s: r: x:collection1 t:null-15728] o.a.s.r.RestManager Added observer of type org.apache.solr.rest.schema.analysis.ManagedSynonymGraphFilterFactory to existing ManagedResource /schema/analysis/synonyms/englishgraph
2> 970690 INFO (qtp885513647-18747-null-15728) [n: c: s: r: x:collection1 t:null-15728] o.a.s.r.RestManager Added observer of type org.apache.solr.rest.schema.analysis.ManagedStopFilterFactory to existing ManagedResource /schema/analysis/stopwords/english
2> 970690 INFO (qtp885513647-18747-null-15728) [n: c: s: r: x:collection1 t:null-15728] o.a.s.r.RestManager Added observer of type org.apache.solr.rest.schema.analysis.ManagedSynonymGraphFilterFactory to existing ManagedResource /schema/analysis/synonyms/englishgraph
2> 970699 INFO (qtp885513647-18747-null-15728) [n: c: s: r: x:collection1 t:null-15728] o.a.s.c.CoreContainer Reloading SolrCore 'collection1' using configuration from configset /home/jenkins/jenkins-slave/workspace/Solr/Solr-check-9.7/solr/core/build/tmp/tests-tmp/org.apache.solr.core.TestSolrConfigHandler_844C4EAE555D4548-001/tempDir-013/collection1
2> 971144 INFO (qtp885513647-18747-null-15728) [n: c: s: r: x:collection1 t:null-15728] o.a.s.c.SolrCore Opening new SolrCore at [/home/jenkins/jenkins-slave/workspace/Solr/Solr-check-9.7/solr/core/build/tmp/tests-tmp/org.apache.solr.core.TestSolrConfigHandler_844C4EAE555D4548-001/tempDir-015/cores/core], dataDir=[/home/jenkins/jenkins-slave/workspace/Solr/Solr-check-9.7/solr/core/build/tmp/tests-tmp/org.apache.solr.core.TestSolrConfigHandler_844C4EAE555D4548-001/tempDir-015/cores/core/data/]
2> 971146 WARN (qtp885513647-18747-null-15728) [n: c: s: r: x:collection1 t:null-15728] o.a.s.c.RequestHandlers INVALID paramSet a in requestHandler {type = requestHandler,name = /dump,class = DumpRequestHandler,attributes = {initParams=a, name=/dump, registerPath=/solr,/v2, class=DumpRequestHandler},args = {defaults={a=A, b=B}}}
2> 971157 INFO (qtp885513647-18747-null-15728) [n: c: s: r: x:collection1 t:null-15728] o.a.s.u.CommitTracker Hard AutoCommit: disabled
2> 971157 INFO (qtp885513647-18747-null-15728) [n: c: s: r: x:collection1 t:null-15728] o.a.s.u.CommitTracker Soft AutoCommit: disabled
2> 971158 INFO (qtp885513647-18747-null-15728) [n: c: s: r: x:collection1 t:null-15728] o.a.s.r.ManagedResourceStorage File-based storage initialized to use dir: /home/jenkins/jenkins-slave/workspace/Solr/Solr-check-9.7/solr/core/build/tmp/tests-tmp/org.apache.solr.core.TestSolrConfigHandler_844C4EAE555D4548-001/tempDir-013/collection1/conf
2> 971158 INFO (qtp885513647-18747-null-15728) [n: c: s: r: x:collection1 t:null-15728] o.a.s.r.ManagedResourceStorage Loaded LinkedHashMap at path _schema_analysis_stopwords_english.json using file:dir=/home/jenkins/jenkins-slave/workspace/Solr/Solr-check-9.7/solr/core/build/tmp/tests-tmp/org.apache.solr.core.TestSolrConfigHandler_844C4EAE555D4548-001/tempDir-013/collection1/conf
2> 971158 INFO (qtp885513647-18747-null-15728) [n: c: s: r: x:collection1 t:null-15728] o.a.s.r.ManagedResource Loaded initArgs {ignoreCase=false} for /schema/analysis/stopwords/english
2> 971158 INFO (qtp885513647-18747-null-15728) [n: c: s: r: x:collection1 t:null-15728] o.a.s.r.s.a.ManagedWordSetResource Loaded 0 words for /schema/analysis/stopwords/english
2> 971158 INFO (qtp885513647-18747-null-15728) [n: c: s: r: x:collection1 t:null-15728] o.a.s.r.ManagedResource Notified 3 observers of /schema/analysis/stopwords/english
2> 971159 INFO (qtp885513647-18747-null-15728) [n: c: s: r: x:collection1 t:null-15728] o.a.s.r.ManagedResourceStorage Loaded LinkedHashMap at path _schema_analysis_stopwords_german.json using file:dir=/home/jenkins/jenkins-slave/workspace/Solr/Solr-check-9.7/solr/core/build/tmp/tests-tmp/org.apache.solr.core.TestSolrConfigHandler_844C4EAE555D4548-001/tempDir-013/collection1/conf
2> 971159 INFO (qtp885513647-18747-null-15728) [n: c: s: r: x:collection1 t:null-15728] o.a.s.r.ManagedResource Loaded initArgs {ignoreCase=false} for /schema/analysis/stopwords/german
2> 971159 INFO (qtp885513647-18747-null-15728) [n: c: s: r: x:collection1 t:null-15728] o.a.s.r.s.a.ManagedWordSetResource Loaded 0 words for /schema/analysis/stopwords/german
2> 971159 INFO (qtp885513647-18747-null-15728) [n: c: s: r: x:collection1 t:null-15728] o.a.s.r.ManagedResource Notified 3 observers of /schema/analysis/stopwords/german
2> 971159 WARN (qtp885513647-18747-null-15728) [n: c: s: r: x:collection1 t:null-15728] o.a.s.r.ManagedResource No stored data found for /schema/analysis/synonyms/english
2> 971159 INFO (qtp885513647-18747-null-15728) [n: c: s: r: x:collection1 t:null-15728] o.a.s.r.s.a.ManagedSynonymFilterFactory Loaded 0 synonym mappings for /schema/analysis/synonyms/english
2> 971159 INFO (qtp885513647-18747-null-15728) [n: c: s: r: x:collection1 t:null-15728] o.a.s.r.ManagedResource Notified 1 observers of /schema/analysis/synonyms/english
2> 971159 WARN (qtp885513647-18747-null-15728) [n: c: s: r: x:collection1 t:null-15728] o.a.s.r.ManagedResource No stored data found for /schema/analysis/synonyms/englishgraph
2> 971159 INFO (qtp885513647-18747-null-15728) [n: c: s: r: x:collection1 t:null-15728] o.a.s.r.s.a.ManagedSynonymGraphFilterFactory Loaded 0 synonym mappings for /schema/analysis/synonyms/englishgraph
2> 971159 INFO (qtp885513647-18747-null-15728) [n: c: s: r: x:collection1 t:null-15728] o.a.s.r.ManagedResource Notified 2 observers of /schema/analysis/synonyms/englishgraph
2> 971159 WARN (qtp885513647-18747-null-15728) [n: c: s: r: x:collection1 t:null-15728] o.a.s.r.ManagedResource No stored data found for /schema/analysis/synonyms/german
2> 971159 INFO (qtp885513647-18747-null-15728) [n: c: s: r: x:collection1 t:null-15728] o.a.s.r.s.a.ManagedSynonymFilterFactory Loaded 0 synonym mappings for /schema/analysis/synonyms/german
2> 971159 INFO (qtp885513647-18747-null-15728) [n: c: s: r: x:collection1 t:null-15728] o.a.s.r.ManagedResource Notified 1 observers of /schema/analysis/synonyms/german
2> 971160 WARN (qtp885513647-18747-null-15728) [n: c: s: r: x:collection1 t:null-15728] o.a.s.r.ManagedResource No stored data found for /schema/analysis/synonyms/germangraph
2> 971160 INFO (qtp885513647-18747-null-15728) [n: c: s: r: x:collection1 t:null-15728] o.a.s.r.s.a.ManagedSynonymGraphFilterFactory Loaded 0 synonym mappings for /schema/analysis/synonyms/germangraph
2> 971160 INFO (qtp885513647-18747-null-15728) [n: c: s: r: x:collection1 t:null-15728] o.a.s.r.ManagedResource Notified 2 observers of /schema/analysis/synonyms/germangraph
2> 971160 INFO (qtp885513647-18747-null-15728) [n: c: s: r: x:collection1 t:null-15728] o.a.s.h.ReplicationHandler Commits will be reserved for 10000 ms
2> 971160 INFO (qtp885513647-18747-null-15728) [n: c: s: r: x:collection1 t:null-15728] o.a.s.u.RandomMergePolicy RandomMergePolicy wrapping class org.apache.lucene.index.TieredMergePolicy: [TieredMergePolicy: maxMergeAtOnce=28, maxMergedSegmentMB=15.322406768798828, floorSegmentMB=0.7166070938110352, forceMergeDeletesPctAllowed=27.023885304380354, segmentsPerTier=30.0, maxCFSSegmentSizeMB=8.796093022208E12, noCFSRatio=0.0, deletesPctAllowed=22.641794116697632
2> 971161 INFO (qtp885513647-18747-null-15728) [n: c: s: r: x:collection1 t:null-15728] o.a.s.u.DefaultSolrCoreState New IndexWriter is ready to be used.
2> 971164 INFO (searcherExecutor-14722-thread-1-processing-collection1 null-15728) [n: c: s: r: x:collection1 t:null-15728] o.a.s.c.SolrCore Registered new searcher autowarm time: 0 ms
2> 971164 INFO (qtp885513647-18747-null-15728) [n: c: s: r: x: t:null-15728] o.a.s.h.SolrConfigHandler Executed config commands successfully and persisted to File System [{"create-requesthandler":{
2> "name":"/x",
2> "class":"org.apache.solr.handler.DumpRequestHandler",
2> "startup":"lazy"}}]
2> 971164 INFO (qtp885513647-18747-null-15728) [n: c: s: r: x: t:null-15728] o.a.s.c.S.Request webapp=/solr path=/config params={} status=0 QTime=528
2> 971164 INFO (qtp885513647-18747-null-15728) [n: c: s: r: x: t:null-15728] o.a.s.c.SolrCore CLOSING SolrCore org.apache.solr.core.SolrCore@412a3195 collection1
2> 971164 INFO (qtp885513647-18747-null-15728) [n: c: s: r: x: t:null-15728] o.a.s.m.SolrMetricManager Closing metric reporters for registry=solr.core.collection1 tag=SolrCore@412a3195
2> 971166 INFO (searcherExecutor-14722-thread-1-processing-collection1 null-15728) [n: c: s: r: x:collection1 t:null-15728] o.a.s.c.SolrCore Registered new searcher autowarm time: 0 ms
2> 971173 INFO (qtp885513647-18747-null-15729) [n: c: s: r: x:collection1 t:null-15729] o.a.s.c.S.Request webapp=/solr path=/config/overlay params={} status=0 QTime=0
2> 971174 INFO (TEST-TestSolrConfigHandler.testReqHandlerAPIs-seed#[844C4EAE555D4548]) [n: c: s: r: x: t:] o.a.s.c.TestSolrConfigHandler going to send config command. path /config , payload: {
2> 'update-requesthandler' : { 'name' : '/x', 'class': 'org.apache.solr.handler.DumpRequestHandler' ,registerPath :'/solr,/v2', 'startup' : 'lazy' , 'a':'b' , 'defaults': {'def_a':'def A val', 'multival':['a','b','c']}}
2> }
2> 971174 INFO (qtp885513647-18747-null-15730) [n: c: s: r: x:collection1 t:null-15730] o.a.s.c.SolrResourceLoader Written conf file configoverlay.json
2> 971187 INFO (qtp885513647-18747-null-15730) [n: c: s: r: x:collection1 t:null-15730] o.a.s.c.SolrResourceLoader Added 2 libs to classloader, from paths: [/home/jenkins/jenkins-slave/workspace/Solr/Solr-check-9.7/solr/core/build/tmp/tests-tmp/org.apache.solr.core.TestSolrConfigHandler_844C4EAE555D4548-001/tempDir-013/collection1/lib, /home/jenkins/jenkins-slave/workspace/Solr/Solr-check-9.7/solr/core/build/tmp/tests-tmp/org.apache.solr.core.TestSolrConfigHandler_844C4EAE555D4548-001/tempDir-013/collection1/lib/classes]
2> 971203 INFO (qtp885513647-18747-null-15730) [n: c: s: r: x:collection1 t:null-15730] o.a.s.c.SolrConfig Using Lucene MatchVersion: 9.11.1
2> 971207 INFO (qtp885513647-18747-null-15730) [n: c: s: r: x:collection1 t:null-15730] o.a.s.s.IndexSchema Schema name=test-rest
2> 971210 WARN (qtp885513647-18747-null-15730) [n: c: s: r: x:collection1 t:null-15730] o.a.s.s.IndexSchema Field title is not multivalued and destination for multiple copyFields (3)
2> 971212 INFO (qtp885513647-18747-null-15730) [n: c: s: r: x:collection1 t:null-15730] o.a.s.r.RestManager Registered ManagedResource impl org.apache.solr.rest.schema.analysis.ManagedWordSetResource for path /schema/analysis/stopwords/german
2> 971212 INFO (qtp885513647-18747-null-15730) [n: c: s: r: x:collection1 t:null-15730] o.a.s.r.RestManager Registered ManagedResource impl org.apache.solr.rest.schema.analysis.ManagedSynonymFilterFactory$SynonymManager for path /schema/analysis/synonyms/german
2> 971214 INFO (qtp885513647-18747-null-15730) [n: c: s: r: x:collection1 t:null-15730] o.a.s.r.RestManager Registered ManagedResource impl org.apache.solr.rest.schema.analysis.ManagedWordSetResource for path /schema/analysis/stopwords/english
2> 971214 INFO (qtp885513647-18747-null-15730) [n: c: s: r: x:collection1 t:null-15730] o.a.s.r.RestManager Registered ManagedResource impl org.apache.solr.rest.schema.analysis.ManagedSynonymGraphFilterFactory$SynonymManager for path /schema/analysis/synonyms/englishgraph
2> 971214 INFO (qtp885513647-18747-null-15730) [n: c: s: r: x:collection1 t:null-15730] o.a.s.r.RestManager Added observer of type org.apache.solr.rest.schema.analysis.ManagedStopFilterFactory to existing ManagedResource /schema/analysis/stopwords/english
2> 971214 INFO (qtp885513647-18747-null-15730) [n: c: s: r: x:collection1 t:null-15730] o.a.s.r.RestManager Added observer of type org.apache.solr.rest.schema.analysis.ManagedSynonymGraphFilterFactory to existing ManagedResource /schema/analysis/synonyms/englishgraph
2> 971215 INFO (qtp885513647-18747-null-15730) [n: c: s: r: x:collection1 t:null-15730] o.a.s.r.RestManager Added observer of type org.apache.solr.rest.schema.analysis.ManagedStopFilterFactory to existing ManagedResource /schema/analysis/stopwords/german
2> 971215 INFO (qtp885513647-18747-null-15730) [n: c: s: r: x:collection1 t:null-15730] o.a.s.r.RestManager Registered ManagedResource impl org.apache.solr.rest.schema.analysis.ManagedSynonymGraphFilterFactory$SynonymManager for path /schema/analysis/synonyms/germangraph
2> 971215 INFO (qtp885513647-18747-null-15730) [n: c: s: r: x:collection1 t:null-15730] o.a.s.r.RestManager Added observer of type org.apache.solr.rest.schema.analysis.ManagedStopFilterFactory to existing ManagedResource /schema/analysis/stopwords/german
2> 971215 INFO (qtp885513647-18747-null-15730) [n: c: s: r: x:collection1 t:null-15730] o.a.s.r.RestManager Added observer of type org.apache.solr.rest.schema.analysis.ManagedSynonymGraphFilterFactory to existing ManagedResource /schema/analysis/synonyms/germangraph
2> 971220 INFO (qtp885513647-18747-null-15730) [n: c: s: r: x:collection1 t:null-15730] o.a.s.r.RestManager Added observer of type org.apache.solr.rest.schema.analysis.ManagedStopFilterFactory to existing ManagedResource /schema/analysis/stopwords/english
2> 971220 INFO (qtp885513647-18747-null-15730) [n: c: s: r: x:collection1 t:null-15730] o.a.s.r.RestManager Registered ManagedResource impl org.apache.solr.rest.schema.analysis.ManagedSynonymFilterFactory$SynonymManager for path /schema/analysis/synonyms/english
2> 971220 INFO (qtp885513647-18747-null-15730) [n: c: s: r: x:collection1 t:null-15730] o.a.s.s.IndexSchema Loaded schema test-rest/1.7 with uniqueid field id
2> 971222 INFO (qtp885513647-18747-null-15730) [n: c: s: r: x:collection1 t:null-15730] o.a.s.r.RestManager Added observer of type org.apache.solr.rest.schema.analysis.ManagedStopFilterFactory to existing ManagedResource /schema/analysis/stopwords/german
2> 971222 INFO (qtp885513647-18747-null-15730) [n: c: s: r: x:collection1 t:null-15730] o.a.s.r.RestManager Added observer of type org.apache.solr.rest.schema.analysis.ManagedSynonymFilterFactory to existing ManagedResource /schema/analysis/synonyms/german
2> 971222 INFO (qtp885513647-18747-null-15730) [n: c: s: r: x:collection1 t:null-15730] o.a.s.r.RestManager Added observer of type org.apache.solr.rest.schema.analysis.ManagedStopFilterFactory to existing ManagedResource /schema/analysis/stopwords/english
2> 971222 INFO (qtp885513647-18747-null-15730) [n: c: s: r: x:collection1 t:null-15730] o.a.s.r.RestManager Added observer of type org.apache.solr.rest.schema.analysis.ManagedSynonymFilterFactory to existing ManagedResource /schema/analysis/synonyms/english
2> 971222 INFO (qtp885513647-18747-null-15730) [n: c: s: r: x:collection1 t:null-15730] o.a.s.r.RestManager Added observer of type org.apache.solr.rest.schema.analysis.ManagedStopFilterFactory to existing ManagedResource /schema/analysis/stopwords/german
2> 971222 INFO (qtp885513647-18747-null-15730) [n: c: s: r: x:collection1 t:null-15730] o.a.s.r.RestManager Added observer of type org.apache.solr.rest.schema.analysis.ManagedSynonymGraphFilterFactory to existing ManagedResource /schema/analysis/synonyms/germangraph
2> 971222 INFO (qtp885513647-18747-null-15730) [n: c: s: r: x:collection1 t:null-15730] o.a.s.r.RestManager Added observer of type org.apache.solr.rest.schema.analysis.ManagedStopFilterFactory to existing ManagedResource /schema/analysis/stopwords/german
2> 971222 INFO (qtp885513647-18747-null-15730) [n: c: s: r: x:collection1 t:null-15730] o.a.s.r.RestManager Added observer of type org.apache.solr.rest.schema.analysis.ManagedSynonymGraphFilterFactory to existing ManagedResource /schema/analysis/synonyms/germangraph
2> 971222 INFO (qtp885513647-18747-null-15730) [n: c: s: r: x:collection1 t:null-15730] o.a.s.r.RestManager Added observer of type org.apache.solr.rest.schema.analysis.ManagedStopFilterFactory to existing ManagedResource /schema/analysis/stopwords/english
2> 971223 INFO (qtp885513647-18747-null-15730) [n: c: s: r: x:collection1 t:null-15730] o.a.s.r.RestManager Added observer of type org.apache.solr.rest.schema.analysis.ManagedSynonymGraphFilterFactory to existing ManagedResource /schema/analysis/synonyms/englishgraph
2> 971223 INFO (qtp885513647-18747-null-15730) [n: c: s: r: x:collection1 t:null-15730] o.a.s.r.RestManager Added observer of type org.apache.solr.rest.schema.analysis.ManagedStopFilterFactory to existing ManagedResource /schema/analysis/stopwords/english
2> 971223 INFO (qtp885513647-18747-null-15730) [n: c: s: r: x:collection1 t:null-15730] o.a.s.r.RestManager Added observer of type org.apache.solr.rest.schema.analysis.ManagedSynonymGraphFilterFactory to existing ManagedResource /schema/analysis/synonyms/englishgraph
2> 971229 INFO (qtp885513647-18747-null-15730) [n: c: s: r: x:collection1 t:null-15730] o.a.s.c.CoreContainer Reloading SolrCore 'collection1' using configuration from configset /home/jenkins/jenkins-slave/workspace/Solr/Solr-check-9.7/solr/core/build/tmp/tests-tmp/org.apache.solr.core.TestSolrConfigHandler_844C4EAE555D4548-001/tempDir-013/collection1
2> 971252 INFO (qtp885513647-18747-null-15730) [n: c: s: r: x:collection1 t:null-15730] o.a.s.c.SolrCore Opening new SolrCore at [/home/jenkins/jenkins-slave/workspace/Solr/Solr-check-9.7/solr/core/build/tmp/tests-tmp/org.apache.solr.core.TestSolrConfigHandler_844C4EAE555D4548-001/tempDir-015/cores/core], dataDir=[/home/jenkins/jenkins-slave/workspace/Solr/Solr-check-9.7/solr/core/build/tmp/tests-tmp/org.apache.solr.core.TestSolrConfigHandler_844C4EAE555D4548-001/tempDir-015/cores/core/data/]
2> 971255 WARN (qtp885513647-18747-null-15730) [n: c: s: r: x:collection1 t:null-15730] o.a.s.c.RequestHandlers INVALID paramSet a in requestHandler {type = requestHandler,name = /dump,class = DumpRequestHandler,attributes = {initParams=a, name=/dump, registerPath=/solr,/v2, class=DumpRequestHandler},args = {defaults={a=A, b=B}}}
2> 971267 INFO (qtp885513647-18747-null-15730) [n: c: s: r: x:collection1 t:null-15730] o.a.s.u.CommitTracker Hard AutoCommit: disabled
2> 971267 INFO (qtp885513647-18747-null-15730) [n: c: s: r: x:collection1 t:null-15730] o.a.s.u.CommitTracker Soft AutoCommit: disabled
2> 971268 INFO (qtp885513647-18747-null-15730) [n: c: s: r: x:collection1 t:null-15730] o.a.s.r.ManagedResourceStorage File-based storage initialized to use dir: /home/jenkins/jenkins-slave/workspace/Solr/Solr-check-9.7/solr/core/build/tmp/tests-tmp/org.apache.solr.core.TestSolrConfigHandler_844C4EAE555D4548-001/tempDir-013/collection1/conf
2> 971269 INFO (qtp885513647-18747-null-15730) [n: c: s: r: x:collection1 t:null-15730] o.a.s.r.ManagedResourceStorage Loaded LinkedHashMap at path _schema_analysis_stopwords_english.json using file:dir=/home/jenkins/jenkins-slave/workspace/Solr/Solr-check-9.7/solr/core/build/tmp/tests-tmp/org.apache.solr.core.TestSolrConfigHandler_844C4EAE555D4548-001/tempDir-013/collection1/conf
2> 971269 INFO (qtp885513647-18747-null-15730) [n: c: s: r: x:collection1 t:null-15730] o.a.s.r.ManagedResource Loaded initArgs {ignoreCase=false} for /schema/analysis/stopwords/english
2> 971269 INFO (qtp885513647-18747-null-15730) [n: c: s: r: x:collection1 t:null-15730] o.a.s.r.s.a.ManagedWordSetResource Loaded 0 words for /schema/analysis/stopwords/english
2> 971269 INFO (qtp885513647-18747-null-15730) [n: c: s: r: x:collection1 t:null-15730] o.a.s.r.ManagedResource Notified 3 observers of /schema/analysis/stopwords/english
2> 971269 INFO (qtp885513647-18747-null-15730) [n: c: s: r: x:collection1 t:null-15730] o.a.s.r.ManagedResourceStorage Loaded LinkedHashMap at path _schema_analysis_stopwords_german.json using file:dir=/home/jenkins/jenkins-slave/workspace/Solr/Solr-check-9.7/solr/core/build/tmp/tests-tmp/org.apache.solr.core.TestSolrConfigHandler_844C4EAE555D4548-001/tempDir-013/collection1/conf
2> 971269 INFO (qtp885513647-18747-null-15730) [n: c: s: r: x:collection1 t:null-15730] o.a.s.r.ManagedResource Loaded initArgs {ignoreCase=false} for /schema/analysis/stopwords/german
[...truncated too long message...]
ackaging
> Task :solr:modules:scripting:assemblePackaging
> Task :solr:modules:sql:assemblePackaging
> Task :solr:packaging:installFullDist
> Task :solr:packaging:integrationTests
Running BATS tests with Solr base port 43259
1..84
ok 1 assert able to launch solr admin console # in 7663 ms
ok 2 auth rejects blockUnknown option with invalid boolean # in 1920 ms
ok 3 auth rejects updateIncludeFileOnly option with invalid boolean # in 1903 ms
ok 4 auth enable/disable lifecycle # in 15554 ms
ok 5 nothing # in 11 ms
ok 6 create for non cloud mode # in 8411 ms
ok 7 create for cloud mode # in 11398 ms
ok 8 legacy create_collection # in 8414 ms
ok 9 create collection # in 5369 ms
ok 10 create collection using solrUrl # in 7489 ms
ok 11 create collection using legacy solrUrl # in 5250 ms
ok 12 create collection using Zookeeper # in 9805 ms
ok 13 reject d option with invalid config dir # in 2711 ms
ok 14 accept d option with builtin config # in 7602 ms
ok 15 accept d option with explicit path to config # in 5337 ms
ok 16 accept n option as config name # in 6426 ms
ok 17 allow config reuse when n option specifies same config # in 10109 ms
ok 18 create multisharded collections when s provided # in 6414 ms
ok 19 create replicated collections when rf provided # in 8508 ms
ok 20 can delete collections # in 13229 ms
ok 21 can delete collections with solr-url # in 8461 ms
ok 22 collection delete also deletes zk config # in 10829 ms
ok 23 deletes accompanying zk config with nondefault name # in 8628 ms
ok 24 delete-config option can opt to leave config in zk # in 11815 ms
ok 25 SOLR-16755 test works with noprompt # in 23862 ms
ok 26 Check export command # in 20927 ms
ok 27 export fails on non cloud mode # in 10292 ms
ok 28 using curl to extract a single pdf file # in 16778 ms
ok 29 using the bin/solr post tool to extract content from pdf # in 20929 ms
ok 30 using the bin/solr post tool to crawl web site # in 22816 ms
ok 31 healthcheck on cloud solr # in 29321 ms
ok 32 solr help flag prints help # in 847 ms
ok 33 start help flag prints help # in 164 ms
ok 34 stop help flag prints help # in 162 ms
ok 35 restart help flag prints help # in 163 ms
ok 36 status help flag prints help # skip Currently the status -help flag doesn't return nice help text!
ok 37 healthcheck help flag prints help # in 157 ms
ok 38 create help flag prints help # in 848 ms
ok 39 delete help flag prints help # in 840 ms
ok 40 version help flag prints help # in 858 ms
ok 41 zk help flag prints help # in 178 ms
ok 42 auth help flag prints help # in 859 ms
ok 43 assert help flag prints help # in 859 ms
ok 44 post help flag prints help # in 863 ms
ok 45 SQL Module # in 15780 ms
ok 46 Hadoop-Auth Module: KerberosPlugin Classloading # in 19735 ms
ok 47 icu collation in analysis-extras module # in 13132 ms
ok 48 lifecycle of package # in 8864 ms
ok 49 deploying and undeploying a collection level package # in 13666 ms
ok 50 Affinity placement plugin using sysprop # in 18925 ms
ok 51 Random placement plugin using ENV # in 16025 ms
ok 52 Check help command # in 4262 ms
ok 53 basic post with a type specified # in 6028 ms
ok 54 basic post with collection instead of url parameter # in 4451 ms
ok 55 basic post WITHOUT a type specified # in 12015 ms
ok 56 crawling a directory as a dry-run # in 885 ms
ok 57 crawling a directory # in 4529 ms
ok 58 crawling a web site # in 5051 ms
ok 59 skipcommit and optimize and delete # in 4456 ms
ok 60 args mode # in 7884 ms
ok 61 stdin mode # in 3484 ms
ok 62 post solr log into solr via script # in 14858 ms
ok 63 post solr log into solr via cli # in 6780 ms
# starting solr-exporter on 43359
ok 64 should start solr prometheus exporter that scrapes solr for metrics # in 14381 ms
ok 65 allowPaths - backup # in 16001 ms
ok 66 start solr with ssl # in 19858 ms
ok 67 use different hostname when not checking peer-name # in 31298 ms
ok 68 start solr with ssl and auth # in 17851 ms
ok 69 start solr with client truststore and security manager # in 20161 ms
ok 70 start solr with mTLS needed # in 62756 ms
ok 71 start solr with mTLS wanted # in 49847 ms
ok 72 test keystore reload # in 69276 ms
ok 73 SOLR-11740 check 'solr stop' connection # in 14531 ms
ok 74 stop command for single port # in 17091 ms
ok 75 status detects locally running solr # in 7323 ms
ok 76 running subcommands with zk is prevented # in 156 ms
ok 77 listing out files # in 3259 ms
ok 78 connecting to solr via various solr urls and zk hosts # in 10933 ms
ok 79 copying files around # in 10839 ms
ok 80 upconfig # in 3790 ms
ok 81 zkcli.sh gets 'solrhome' from 'solr.home' system property # in 1212 ms
ok 82 zkcli.sh gets 'solrhome' from 'solrhome' command line option # in 1225 ms
ok 83 bin/solr zk cp gets 'solrhome' from '--solr-home' command line option # in 1449 ms
ok 84 Cleanup # in 1255 ms
The slowest tests (exceeding 500 ms) during this run:
60.14s TestRandomCollapseQParserPlugin.testRandomCollapseWithSort (:solr:core)
54.35s LeaderElectionIntegrationTest.testSimpleSliceLeaderElection (:solr:core)
50.44s SyncSliceTest.test (:solr:core)
48.66s ReplicationFactorTest.test (:solr:core)
48.51s TestRangeQuery.testRandomRangeQueries (:solr:core)
46.51s TestRandomFaceting.testRandomFaceting (:solr:core)
44.79s UnloadDistributedZkTest.test (:solr:core)
42.30s PeerSyncReplicationTest.test (:solr:core)
41.44s TestDistributedSearch.test (:solr:core)
40.94s TestRandomDVFaceting.testRandomFaceting (:solr:core)
The slowest suites (exceeding 1s) during this run:
123.60s TestRecovery (:solr:core)
90.85s TestPullReplica (:solr:core)
85.72s TestRangeQuery (:solr:core)
83.19s TestRecoveryHdfs (:solr:modules:hdfs)
82.34s TestCoordinatorRole (:solr:core)
70.86s MultiThreadedOCPTest (:solr:core)
69.49s TestInPlaceUpdatesStandalone (:solr:core)
68.74s TestRandomCollapseQParserPlugin (:solr:core)
60.43s TestCloudConsistency (:solr:core)
57.77s ReindexCollectionTest (:solr:core)
ERROR: The following test(s) have failed:
- org.apache.solr.client.solrj.TestLBHttp2SolrClient.testTwoServers (:solr:solrj)
Test history: https://ge.apache.org/scans/tests?search.rootProjectNames=solr-root&tests.container=org.apache.solr.client.solrj.TestLBHttp2SolrClient&tests.test=testTwoServers http://fucit.org/solr-jenkins-reports/history-trend-of-recent-failures.html#series/org.apache.solr.client.solrj.TestLBHttp2SolrClient.testTwoServers
Test output: /home/jenkins/jenkins-slave/workspace/Solr/Solr-check-9.7/solr/solrj/build/test-results/test/outputs/OUTPUT-org.apache.solr.client.solrj.TestLBHttp2SolrClient.txt
Reproduce with: ./gradlew :solr:solrj:test --tests "org.apache.solr.client.solrj.TestLBHttp2SolrClient.testTwoServers" -Ptests.jvms=4 -Ptests.haltonfailure=false "-Ptests.jvmargs=-XX:TieredStopAtLevel=1 -XX:+UseParallelGC -XX:ActiveProcessorCount=1 -XX:ReservedCodeCacheSize=120m" -Ptests.seed=844C4EAE555D4548 -Ptests.multiplier=2 -Ptests.badapples=false -Ptests.file.encoding=ISO-8859-1
- org.apache.solr.client.solrj.TestLBHttp2SolrClient.testSimple (:solr:solrj)
Test history: https://ge.apache.org/scans/tests?search.rootProjectNames=solr-root&tests.container=org.apache.solr.client.solrj.TestLBHttp2SolrClient&tests.test=testSimple http://fucit.org/solr-jenkins-reports/history-trend-of-recent-failures.html#series/org.apache.solr.client.solrj.TestLBHttp2SolrClient.testSimple
Test output: /home/jenkins/jenkins-slave/workspace/Solr/Solr-check-9.7/solr/solrj/build/test-results/test/outputs/OUTPUT-org.apache.solr.client.solrj.TestLBHttp2SolrClient.txt
Reproduce with: ./gradlew :solr:solrj:test --tests "org.apache.solr.client.solrj.TestLBHttp2SolrClient.testSimple" -Ptests.jvms=4 -Ptests.haltonfailure=false "-Ptests.jvmargs=-XX:TieredStopAtLevel=1 -XX:+UseParallelGC -XX:ActiveProcessorCount=1 -XX:ReservedCodeCacheSize=120m" -Ptests.seed=844C4EAE555D4548 -Ptests.multiplier=2 -Ptests.badapples=false -Ptests.file.encoding=ISO-8859-1
- org.apache.solr.core.TestSolrConfigHandler.testSetPropertyEnableAndDisableCache (:solr:core)
Test history: https://ge.apache.org/scans/tests?search.rootProjectNames=solr-root&tests.container=org.apache.solr.core.TestSolrConfigHandler&tests.test=testSetPropertyEnableAndDisableCache http://fucit.org/solr-jenkins-reports/history-trend-of-recent-failures.html#series/org.apache.solr.core.TestSolrConfigHandler.testSetPropertyEnableAndDisableCache
Test output: /home/jenkins/jenkins-slave/workspace/Solr/Solr-check-9.7/solr/core/build/test-results/test/outputs/OUTPUT-org.apache.solr.core.TestSolrConfigHandler.txt
Reproduce with: ./gradlew :solr:core:test --tests "org.apache.solr.core.TestSolrConfigHandler.testSetPropertyEnableAndDisableCache" -Ptests.jvms=4 -Ptests.haltonfailure=false "-Ptests.jvmargs=-XX:TieredStopAtLevel=1 -XX:+UseParallelGC -XX:ActiveProcessorCount=1 -XX:ReservedCodeCacheSize=120m" -Ptests.seed=844C4EAE555D4548 -Ptests.multiplier=2 -Ptests.badapples=false -Ptests.file.encoding=ISO-8859-1
Deprecated Gradle features were used in this build, making it incompatible with Gradle 9.0.
You can use '--warning-mode all' to show the individual deprecation warnings and determine if they come from your own scripts or plugins.
For more on this, please refer to https://docs.gradle.org/8.4/userguide/command_line_interface.html#sec:command_line_warnings in the Gradle documentation.
BUILD SUCCESSFUL in 1h 8m 13s
694 actionable tasks: 694 executed
Publishing build scan...
https://ge.apache.org/s/b2m2lbokb5n64
Build step 'Invoke Gradle script' changed build result to SUCCESS
Archiving artifacts
‘**/*.events’ doesn’t match anything: ‘**’ exists but not ‘**/*.events’
No artifacts found that match the file pattern "**/*.events,heapdumps/**,**/hs_err_pid*". Configuration error?
Recording test results
[Checks API] No suitable checks publisher found.
Build step 'Publish JUnit test result report' changed build result to UNSTABLE
Email was triggered for: Unstable (Test Failures)
Sending email for trigger: Unstable (Test Failures)